ltx/en_uk_lash/le.pr.me.r23:leprVE.reading.book_abbr	@ltx/en_uk_lash/bible:Isaiah.abbr
ltx/en_uk_lash/le.pr.me.r23:leprVE.reading.book_string	@ltx/en_uk_lash/bible:Isaiah.text
ltx/en_uk_lash/le.pr.me.r23:leprVE.reading.chapverse	[55,1-13]
ltx/en_uk_lash/le.pr.me.r23:leprVE.reading.text	Thus says the Lord: You that thirst, go for water. And as many of you as have no money, make your way and buy. And eat and drink wine and fat without money and price. Why do you spend money on what is not food, and toil for what does not satisfy? Hear me, and eat what is good, and your soul will delight in good things. Give heed with your ears and follow in my ways. Listen to me and your soul will live among good things. And I will make an eternal Covenant with you, the sure mercies of David. See, I have given him as a testimony among the Nations, a ruler and commander among the Nations. See, Nations who do not know you will call upon you, and peoples who are not acquainted with you will take refuge with you, for the sake of the Lord your God and the Holy One of Israel, because he has glorified you. Seek the Lord, and when you find him, call upon him. But when he comes near you, let the impious abandon his ways and a lawless man his plans. And return to the Lord and you will find mercy, and cry out, for he will abundantly forgive your sins. For my plans are not like your plans, nor are my ways like your ways, says the Lord. But as far as heaven is from earth, so far is my way from your ways and your thoughts from my mind. For as rain or snow comes down from heaven and does not return until it has saturated the earth and it brings forth and sprouts and gives seed to the sower and bread for food, so will my word be. Whatever comes out of my mouth will not return to me empty, until everything that I wished has been fulfilled. And I will make my ways and my commands prosper. You will go out with gladness and be taught with joy. For the mountains and hills will leap up, welcoming you with joy, and all the trees of the field will clap with their branches. And instead of brambles cypress will come up, and instead of nettles myrtle will come up. And there shall be for the Lord a name and an everlasting sign, and it will not fail.
ltx/en_uk_lash/le.pr.me.r23:leprVE.reading.title	
ltx/en_uk_lash/le.pr.me.r23:leprVE.reading.version	@ltx/en_uk_lash/properties:version.designation
