ltx/en_uk_lash/tr.d043:trCO.header	
ltx/en_uk_lash/tr.d043:trDA.commemoration.full	THE THIRD SUNDAY IN LENT - THE ADORATION OF THE PRECIOUS AND LIFE-GIVING CROSS
ltx/en_uk_lash/tr.d043:trDA.commemoration.short	The Third Sunday in Lent - The Adoration of the Cross
ltx/en_uk_lash/tr.d043:trDA.dismissal	@ltx/en_uk_lash/dismissals:dis00.resurrection
ltx/en_uk_lash/tr.d043:trDA.insert1	
ltx/en_uk_lash/tr.d043:trDA.insert2	
ltx/en_uk_lash/tr.d043:trDA.note	
ltx/en_uk_lash/tr.d043:trDA.title	
ltx/en_uk_lash/tr.d043:trHO.commemorations	
ltx/en_uk_lash/tr.d043:trHO.daytitle	
ltx/en_uk_lash/tr.d043:trHO.description1	
ltx/en_uk_lash/tr.d043:trHO.description2	
ltx/en_uk_lash/tr.d043:trHO.note1	
ltx/en_uk_lash/tr.d043:trHO.note2	
ltx/en_uk_lash/tr.d043:trLI.AfterCommunion.incipit	@ltx/en_uk_lash/tr.d043:trVE.Apolytikion1.incipit
ltx/en_uk_lash/tr.d043:trLI.AfterCommunion.mode	@ltx/en_uk_lash/miscellanea:misc.Mode1
ltx/en_uk_lash/tr.d043:trLI.AfterCommunion.text	@ltx/en_uk_lash/tr.d043:trVE.Apolytikion1.text
ltx/en_uk_lash/tr.d043:trLI.Kontakion1.incipit	@ltx/en_uk_lash/tr.d043:trMA.Kontakion1.incipit
ltx/en_uk_lash/tr.d043:trLI.Kontakion1.melody	@ltx/en_uk_lash/tr.d043:trMA.Kontakion1.melody
ltx/en_uk_lash/tr.d043:trLI.Kontakion1.mode	@ltx/en_uk_lash/tr.d043:trMA.Kontakion1.mode
ltx/en_uk_lash/tr.d043:trLI.Kontakion1.text	@ltx/en_uk_lash/tr.d043:trMA.Kontakion1.text
ltx/en_uk_lash/tr.d043:trLI.MM.CommunionHymn.text	@ltx/en_uk_lash/properties:media.key
ltx/en_uk_lash/tr.d043:trLI.MM.EntranceHymn.text	@ltx/en_uk_lash/properties:media.key
ltx/en_uk_lash/tr.d043:trLI.Megalynarion.text	
ltx/en_uk_lash/tr.d043:trLI.TheotokosHymn.incipit	@ltx/en_uk_lash/oc.m8.d1:ocMA.Kathisma23.incipit
ltx/en_uk_lash/tr.d043:trLI.TheotokosHymn.mode	@ltx/en_uk_lash/miscellanea:misc.Mode8
ltx/en_uk_lash/tr.d043:trLI.TheotokosHymn.text	@ltx/en_uk_lash/oc.m8.d1:ocMA.Kathisma23.text
ltx/en_uk_lash/tr.d043:trMA.AdditionalIdiomelon1.incipit	…
ltx/en_uk_lash/tr.d043:trMA.AdditionalIdiomelon1.melody	@ltx/en_uk_lash/miscellanea:misc.Idiomelon
ltx/en_uk_lash/tr.d043:trMA.AdditionalIdiomelon1.mode	@ltx/en_uk_lash/miscellanea:misc.Mode2
ltx/en_uk_lash/tr.d043:trMA.AdditionalIdiomelon1.poet	@ltx/en_uk_lash/poets:po.LeontosDespotou
ltx/en_uk_lash/tr.d043:trMA.AdditionalIdiomelon1.text	
ltx/en_uk_lash/tr.d043:trMA.AdditionalIdiomelon2.incipit	…
ltx/en_uk_lash/tr.d043:trMA.AdditionalIdiomelon2.melody	@ltx/en_uk_lash/miscellanea:misc.Idiomelon
ltx/en_uk_lash/tr.d043:trMA.AdditionalIdiomelon2.mode	@ltx/en_uk_lash/miscellanea:misc.Mode8
ltx/en_uk_lash/tr.d043:trMA.AdditionalIdiomelon2.text	
ltx/en_uk_lash/tr.d043:trMA.AdditionalIdiomelonBoth.incipit	@ltx/en_uk_lash/oc.m6.d4:ocMA.Kathisma21.incipit
ltx/en_uk_lash/tr.d043:trMA.AdditionalIdiomelonBoth.melody	
ltx/en_uk_lash/tr.d043:trMA.AdditionalIdiomelonBoth.mode	@ltx/en_uk_lash/miscellanea:misc.Mode6
ltx/en_uk_lash/tr.d043:trMA.AdditionalIdiomelonBoth.text	@ltx/en_uk_lash/oc.m6.d4:ocMA.Kathisma21.text
ltx/en_uk_lash/tr.d043:trMA.AdditionalIdiomelonGlory.incipit	…
ltx/en_uk_lash/tr.d043:trMA.AdditionalIdiomelonGlory.melody	@ltx/en_uk_lash/miscellanea:misc.Idiomelon
ltx/en_uk_lash/tr.d043:trMA.AdditionalIdiomelonGlory.mode	@ltx/en_uk_lash/miscellanea:misc.Mode8
ltx/en_uk_lash/tr.d043:trMA.AdditionalIdiomelonGlory.text	
ltx/en_uk_lash/tr.d043:trMA.C1.poet	@ltx/en_uk_lash/poets:po.TheodorouTouStouditou
ltx/en_uk_lash/tr.d043:trMA.C1.title	
ltx/en_uk_lash/tr.d043:trMA.C1.verse	
ltx/en_uk_lash/tr.d043:trMA.ExapTheotokion.greekmelody	@ltx/en_uk_lash/he.a.m2:heAU.ToisMathitaisSynelthomen.greekname
ltx/en_uk_lash/tr.d043:trMA.ExapTheotokion.incipit	All-hallowed Lady, with true devotion…
ltx/en_uk_lash/tr.d043:trMA.ExapTheotokion.melody	@ltx/en_uk_lash/he.a.m2:heAU.ToisMathitaisSynelthomen.notmetered
ltx/en_uk_lash/tr.d043:trMA.ExapTheotokion.mode	@ltx/en_uk_lash/miscellanea:misc.Mode2
ltx/en_uk_lash/tr.d043:trMA.ExapTheotokion.text	All-hallowed Lady, with true devotion now we venerate the Wood on which your Son stretched out his most pure hands and for our sakes was nailed. Give us peace and grant that we may come to the Holy Passion that has saved the world; and may we worship at the radiant Festival of Easter, the Lord''s Day that brings light and joy to all creation.
ltx/en_uk_lash/tr.d043:trMA.Exaposteilarion1.greekmelody	@ltx/en_uk_lash/he.a.m2:heAU.ToisMathitaisSynelthomen.greekname
ltx/en_uk_lash/tr.d043:trMA.Exaposteilarion1.incipit	Seeing the Precious Cross of…
ltx/en_uk_lash/tr.d043:trMA.Exaposteilarion1.melody	@ltx/en_uk_lash/he.a.m2:heAU.ToisMathitaisSynelthomen.notmetered
ltx/en_uk_lash/tr.d043:trMA.Exaposteilarion1.mode	@ltx/en_uk_lash/miscellanea:misc.Mode2
ltx/en_uk_lash/tr.d043:trMA.Exaposteilarion1.text	Seeing the Precious Cross of Christ placed this day before us, let us venerate it and rejoice in faith; with love let us greet the Lord who by his own free choice was crucified upon it, asking he to grant us all uncondemned to adore his Holy Passion and to attain the Resurrection.
ltx/en_uk_lash/tr.d043:trMA.Kathisma31.greekmelody	@ltx/en_uk_lash/he.a.m8:heAU.ToProstachthen.greekname
ltx/en_uk_lash/tr.d043:trMA.Kathisma31.incipit	In Paradise of old the…
ltx/en_uk_lash/tr.d043:trMA.Kathisma31.melody	@ltx/en_uk_lash/he.a.m8:heAU.ToProstachthen.notmetered
ltx/en_uk_lash/tr.d043:trMA.Kathisma31.mode	@ltx/en_uk_lash/miscellanea:misc.Mode8
ltx/en_uk_lash/tr.d043:trMA.Kathisma31.text	In Paradise of old the enemy stripped me naked by a tree, for by my tasting it he brought in death. But now the Tree of the Cross, that bears the clothing of life for mortals, has been fixed on the earth, and the whole world filled with every joy. Seeing it worshipped, you peoples, let us with one accord raise our cry to God with faith, ''His house is full of glory!''
ltx/en_uk_lash/tr.d043:trMA.Kontakion1.incipit	The sword of flame no…
ltx/en_uk_lash/tr.d043:trMA.Kontakion1.melody	@ltx/en_uk_lash/miscellanea:misc.AutomelonNotMetered
ltx/en_uk_lash/tr.d043:trMA.Kontakion1.mode	@ltx/en_uk_lash/miscellanea:misc.Mode7
ltx/en_uk_lash/tr.d043:trMA.Kontakion1.text	The sword of flame no longer guards the gate of Eden, / For a strange bond came upon it: the wood of the Cross. / The sting of Death and the victory of Hell were nailed to it. / But you appeared, my Saviour, crying to those in Hell: / ''Be brought back / Again to Paradise''.
ltx/en_uk_lash/tr.d043:trMA.Lauds1.greekmelody	@ltx/en_uk_lash/he.a.m4:heAU.OsGennaionEnMartysi.greekname
ltx/en_uk_lash/tr.d043:trMA.Lauds1.incipit	With our voices let us…
ltx/en_uk_lash/tr.d043:trMA.Lauds1.melody	@ltx/en_uk_lash/he.a.m4:heAU.OsGennaionEnMartysi.notmetered
ltx/en_uk_lash/tr.d043:trMA.Lauds1.mode	@ltx/en_uk_lash/miscellanea:misc.Mode4
ltx/en_uk_lash/tr.d043:trMA.Lauds1.text	With our voices let us shout and magnify in songs the Precious Cross; let us kiss it and cry out: O honoured Cross, sanctify our souls and bodies by your power, and keep unharmed from all malice of the enemy those who venerate you with true reverence.
ltx/en_uk_lash/tr.d043:trMA.Lauds2.incipit	Approach and draw waters that…
ltx/en_uk_lash/tr.d043:trMA.Lauds2.melody	@ltx/en_uk_lash/he.a.m4:heAU.OsGennaionEnMartysi.notmetered
ltx/en_uk_lash/tr.d043:trMA.Lauds2.mode	@ltx/en_uk_lash/miscellanea:misc.Mode4
ltx/en_uk_lash/tr.d043:trMA.Lauds2.text	Approach and draw waters that shall never fail, flowing from the grace of the Cross. See now set before you the holy Wood, source of divine gifts, on which there fell blood and water from the wounded side of the Lord of all. Of his own will he was raised upon the Cross, and with Himself he raised up mortal man.
ltx/en_uk_lash/tr.d043:trMA.Lauds3.incipit	O honoured Cross, you are…
ltx/en_uk_lash/tr.d043:trMA.Lauds3.melody	@ltx/en_uk_lash/he.a.m4:heAU.OsGennaionEnMartysi.notmetered
ltx/en_uk_lash/tr.d043:trMA.Lauds3.mode	@ltx/en_uk_lash/miscellanea:misc.Mode4
ltx/en_uk_lash/tr.d043:trMA.Lauds3.text	O honoured Cross, you are the firm foundation of the Church, the strength of kings the glory and defence of monks. Venerating you today, we are filled with light in heart and soul, through the divine grace of the Lord who was nailed upon you and overthrew the power of our deceitful enemy, bringing the curse to naught.
ltx/en_uk_lash/tr.d043:trMA.LaudsGlory.incipit	The Lord of all has…
ltx/en_uk_lash/tr.d043:trMA.LaudsGlory.melody	@ltx/en_uk_lash/miscellanea:misc.Idiomelon
ltx/en_uk_lash/tr.d043:trMA.LaudsGlory.mode	@ltx/en_uk_lash/miscellanea:misc.Mode8
ltx/en_uk_lash/tr.d043:trMA.LaudsGlory.text	The Lord of all has taught us in a parable to shun the boastful thoughts of the evil Pharisees; and he has instructed all of us not to think more highly than we should. He himself became our pattern and example, for he emptied himself even unto death upon the Cross. Let us therefore render thanks with the Publican and say: O God who suffered for us and yet remained impassible, deliver us from the passions and save our souls.
ltx/en_uk_lash/tr.d043:trMA.LaudsTheotokion.incipit	@ltx/en_uk_lash/oc.m2.d1:ocMA.Kathisma23.incipit
ltx/en_uk_lash/tr.d043:trMA.LaudsTheotokion.melody	
ltx/en_uk_lash/tr.d043:trMA.LaudsTheotokion.mode	
ltx/en_uk_lash/tr.d043:trMA.LaudsTheotokion.text	@ltx/en_uk_lash/oc.m2.d1:ocMA.Kathisma23.text
ltx/en_uk_lash/tr.d043:trMA.Ode1C11.greekmelody	@ltx/en_uk_lash/he.h.m1:heHE.AnastaseosImera.greekname
ltx/en_uk_lash/tr.d043:trMA.Ode1C11.incipit	A day of festival! At…
ltx/en_uk_lash/tr.d043:trMA.Ode1C11.melody	@ltx/en_uk_lash/he.h.m1:heHE.AnastaseosImera.name
ltx/en_uk_lash/tr.d043:trMA.Ode1C11.mode	@ltx/en_uk_lash/miscellanea:misc.Mode1
ltx/en_uk_lash/tr.d043:trMA.Ode1C11.ode	@ltx/en_uk_lash/miscellanea:misc.Ode1
ltx/en_uk_lash/tr.d043:trMA.Ode1C11.text	A day of festival! At Christ''s Rising, death has fled away and the light of life has dawned. Adam has arisen and dances for joy. Therefore let us cry aloud as we sing a song of victory.
ltx/en_uk_lash/tr.d043:trMA.Ode1C12.incipit	A day of worship of…
ltx/en_uk_lash/tr.d043:trMA.Ode1C12.melody	@ltx/en_uk_lash/he.h.m1:heHE.AnastaseosImera.name
ltx/en_uk_lash/tr.d043:trMA.Ode1C12.mode	@ltx/en_uk_lash/miscellanea:misc.Mode1
ltx/en_uk_lash/tr.d043:trMA.Ode1C12.ode	@ltx/en_uk_lash/miscellanea:misc.Ode1
ltx/en_uk_lash/tr.d043:trMA.Ode1C12.text	A day of worship of the Precious Cross! Come, let all approach it! For now it is set forth, shining with the bright beams of Christ''s Rising. Let us kiss it, as we rejoice in soul.
ltx/en_uk_lash/tr.d043:trMA.Ode1C13.incipit	Great Cross of the Lord…
ltx/en_uk_lash/tr.d043:trMA.Ode1C13.melody	@ltx/en_uk_lash/he.h.m1:heHE.AnastaseosImera.name
ltx/en_uk_lash/tr.d043:trMA.Ode1C13.mode	@ltx/en_uk_lash/miscellanea:misc.Mode1
ltx/en_uk_lash/tr.d043:trMA.Ode1C13.ode	@ltx/en_uk_lash/miscellanea:misc.Ode1
ltx/en_uk_lash/tr.d043:trMA.Ode1C13.text	Great Cross of the Lord, appear! Show me now the divine vision of your beauty, and make me your worthy worshipper. For I address you and embrace you as though you were alive.
ltx/en_uk_lash/tr.d043:trMA.Ode1C14.incipit	Let heaven and earth give…
ltx/en_uk_lash/tr.d043:trMA.Ode1C14.melody	@ltx/en_uk_lash/he.h.m1:heHE.AnastaseosImera.name
ltx/en_uk_lash/tr.d043:trMA.Ode1C14.mode	@ltx/en_uk_lash/miscellanea:misc.Mode1
ltx/en_uk_lash/tr.d043:trMA.Ode1C14.ode	@ltx/en_uk_lash/miscellanea:misc.Ode1
ltx/en_uk_lash/tr.d043:trMA.Ode1C14.text	Let heaven and earth give praise with one accord, for the all-blessed Cross, on which Christ, nailed in the body, was sacrificed, is now set forth for all. Let us kiss it as we rejoice in soul.
ltx/en_uk_lash/tr.d043:trMA.Ode1C1T.incipit	Virgin who did not know…
ltx/en_uk_lash/tr.d043:trMA.Ode1C1T.melody	@ltx/en_uk_lash/he.h.m1:heHE.AnastaseosImera.name
ltx/en_uk_lash/tr.d043:trMA.Ode1C1T.mode	@ltx/en_uk_lash/miscellanea:misc.Mode1
ltx/en_uk_lash/tr.d043:trMA.Ode1C1T.ode	@ltx/en_uk_lash/miscellanea:misc.Ode1
ltx/en_uk_lash/tr.d043:trMA.Ode1C1T.text	Virgin who did not know man, you give birth to an infant without seed and the Offspring you bear is the Maker of all things, Christ our God. Entreat him to grant the whole universe peace.
ltx/en_uk_lash/tr.d043:trMA.Ode1C1Tr.incipit	O Trinity in Persons, O…
ltx/en_uk_lash/tr.d043:trMA.Ode1C1Tr.melody	@ltx/en_uk_lash/he.h.m1:heHE.AnastaseosImera.name
ltx/en_uk_lash/tr.d043:trMA.Ode1C1Tr.mode	@ltx/en_uk_lash/miscellanea:misc.Mode1
ltx/en_uk_lash/tr.d043:trMA.Ode1C1Tr.ode	@ltx/en_uk_lash/miscellanea:misc.Ode1
ltx/en_uk_lash/tr.d043:trMA.Ode1C1Tr.text	O Trinity in Persons, O Unity in Essence, Father, Son and Spirit, equal in power, Unity in purpose and will, dominion and rule, watch over your world and crown it with peace.
ltx/en_uk_lash/tr.d043:trMA.Ode3C11.greekmelody	@ltx/en_uk_lash/he.h.m1:heHE.DeftePomaPiomen.greekname
ltx/en_uk_lash/tr.d043:trMA.Ode3C11.incipit	Come, let us sing a…
ltx/en_uk_lash/tr.d043:trMA.Ode3C11.melody	@ltx/en_uk_lash/he.h.m1:heHE.DeftePomaPiomen.name
ltx/en_uk_lash/tr.d043:trMA.Ode3C11.mode	@ltx/en_uk_lash/miscellanea:misc.Mode1
ltx/en_uk_lash/tr.d043:trMA.Ode3C11.ode	@ltx/en_uk_lash/miscellanea:misc.Ode3
ltx/en_uk_lash/tr.d043:trMA.Ode3C11.text	Come, let us sing a new song, as we celebrate the overthrow of Hell, for Christ has risen from the tomb; capturing death, and saving the whole universe.
ltx/en_uk_lash/tr.d043:trMA.Ode3C12.incipit	Come, believers, let us drink…
ltx/en_uk_lash/tr.d043:trMA.Ode3C12.melody	@ltx/en_uk_lash/he.h.m1:heHE.DeftePomaPiomen.name
ltx/en_uk_lash/tr.d043:trMA.Ode3C12.mode	@ltx/en_uk_lash/miscellanea:misc.Mode1
ltx/en_uk_lash/tr.d043:trMA.Ode3C12.ode	@ltx/en_uk_lash/miscellanea:misc.Ode3
ltx/en_uk_lash/tr.d043:trMA.Ode3C12.text	Come, believers, let us drink, not from a well that gushes water that perishes, but from the source of enlightenment, as we worship the Cross of Christ, in which we boast.
ltx/en_uk_lash/tr.d043:trMA.Ode3C13.incipit	As with our hands we…
ltx/en_uk_lash/tr.d043:trMA.Ode3C13.melody	@ltx/en_uk_lash/he.h.m1:heHE.DeftePomaPiomen.name
ltx/en_uk_lash/tr.d043:trMA.Ode3C13.mode	@ltx/en_uk_lash/miscellanea:misc.Mode1
ltx/en_uk_lash/tr.d043:trMA.Ode3C13.ode	@ltx/en_uk_lash/miscellanea:misc.Ode3
ltx/en_uk_lash/tr.d043:trMA.Ode3C13.text	As with our hands we now embrace your Cross, which Moses of old prefigured with his outstretched arms, the invisible Amalek we put to flight, Christ our Master, through whom we shall be saved.
ltx/en_uk_lash/tr.d043:trMA.Ode3C14.incipit	Believers, with pure eyes and…
ltx/en_uk_lash/tr.d043:trMA.Ode3C14.melody	@ltx/en_uk_lash/he.h.m1:heHE.DeftePomaPiomen.name
ltx/en_uk_lash/tr.d043:trMA.Ode3C14.mode	@ltx/en_uk_lash/miscellanea:misc.Mode1
ltx/en_uk_lash/tr.d043:trMA.Ode3C14.ode	@ltx/en_uk_lash/miscellanea:misc.Ode3
ltx/en_uk_lash/tr.d043:trMA.Ode3C14.text	Believers, with pure eyes and lips let us worship in joy the Cross of the Lord, as we raise a song of exultation.
ltx/en_uk_lash/tr.d043:trMA.Ode3C1T.incipit	In days of old Moses…
ltx/en_uk_lash/tr.d043:trMA.Ode3C1T.melody	@ltx/en_uk_lash/he.h.m1:heHE.DeftePomaPiomen.name
ltx/en_uk_lash/tr.d043:trMA.Ode3C1T.mode	@ltx/en_uk_lash/miscellanea:misc.Mode1
ltx/en_uk_lash/tr.d043:trMA.Ode3C1T.ode	@ltx/en_uk_lash/miscellanea:misc.Ode3
ltx/en_uk_lash/tr.d043:trMA.Ode3C1T.text	In days of old Moses saw your mystery prefigured in the bush, holy Virgin: for as the flames did not consume it, so the fire of the Godhead did not consume your womb.
ltx/en_uk_lash/tr.d043:trMA.Ode3C1Tr.incipit	I honour one God without…
ltx/en_uk_lash/tr.d043:trMA.Ode3C1Tr.melody	@ltx/en_uk_lash/he.h.m1:heHE.DeftePomaPiomen.name
ltx/en_uk_lash/tr.d043:trMA.Ode3C1Tr.mode	@ltx/en_uk_lash/miscellanea:misc.Mode1
ltx/en_uk_lash/tr.d043:trMA.Ode3C1Tr.ode	@ltx/en_uk_lash/miscellanea:misc.Ode3
ltx/en_uk_lash/tr.d043:trMA.Ode3C1Tr.text	I honour one God without beginning, in three Persons but undivided in Essence, the Father, the Son and the living Spirit, in whose Name we have been baptized.
ltx/en_uk_lash/tr.d043:trMA.Ode3Kathisma1.incipit	@ltx/en_uk_lash/oc.m6.d4:ocMA.Kathisma22.incipit
ltx/en_uk_lash/tr.d043:trMA.Ode3Kathisma1.melody	
ltx/en_uk_lash/tr.d043:trMA.Ode3Kathisma1.mode	@ltx/en_uk_lash/miscellanea:misc.Mode6
ltx/en_uk_lash/tr.d043:trMA.Ode3Kathisma1.text	@ltx/en_uk_lash/oc.m6.d4:ocMA.Kathisma22.text
ltx/en_uk_lash/tr.d043:trMA.Ode3Kathisma2.incipit	@ltx/en_uk_lash/oc.m6.d4:ocMA.Kathisma21.incipit
ltx/en_uk_lash/tr.d043:trMA.Ode3Kathisma2.melody	
ltx/en_uk_lash/tr.d043:trMA.Ode3Kathisma2.mode	@ltx/en_uk_lash/miscellanea:misc.Mode6
ltx/en_uk_lash/tr.d043:trMA.Ode3Kathisma2.text	@ltx/en_uk_lash/oc.m6.d4:ocMA.Kathisma21.text
ltx/en_uk_lash/tr.d043:trMA.Ode3Kathisma3.incipit	@ltx/en_uk_lash/oc.m6.d4:ocMA.Kathisma11.incipit
ltx/en_uk_lash/tr.d043:trMA.Ode3Kathisma3.melody	
ltx/en_uk_lash/tr.d043:trMA.Ode3Kathisma3.mode	@ltx/en_uk_lash/miscellanea:misc.Mode6
ltx/en_uk_lash/tr.d043:trMA.Ode3Kathisma3.text	@ltx/en_uk_lash/oc.m6.d4:ocMA.Kathisma11.text
ltx/en_uk_lash/tr.d043:trMA.Ode3Kathisma4.incipit	@ltx/en_uk_lash/oc.m6.d1:ocMA.Kathisma23.incipit
ltx/en_uk_lash/tr.d043:trMA.Ode3Kathisma4.melody	
ltx/en_uk_lash/tr.d043:trMA.Ode3Kathisma4.mode	@ltx/en_uk_lash/miscellanea:misc.Mode6
ltx/en_uk_lash/tr.d043:trMA.Ode3Kathisma4.text	@ltx/en_uk_lash/oc.m6.d1:ocMA.Kathisma23.text
ltx/en_uk_lash/tr.d043:trMA.Ode4C11.greekmelody	@ltx/en_uk_lash/he.h.m1:heHE.EpiTisTheiasFylakis.greekname
ltx/en_uk_lash/tr.d043:trMA.Ode4C11.incipit	See, Christ has risen'', said…
ltx/en_uk_lash/tr.d043:trMA.Ode4C11.melody	@ltx/en_uk_lash/he.h.m1:heHE.EpiTisTheiasFylakis.name
ltx/en_uk_lash/tr.d043:trMA.Ode4C11.mode	@ltx/en_uk_lash/miscellanea:misc.Mode1
ltx/en_uk_lash/tr.d043:trMA.Ode4C11.ode	@ltx/en_uk_lash/miscellanea:misc.Ode4
ltx/en_uk_lash/tr.d043:trMA.Ode4C11.text	See, Christ has risen'', said the Angel to the Myrrhbearing Women, ''Do not lament, but go, say to the Apostles, ''Rejoice, today is the salvation of the world; for by death the tyranny of the enemy has been destroyed.''
ltx/en_uk_lash/tr.d043:trMA.Ode4C12.incipit	As we celebrate today the…
ltx/en_uk_lash/tr.d043:trMA.Ode4C12.melody	@ltx/en_uk_lash/he.h.m1:heHE.EpiTisTheiasFylakis.name
ltx/en_uk_lash/tr.d043:trMA.Ode4C12.mode	@ltx/en_uk_lash/miscellanea:misc.Mode1
ltx/en_uk_lash/tr.d043:trMA.Ode4C12.ode	@ltx/en_uk_lash/miscellanea:misc.Ode4
ltx/en_uk_lash/tr.d043:trMA.Ode4C12.text	As we celebrate today the joyful worship of your life-bearing Cross, O Christ, we prepare ourselves for your most holy Passion; for you achieved it for the salvation of the world, O Saviour, as all-powerful.
ltx/en_uk_lash/tr.d043:trMA.Ode4C13.incipit	Today there is joy in…
ltx/en_uk_lash/tr.d043:trMA.Ode4C13.melody	@ltx/en_uk_lash/he.h.m1:heHE.EpiTisTheiasFylakis.name
ltx/en_uk_lash/tr.d043:trMA.Ode4C13.mode	@ltx/en_uk_lash/miscellanea:misc.Mode1
ltx/en_uk_lash/tr.d043:trMA.Ode4C13.ode	@ltx/en_uk_lash/miscellanea:misc.Ode4
ltx/en_uk_lash/tr.d043:trMA.Ode4C13.text	Today there is joy in heaven and on earth, for the sign of the Cross is made manifest to the world. The thrice-blessed Cross is set before us, and to all who worship it it is a fount of ever-flowing grace.
ltx/en_uk_lash/tr.d043:trMA.Ode4C14.incipit	What shall we offer you…
ltx/en_uk_lash/tr.d043:trMA.Ode4C14.melody	@ltx/en_uk_lash/he.h.m1:heHE.EpiTisTheiasFylakis.name
ltx/en_uk_lash/tr.d043:trMA.Ode4C14.mode	@ltx/en_uk_lash/miscellanea:misc.Mode1
ltx/en_uk_lash/tr.d043:trMA.Ode4C14.ode	@ltx/en_uk_lash/miscellanea:misc.Ode4
ltx/en_uk_lash/tr.d043:trMA.Ode4C14.text	What shall we offer you, O Christ? For you have given us your Precious Cross to worship, on which your all-holy Blood was poured out, and to which your flesh was fixed by nails. As with love we kiss it we give you thanks.
ltx/en_uk_lash/tr.d043:trMA.Ode4C1T.incipit	You alone among women, pure…
ltx/en_uk_lash/tr.d043:trMA.Ode4C1T.melody	@ltx/en_uk_lash/he.h.m1:heHE.EpiTisTheiasFylakis.name
ltx/en_uk_lash/tr.d043:trMA.Ode4C1T.mode	@ltx/en_uk_lash/miscellanea:misc.Mode1
ltx/en_uk_lash/tr.d043:trMA.Ode4C1T.ode	@ltx/en_uk_lash/miscellanea:misc.Ode4
ltx/en_uk_lash/tr.d043:trMA.Ode4C1T.text	You alone among women, pure Lady, were revealed as a marvellous and fearful thing. For you made nature new, conceiving without seed and still remaining as before a virgin; for the one born from you is true God.
ltx/en_uk_lash/tr.d043:trMA.Ode4C1Tr.incipit	I sing the praises of…
ltx/en_uk_lash/tr.d043:trMA.Ode4C1Tr.melody	@ltx/en_uk_lash/he.h.m1:heHE.EpiTisTheiasFylakis.name
ltx/en_uk_lash/tr.d043:trMA.Ode4C1Tr.mode	@ltx/en_uk_lash/miscellanea:misc.Mode1
ltx/en_uk_lash/tr.d043:trMA.Ode4C1Tr.ode	@ltx/en_uk_lash/miscellanea:misc.Ode4
ltx/en_uk_lash/tr.d043:trMA.Ode4C1Tr.text	I sing the praises of the three Persons in one Godhead, one simple Nature undivided, as I proclaim: Father without beginning, Son and Holy Spirit, equal in throne, one lordship, equal Kingship, one everlasting Might.
ltx/en_uk_lash/tr.d043:trMA.Ode5C11.greekmelody	@ltx/en_uk_lash/he.h.m1:heHE.OrthrisomenOrthrouVatheos.greekname
ltx/en_uk_lash/tr.d043:trMA.Ode5C11.incipit	You dawned form the tomb…
ltx/en_uk_lash/tr.d043:trMA.Ode5C11.melody	@ltx/en_uk_lash/he.h.m1:heHE.OrthrisomenOrthrouVatheos.name
ltx/en_uk_lash/tr.d043:trMA.Ode5C11.mode	@ltx/en_uk_lash/miscellanea:misc.Mode1
ltx/en_uk_lash/tr.d043:trMA.Ode5C11.ode	@ltx/en_uk_lash/miscellanea:misc.Ode5
ltx/en_uk_lash/tr.d043:trMA.Ode5C11.text	You dawned form the tomb, O Light that never sets, and made incorruption blaze forth on the world. In your compassion you banished the darkness of death from the ends of the earth.
ltx/en_uk_lash/tr.d043:trMA.Ode5C12.incipit	Cleansed by self-mastery, let us…
ltx/en_uk_lash/tr.d043:trMA.Ode5C12.melody	@ltx/en_uk_lash/he.h.m1:heHE.OrthrisomenOrthrouVatheos.name
ltx/en_uk_lash/tr.d043:trMA.Ode5C12.mode	@ltx/en_uk_lash/miscellanea:misc.Mode1
ltx/en_uk_lash/tr.d043:trMA.Ode5C12.ode	@ltx/en_uk_lash/miscellanea:misc.Ode5
ltx/en_uk_lash/tr.d043:trMA.Ode5C12.text	Cleansed by self-mastery, let us draw near, as with praise we fervently embrace the all-holy Tree on which Christ crucified saved the world in his compassion.
ltx/en_uk_lash/tr.d043:trMA.Ode5C13.incipit	Today the ranks of angels…
ltx/en_uk_lash/tr.d043:trMA.Ode5C13.melody	@ltx/en_uk_lash/he.h.m1:heHE.OrthrisomenOrthrouVatheos.name
ltx/en_uk_lash/tr.d043:trMA.Ode5C13.mode	@ltx/en_uk_lash/miscellanea:misc.Mode1
ltx/en_uk_lash/tr.d043:trMA.Ode5C13.ode	@ltx/en_uk_lash/miscellanea:misc.Ode5
ltx/en_uk_lash/tr.d043:trMA.Ode5C13.text	Today the ranks of angels dance with gladness at the worship of your Cross. For through it you shattered the regiments of devils, O Christ, so saving humankind.
ltx/en_uk_lash/tr.d043:trMA.Ode5C14.incipit	The Church has been revealed…
ltx/en_uk_lash/tr.d043:trMA.Ode5C14.melody	@ltx/en_uk_lash/he.h.m1:heHE.OrthrisomenOrthrouVatheos.name
ltx/en_uk_lash/tr.d043:trMA.Ode5C14.mode	@ltx/en_uk_lash/miscellanea:misc.Mode1
ltx/en_uk_lash/tr.d043:trMA.Ode5C14.ode	@ltx/en_uk_lash/miscellanea:misc.Ode5
ltx/en_uk_lash/tr.d043:trMA.Ode5C14.text	The Church has been revealed as a second Paradise, having within it, as of old, a Tree that bears life, your Cross, O Lord. By touching it we share in immortality.
ltx/en_uk_lash/tr.d043:trMA.Ode5C1T.incipit	You conceived by nature''s law…
ltx/en_uk_lash/tr.d043:trMA.Ode5C1T.melody	@ltx/en_uk_lash/he.h.m1:heHE.OrthrisomenOrthrouVatheos.name
ltx/en_uk_lash/tr.d043:trMA.Ode5C1T.mode	@ltx/en_uk_lash/miscellanea:misc.Mode1
ltx/en_uk_lash/tr.d043:trMA.Ode5C1T.ode	@ltx/en_uk_lash/miscellanea:misc.Ode5
ltx/en_uk_lash/tr.d043:trMA.Ode5C1T.text	You conceived by nature''s law, but above law; for your child-bearing alone was without seed. Fearful to think or speak of was the manner of your giving birth, O all-unblemished Virgin.
ltx/en_uk_lash/tr.d043:trMA.Ode5C1Tr.incipit	I glorify Three without beginning…
ltx/en_uk_lash/tr.d043:trMA.Ode5C1Tr.melody	@ltx/en_uk_lash/he.h.m1:heHE.OrthrisomenOrthrouVatheos.name
ltx/en_uk_lash/tr.d043:trMA.Ode5C1Tr.mode	@ltx/en_uk_lash/miscellanea:misc.Mode1
ltx/en_uk_lash/tr.d043:trMA.Ode5C1Tr.ode	@ltx/en_uk_lash/miscellanea:misc.Ode5
ltx/en_uk_lash/tr.d043:trMA.Ode5C1Tr.text	I glorify Three without beginning, God in one Essence, Father, Son and Spirit, a single Light in threefold radiance, Kingdom of equal might in identity without confusion.
ltx/en_uk_lash/tr.d043:trMA.Ode6C11.greekmelody	@ltx/en_uk_lash/he.h.m1:heHE.KatilthesEnToisKatotatois.greekname
ltx/en_uk_lash/tr.d043:trMA.Ode6C11.incipit	Having crushed death, O Christ…
ltx/en_uk_lash/tr.d043:trMA.Ode6C11.melody	@ltx/en_uk_lash/he.h.m1:heHE.KatilthesEnToisKatotatois.name
ltx/en_uk_lash/tr.d043:trMA.Ode6C11.mode	@ltx/en_uk_lash/miscellanea:misc.Mode1
ltx/en_uk_lash/tr.d043:trMA.Ode6C11.ode	@ltx/en_uk_lash/miscellanea:misc.Ode6
ltx/en_uk_lash/tr.d043:trMA.Ode6C11.text	Having crushed death, O Christ, you rose as a great King, calling us back from the storehouses of Hell to the enjoyment of the Kingdom of Heaven, to the land of immortality.
ltx/en_uk_lash/tr.d043:trMA.Ode6C12.incipit	Believers, let us cry aloud…
ltx/en_uk_lash/tr.d043:trMA.Ode6C12.melody	@ltx/en_uk_lash/he.h.m1:heHE.KatilthesEnToisKatotatois.name
ltx/en_uk_lash/tr.d043:trMA.Ode6C12.mode	@ltx/en_uk_lash/miscellanea:misc.Mode1
ltx/en_uk_lash/tr.d043:trMA.Ode6C12.ode	@ltx/en_uk_lash/miscellanea:misc.Ode6
ltx/en_uk_lash/tr.d043:trMA.Ode6C12.text	Believers, let us cry aloud in godly songs and shout with joy to God, as we greet the Cross of the Lord; for it is a fountain of holiness to all those in the world.
ltx/en_uk_lash/tr.d043:trMA.Ode6C13.incipit	The saying of the writer…
ltx/en_uk_lash/tr.d043:trMA.Ode6C13.melody	@ltx/en_uk_lash/he.h.m1:heHE.KatilthesEnToisKatotatois.name
ltx/en_uk_lash/tr.d043:trMA.Ode6C13.mode	@ltx/en_uk_lash/miscellanea:misc.Mode1
ltx/en_uk_lash/tr.d043:trMA.Ode6C13.ode	@ltx/en_uk_lash/miscellanea:misc.Ode6
ltx/en_uk_lash/tr.d043:trMA.Ode6C13.text	The saying of the writer of songs is fulfilled: for see, we worship at the footstool of your most pure feet, all-powerful Lord, your Precious Cross, the thrice-longed for Tree.
ltx/en_uk_lash/tr.d043:trMA.Ode6C14.incipit	The wood which the Prophet…
ltx/en_uk_lash/tr.d043:trMA.Ode6C14.melody	@ltx/en_uk_lash/he.h.m1:heHE.KatilthesEnToisKatotatois.name
ltx/en_uk_lash/tr.d043:trMA.Ode6C14.mode	@ltx/en_uk_lash/miscellanea:misc.Mode1
ltx/en_uk_lash/tr.d043:trMA.Ode6C14.ode	@ltx/en_uk_lash/miscellanea:misc.Ode6
ltx/en_uk_lash/tr.d043:trMA.Ode6C14.text	The wood which the Prophet of lamentation saw cast into your bread, — your Cross, compassionate Lord — we greet and we sing in praise of your bonds and tomb, of the lance and nails
ltx/en_uk_lash/tr.d043:trMA.Ode6C15.incipit	The holy Cross, O Christ…
ltx/en_uk_lash/tr.d043:trMA.Ode6C15.melody	@ltx/en_uk_lash/he.h.m1:heHE.KatilthesEnToisKatotatois.name
ltx/en_uk_lash/tr.d043:trMA.Ode6C15.mode	@ltx/en_uk_lash/miscellanea:misc.Mode1
ltx/en_uk_lash/tr.d043:trMA.Ode6C15.ode	@ltx/en_uk_lash/miscellanea:misc.Ode6
ltx/en_uk_lash/tr.d043:trMA.Ode6C15.text	The holy Cross, O Christ, which you accepted to bear on your shoulders, and on it to be lifted up and crucified in the flesh, we kiss; and from it we gather strength against invisible foes.
ltx/en_uk_lash/tr.d043:trMA.Ode6C1T.incipit	The greatest wonder of all…
ltx/en_uk_lash/tr.d043:trMA.Ode6C1T.melody	@ltx/en_uk_lash/he.h.m1:heHE.KatilthesEnToisKatotatois.name
ltx/en_uk_lash/tr.d043:trMA.Ode6C1T.mode	@ltx/en_uk_lash/miscellanea:misc.Mode1
ltx/en_uk_lash/tr.d043:trMA.Ode6C1T.ode	@ltx/en_uk_lash/miscellanea:misc.Ode6
ltx/en_uk_lash/tr.d043:trMA.Ode6C1T.text	The greatest wonder of all wonders was revealed in you, O Ewe-lamb free from blemish,: for you bore the Lamb who takes away the sin of the world. Entreat him fervently for those who sing your praise.
ltx/en_uk_lash/tr.d043:trMA.Ode6C1Tr.incipit	A Unity in three Persons…
ltx/en_uk_lash/tr.d043:trMA.Ode6C1Tr.melody	@ltx/en_uk_lash/he.h.m1:heHE.KatilthesEnToisKatotatois.name
ltx/en_uk_lash/tr.d043:trMA.Ode6C1Tr.mode	@ltx/en_uk_lash/miscellanea:misc.Mode1
ltx/en_uk_lash/tr.d043:trMA.Ode6C1Tr.ode	@ltx/en_uk_lash/miscellanea:misc.Ode6
ltx/en_uk_lash/tr.d043:trMA.Ode6C1Tr.text	A Unity in three Persons I praise and a Trinity worshipped in one Nature, God the three in one, Light of triple sun, Father, Son and Holy Spirit.
ltx/en_uk_lash/tr.d043:trMA.Ode7C11.greekmelody	@ltx/en_uk_lash/he.h.m1:heHE.OPaidasEkKaminou.greekname
ltx/en_uk_lash/tr.d043:trMA.Ode7C11.incipit	You rose on the third…
ltx/en_uk_lash/tr.d043:trMA.Ode7C11.melody	@ltx/en_uk_lash/he.h.m1:heHE.OPaidasEkKaminou.name
ltx/en_uk_lash/tr.d043:trMA.Ode7C11.mode	@ltx/en_uk_lash/miscellanea:misc.Mode1
ltx/en_uk_lash/tr.d043:trMA.Ode7C11.ode	@ltx/en_uk_lash/miscellanea:misc.Ode7
ltx/en_uk_lash/tr.d043:trMA.Ode7C11.text	You rose on the third day from the tomb as one who slept, Lord, and by your divine power struck down the gatekeepers of hell; you raised up all our forebears from of old, O God of our fathers, alone blessed and greatly glorified.
ltx/en_uk_lash/tr.d043:trMA.Ode7C12.incipit	Today, you peoples, as we…
ltx/en_uk_lash/tr.d043:trMA.Ode7C12.melody	@ltx/en_uk_lash/he.h.m1:heHE.OPaidasEkKaminou.name
ltx/en_uk_lash/tr.d043:trMA.Ode7C12.mode	@ltx/en_uk_lash/miscellanea:misc.Mode1
ltx/en_uk_lash/tr.d043:trMA.Ode7C12.ode	@ltx/en_uk_lash/miscellanea:misc.Ode7
ltx/en_uk_lash/tr.d043:trMA.Ode7C12.text	Today, you peoples, as we dance and sing to the harp, let us greatly rejoice at the worship of the Cross, glorifying Christ who was nailed upon it, the God of our fathers, alone blessed and greatly glorified.
ltx/en_uk_lash/tr.d043:trMA.Ode7C13.incipit	All-merciful Lord, who showed the…
ltx/en_uk_lash/tr.d043:trMA.Ode7C13.melody	@ltx/en_uk_lash/he.h.m1:heHE.OPaidasEkKaminou.name
ltx/en_uk_lash/tr.d043:trMA.Ode7C13.mode	@ltx/en_uk_lash/miscellanea:misc.Mode1
ltx/en_uk_lash/tr.d043:trMA.Ode7C13.ode	@ltx/en_uk_lash/miscellanea:misc.Ode7
ltx/en_uk_lash/tr.d043:trMA.Ode7C13.text	All-merciful Lord, who showed the instrument of mortality, your Cross, to be the workshop of life, honoured by the whole world, sanctify those who worship it, O God of our fathers, alone blessed and greatly glorified.
ltx/en_uk_lash/tr.d043:trMA.Ode7C14.incipit	You alone, O only Jesus…
ltx/en_uk_lash/tr.d043:trMA.Ode7C14.melody	@ltx/en_uk_lash/he.h.m1:heHE.OPaidasEkKaminou.name
ltx/en_uk_lash/tr.d043:trMA.Ode7C14.mode	@ltx/en_uk_lash/miscellanea:misc.Mode1
ltx/en_uk_lash/tr.d043:trMA.Ode7C14.ode	@ltx/en_uk_lash/miscellanea:misc.Ode7
ltx/en_uk_lash/tr.d043:trMA.Ode7C14.text	You alone, O only Jesus, are merciful and tender-hearted: enlighten and sanctify those who with faith worship your Cross and your divine Sufferings, O God of our fathers, alone blessed and greatly glorified.
ltx/en_uk_lash/tr.d043:trMA.Ode7C1T.incipit	With many names you were…
ltx/en_uk_lash/tr.d043:trMA.Ode7C1T.melody	@ltx/en_uk_lash/he.h.m1:heHE.OPaidasEkKaminou.name
ltx/en_uk_lash/tr.d043:trMA.Ode7C1T.mode	@ltx/en_uk_lash/miscellanea:misc.Mode1
ltx/en_uk_lash/tr.d043:trMA.Ode7C1T.ode	@ltx/en_uk_lash/miscellanea:misc.Ode7
ltx/en_uk_lash/tr.d043:trMA.Ode7C1T.text	With many names you were proclaimed by all the prophets: for you were revealed as gate of God, golden jar, holy land, O Virgin Bride of God who conceived in the flesh Jesus Christ, the God of our fathers who is greatly glorified.
ltx/en_uk_lash/tr.d043:trMA.Ode7C1Tr.incipit	I praise the Godhead, Unity…
ltx/en_uk_lash/tr.d043:trMA.Ode7C1Tr.melody	@ltx/en_uk_lash/he.h.m1:heHE.OPaidasEkKaminou.name
ltx/en_uk_lash/tr.d043:trMA.Ode7C1Tr.mode	@ltx/en_uk_lash/miscellanea:misc.Mode1
ltx/en_uk_lash/tr.d043:trMA.Ode7C1Tr.ode	@ltx/en_uk_lash/miscellanea:misc.Ode7
ltx/en_uk_lash/tr.d043:trMA.Ode7C1Tr.text	I praise the Godhead, Unity in three Persons: for the Father is Light, the Son is Light, and the Spirit is Light, of Light remaining undivided, shining forth in oneness of Nature, and in three rays of the Persons.
ltx/en_uk_lash/tr.d043:trMA.Ode8C11.greekmelody	@ltx/en_uk_lash/he.h.m1:heHE.AftiIKliti.greekname
ltx/en_uk_lash/tr.d043:trMA.Ode8C11.incipit	''Why do you hold sweet…
ltx/en_uk_lash/tr.d043:trMA.Ode8C11.melody	@ltx/en_uk_lash/he.h.m1:heHE.AftiIKliti.name
ltx/en_uk_lash/tr.d043:trMA.Ode8C11.mode	@ltx/en_uk_lash/miscellanea:misc.Mode1
ltx/en_uk_lash/tr.d043:trMA.Ode8C11.ode	@ltx/en_uk_lash/miscellanea:misc.Ode8
ltx/en_uk_lash/tr.d043:trMA.Ode8C11.text	''Why do you hold sweet spices in your hands? Whom are you seeking?'', now cries the young man in the tomb. ''Christ our God has risen, raising up the nature of mortals from the vaults of Hell''.
ltx/en_uk_lash/tr.d043:trMA.Ode8C12.incipit	Hail, O Cross, thrice-blessed and…
ltx/en_uk_lash/tr.d043:trMA.Ode8C12.melody	@ltx/en_uk_lash/he.h.m1:heHE.AftiIKliti.name
ltx/en_uk_lash/tr.d043:trMA.Ode8C12.mode	@ltx/en_uk_lash/miscellanea:misc.Mode1
ltx/en_uk_lash/tr.d043:trMA.Ode8C12.ode	@ltx/en_uk_lash/miscellanea:misc.Ode8
ltx/en_uk_lash/tr.d043:trMA.Ode8C12.text	Hail, O Cross, thrice-blessed and divine Tree, a light for those in darkness. By your shining you herald to the four-cornered World the rays of Christ''s Rising. Grant that all the faithful may reach Pascha.
ltx/en_uk_lash/tr.d043:trMA.Ode8C13.incipit	On this day the Tree…
ltx/en_uk_lash/tr.d043:trMA.Ode8C13.melody	@ltx/en_uk_lash/he.h.m1:heHE.AftiIKliti.name
ltx/en_uk_lash/tr.d043:trMA.Ode8C13.mode	@ltx/en_uk_lash/miscellanea:misc.Mode1
ltx/en_uk_lash/tr.d043:trMA.Ode8C13.ode	@ltx/en_uk_lash/miscellanea:misc.Ode8
ltx/en_uk_lash/tr.d043:trMA.Ode8C13.text	On this day the Tree anointed with life, the Cross of Christ, fills all things with the perfume of divine grace. Let us smell its God-given fragrance, worshipping it with faith to the ages.
ltx/en_uk_lash/tr.d043:trMA.Ode8C14.incipit	Come, Elissaios the Prophet, tell…
ltx/en_uk_lash/tr.d043:trMA.Ode8C14.melody	@ltx/en_uk_lash/he.h.m1:heHE.AftiIKliti.name
ltx/en_uk_lash/tr.d043:trMA.Ode8C14.mode	@ltx/en_uk_lash/miscellanea:misc.Mode1
ltx/en_uk_lash/tr.d043:trMA.Ode8C14.ode	@ltx/en_uk_lash/miscellanea:misc.Ode8
ltx/en_uk_lash/tr.d043:trMA.Ode8C14.text	Come, Elissaios the Prophet, tell us plainly: What was that wood you cast into the water? ''It was the Cross of Christ, through which we have been drawn up from the depths of corruption, as we worship it with faith to the ages.''
ltx/en_uk_lash/tr.d043:trMA.Ode8C15.incipit	Of old Jacob prefigured your…
ltx/en_uk_lash/tr.d043:trMA.Ode8C15.melody	@ltx/en_uk_lash/he.h.m1:heHE.AftiIKliti.name
ltx/en_uk_lash/tr.d043:trMA.Ode8C15.mode	@ltx/en_uk_lash/miscellanea:misc.Mode1
ltx/en_uk_lash/tr.d043:trMA.Ode8C15.ode	@ltx/en_uk_lash/miscellanea:misc.Ode8
ltx/en_uk_lash/tr.d043:trMA.Ode8C15.text	Of old Jacob prefigured your Cross, O Christ, when he worshipped the top of Joseph''s holy staff, foreseeing this dread sceptre of your Kingdom, which now we worship in faith to the ages.
ltx/en_uk_lash/tr.d043:trMA.Ode8C1T.incipit	Alone among mothers, Mary Bride…
ltx/en_uk_lash/tr.d043:trMA.Ode8C1T.melody	@ltx/en_uk_lash/he.h.m1:heHE.AftiIKliti.name
ltx/en_uk_lash/tr.d043:trMA.Ode8C1T.mode	@ltx/en_uk_lash/miscellanea:misc.Mode1
ltx/en_uk_lash/tr.d043:trMA.Ode8C1T.ode	@ltx/en_uk_lash/miscellanea:misc.Ode8
ltx/en_uk_lash/tr.d043:trMA.Ode8C1T.text	Alone among mothers, Mary Bride of God, you remained a virgin, without man giving birth to the Saviour Christ, yet preserving the seal of your purity. We believers will call you blessed to the ages.
ltx/en_uk_lash/tr.d043:trMA.Ode8C1Tr.incipit	I glorify one Substance in…
ltx/en_uk_lash/tr.d043:trMA.Ode8C1Tr.melody	@ltx/en_uk_lash/he.h.m1:heHE.AftiIKliti.name
ltx/en_uk_lash/tr.d043:trMA.Ode8C1Tr.mode	@ltx/en_uk_lash/miscellanea:misc.Mode1
ltx/en_uk_lash/tr.d043:trMA.Ode8C1Tr.ode	@ltx/en_uk_lash/miscellanea:misc.Ode8
ltx/en_uk_lash/tr.d043:trMA.Ode8C1Tr.text	I glorify one Substance in three beings: Father, Son and Spirit, neither confused in Persons nor divided in Essence; for there is one God in Trinity, over all to the ages.
ltx/en_uk_lash/tr.d043:trMA.Ode9C11.greekmelody	@ltx/en_uk_lash/he.h.m1:heHE.FotizouFotizou.greekname
ltx/en_uk_lash/tr.d043:trMA.Ode9C11.incipit	You went down into the…
ltx/en_uk_lash/tr.d043:trMA.Ode9C11.melody	@ltx/en_uk_lash/he.h.m1:heHE.FotizouFotizou.name
ltx/en_uk_lash/tr.d043:trMA.Ode9C11.mode	@ltx/en_uk_lash/miscellanea:misc.Mode1
ltx/en_uk_lash/tr.d043:trMA.Ode9C11.ode	@ltx/en_uk_lash/miscellanea:misc.Ode9
ltx/en_uk_lash/tr.d043:trMA.Ode9C11.text	You went down into the tomb, O God the Giver of Life and you broke all the bolts and bars, raising up the dead who cry aloud: Glory to your Resurrection! O Christ, the Saviour all-powerful.
ltx/en_uk_lash/tr.d043:trMA.Ode9C12.incipit	Your tomb, O Christ, has…
ltx/en_uk_lash/tr.d043:trMA.Ode9C12.melody	@ltx/en_uk_lash/he.h.m1:heHE.FotizouFotizou.name
ltx/en_uk_lash/tr.d043:trMA.Ode9C12.mode	@ltx/en_uk_lash/miscellanea:misc.Mode1
ltx/en_uk_lash/tr.d043:trMA.Ode9C12.ode	@ltx/en_uk_lash/miscellanea:misc.Ode9
ltx/en_uk_lash/tr.d043:trMA.Ode9C12.text	Your tomb, O Christ, has brought me life: for you, the Lord of life, came and cried to those who were dwelling in the grave, ''All who are in bonds, be loosed: for I have come, the Ransom of the world.
ltx/en_uk_lash/tr.d043:trMA.Ode9C13.incipit	Let all the trees of…
ltx/en_uk_lash/tr.d043:trMA.Ode9C13.melody	@ltx/en_uk_lash/he.h.m1:heHE.FotizouFotizou.name
ltx/en_uk_lash/tr.d043:trMA.Ode9C13.mode	@ltx/en_uk_lash/miscellanea:misc.Mode1
ltx/en_uk_lash/tr.d043:trMA.Ode9C13.ode	@ltx/en_uk_lash/miscellanea:misc.Ode9
ltx/en_uk_lash/tr.d043:trMA.Ode9C13.text	Let all the trees of the forest dance and sing, as they behold their fellow-tree, the Cross, today receiving veneration: for Christ, as holy David prophesied, has exalted it on high.
ltx/en_uk_lash/tr.d043:trMA.Ode9C14.incipit	I died through a tree…
ltx/en_uk_lash/tr.d043:trMA.Ode9C14.melody	@ltx/en_uk_lash/he.h.m1:heHE.FotizouFotizou.name
ltx/en_uk_lash/tr.d043:trMA.Ode9C14.mode	@ltx/en_uk_lash/miscellanea:misc.Mode1
ltx/en_uk_lash/tr.d043:trMA.Ode9C14.ode	@ltx/en_uk_lash/miscellanea:misc.Ode9
ltx/en_uk_lash/tr.d043:trMA.Ode9C14.text	I died through a tree, but I have found in you a Tree of Life, O Cross of Christ. You are my invincible protector, my strong defence against the demons. Venerating you this day, I cry aloud: Sanctify me by your glory.
ltx/en_uk_lash/tr.d043:trMA.Ode9C15.incipit	Rejoice and be exceeding glad…
ltx/en_uk_lash/tr.d043:trMA.Ode9C15.melody	@ltx/en_uk_lash/he.h.m1:heHE.FotizouFotizou.name
ltx/en_uk_lash/tr.d043:trMA.Ode9C15.mode	@ltx/en_uk_lash/miscellanea:misc.Mode1
ltx/en_uk_lash/tr.d043:trMA.Ode9C15.ode	@ltx/en_uk_lash/miscellanea:misc.Ode9
ltx/en_uk_lash/tr.d043:trMA.Ode9C15.text	Rejoice and be exceeding glad, O Church of God, as you venerate today the thrice-blessed wood of the most holy Cross of Christ, that is attended by the ranks of angels, and with fear they stand before it.
ltx/en_uk_lash/tr.d043:trMA.Ode9C1T.incipit	You are the great mountain…
ltx/en_uk_lash/tr.d043:trMA.Ode9C1T.melody	@ltx/en_uk_lash/he.h.m1:heHE.FotizouFotizou.name
ltx/en_uk_lash/tr.d043:trMA.Ode9C1T.mode	@ltx/en_uk_lash/miscellanea:misc.Mode1
ltx/en_uk_lash/tr.d043:trMA.Ode9C1T.ode	@ltx/en_uk_lash/miscellanea:misc.Ode9
ltx/en_uk_lash/tr.d043:trMA.Ode9C1T.text	You are the great mountain, O Virgin, in which Christ dwelt, as holy David says. By you we are raised up to heaven, all-blessed Lady, regaining through the Spirit the adoption of sons.
ltx/en_uk_lash/tr.d043:trMA.Ode9C1Tr.incipit	I worship you, O holy…
ltx/en_uk_lash/tr.d043:trMA.Ode9C1Tr.melody	@ltx/en_uk_lash/he.h.m1:heHE.FotizouFotizou.name
ltx/en_uk_lash/tr.d043:trMA.Ode9C1Tr.mode	@ltx/en_uk_lash/miscellanea:misc.Mode1
ltx/en_uk_lash/tr.d043:trMA.Ode9C1Tr.ode	@ltx/en_uk_lash/miscellanea:misc.Ode9
ltx/en_uk_lash/tr.d043:trMA.Ode9C1Tr.text	I worship you, O holy God, as Trinity of Persons in Unity of Essence, Father, Son and Holy Spirit, one Power and Kingdom, sovereign over all.
ltx/en_uk_lash/tr.d043:trMA.Oikos1.text	Three crosses Pilate fixed on Golgotha, / Two for the thieves and one for the Giver of life, / Whom Hades saw and said to those below, / ''My ministers and powers, / Who has fixed a nail in my heart? / A wooden lance has suddenly pierced me and I am being torn apart. / My insides are in pain, my belly in agony. / My senses make my spirit tremble, / And I am compelled to disgorge / Adam and Adam''s race, given me by a tree, / A tree is bringing them back / Again to Paradise''.
ltx/en_uk_lash/tr.d043:trMA.PostGospelBoth.incipit	@ltx/en_uk_lash/tr.d001:trMA.PostGospelBoth.incipit
ltx/en_uk_lash/tr.d043:trMA.PostGospelBoth.melody	
ltx/en_uk_lash/tr.d043:trMA.PostGospelBoth.mode	@ltx/en_uk_lash/miscellanea:misc.Mode8
ltx/en_uk_lash/tr.d043:trMA.PostGospelBoth.text	@ltx/en_uk_lash/tr.d001:trMA.PostGospelBoth.text
ltx/en_uk_lash/tr.d043:trMA.PostGospelGlory.incipit	@ltx/en_uk_lash/tr.d001:trMA.PostGospelGlory.incipit
ltx/en_uk_lash/tr.d043:trMA.PostGospelGlory.melody	
ltx/en_uk_lash/tr.d043:trMA.PostGospelGlory.mode	@ltx/en_uk_lash/miscellanea:misc.Mode8
ltx/en_uk_lash/tr.d043:trMA.PostGospelGlory.text	@ltx/en_uk_lash/tr.d001:trMA.PostGospelGlory.text
ltx/en_uk_lash/tr.d043:trMA.PostGospelIdiomelon.incipit	@ltx/en_uk_lash/tr.d001:trMA.PostGospelIdiomelon.incipit
ltx/en_uk_lash/tr.d043:trMA.PostGospelIdiomelon.melody	
ltx/en_uk_lash/tr.d043:trMA.PostGospelIdiomelon.mode	@ltx/en_uk_lash/miscellanea:misc.Mode6
ltx/en_uk_lash/tr.d043:trMA.PostGospelIdiomelon.text	@ltx/en_uk_lash/tr.d001:trMA.PostGospelIdiomelon.text
ltx/en_uk_lash/tr.d043:trSV.AposGlory.incipit	…
ltx/en_uk_lash/tr.d043:trSV.AposGlory.melody	@ltx/en_uk_lash/he.a.m2:heAU.OikosTouEfratha.notmetered
ltx/en_uk_lash/tr.d043:trSV.AposGlory.mode	@ltx/en_uk_lash/miscellanea:misc.Mode2
ltx/en_uk_lash/tr.d043:trSV.AposGlory.text	
ltx/en_uk_lash/tr.d043:trSV.Aposticha1.incipit	…
ltx/en_uk_lash/tr.d043:trSV.Aposticha1.melody	@ltx/en_uk_lash/he.a.m2:heAU.OikosTouEfratha.notmetered
ltx/en_uk_lash/tr.d043:trSV.Aposticha1.mode	@ltx/en_uk_lash/miscellanea:misc.Mode2
ltx/en_uk_lash/tr.d043:trSV.Aposticha1.text	
ltx/en_uk_lash/tr.d043:trSV.Aposticha2.incipit	…
ltx/en_uk_lash/tr.d043:trSV.Aposticha2.melody	@ltx/en_uk_lash/he.a.m2:heAU.OikosTouEfratha.notmetered
ltx/en_uk_lash/tr.d043:trSV.Aposticha2.mode	@ltx/en_uk_lash/miscellanea:misc.Mode2
ltx/en_uk_lash/tr.d043:trSV.Aposticha2.text	
ltx/en_uk_lash/tr.d043:trSV.Aposticha3.incipit	…
ltx/en_uk_lash/tr.d043:trSV.Aposticha3.melody	@ltx/en_uk_lash/he.a.m2:heAU.OikosTouEfratha.notmetered
ltx/en_uk_lash/tr.d043:trSV.Aposticha3.mode	@ltx/en_uk_lash/miscellanea:misc.Mode2
ltx/en_uk_lash/tr.d043:trSV.Aposticha3.text	
ltx/en_uk_lash/tr.d043:trSV.SticGlory.incipit	…
ltx/en_uk_lash/tr.d043:trSV.SticGlory.melody	@ltx/en_uk_lash/he.a.m6:heAU.AiAngelikai.notmetered
ltx/en_uk_lash/tr.d043:trSV.SticGlory.mode	@ltx/en_uk_lash/miscellanea:misc.Mode6
ltx/en_uk_lash/tr.d043:trSV.SticGlory.text	
ltx/en_uk_lash/tr.d043:trSV.Stichera1.incipit	…
ltx/en_uk_lash/tr.d043:trSV.Stichera1.melody	@ltx/en_uk_lash/he.a.m6:heAU.AiAngelikai.notmetered
ltx/en_uk_lash/tr.d043:trSV.Stichera1.mode	@ltx/en_uk_lash/miscellanea:misc.Mode6
ltx/en_uk_lash/tr.d043:trSV.Stichera1.text	
ltx/en_uk_lash/tr.d043:trSV.Stichera2.incipit	…
ltx/en_uk_lash/tr.d043:trSV.Stichera2.melody	@ltx/en_uk_lash/he.a.m6:heAU.AiAngelikai.notmetered
ltx/en_uk_lash/tr.d043:trSV.Stichera2.mode	@ltx/en_uk_lash/miscellanea:misc.Mode6
ltx/en_uk_lash/tr.d043:trSV.Stichera2.text	
ltx/en_uk_lash/tr.d043:trSV.Stichera3.incipit	…
ltx/en_uk_lash/tr.d043:trSV.Stichera3.melody	@ltx/en_uk_lash/he.a.m6:heAU.AiAngelikai.notmetered
ltx/en_uk_lash/tr.d043:trSV.Stichera3.mode	@ltx/en_uk_lash/miscellanea:misc.Mode6
ltx/en_uk_lash/tr.d043:trSV.Stichera3.text	
ltx/en_uk_lash/tr.d043:trSY.commemoration.couplet1.title	@ltx/en_uk_lash/titles:ti.Verses
ltx/en_uk_lash/tr.d043:trSY.commemoration.couplet1.verse1	Let all the earth bow down before the Cross,
ltx/en_uk_lash/tr.d043:trSY.commemoration.couplet1.verse2	Through which it learned to worship you, O Word.
ltx/en_uk_lash/tr.d043:trSY.commemoration.narration.p01	
ltx/en_uk_lash/tr.d043:trSY.commemoration.narration.p02	
ltx/en_uk_lash/tr.d043:trSY.commemoration.narration.p03	
ltx/en_uk_lash/tr.d043:trSY.commemoration.narration.p04	
ltx/en_uk_lash/tr.d043:trSY.commemoration.narration.p05	
ltx/en_uk_lash/tr.d043:trSY.commemoration.narration.p06	
ltx/en_uk_lash/tr.d043:trSY.commemoration.narration.p07	
ltx/en_uk_lash/tr.d043:trSY.commemoration.text	On the same day, the 3rd Sunday of the Fast, we celebrate the adoration of the precious and life-giving Cross.
ltx/en_uk_lash/tr.d043:trSY.lastline	By its power, Christ God, guard us from the assaults of the evil one and make us worthy to worship your divine Sufferings and life-bringing Resurrection, when we have passed successfully through the stadium of forty days, and have mercy on us as you alone are good and love mankind.
ltx/en_uk_lash/tr.d043:trVE.ApolTheotokion.incipit	@ltx/en_uk_lash/oc.m1.d1:ocVE.ApolTheotokionVM.incipit
ltx/en_uk_lash/tr.d043:trVE.ApolTheotokion.melody	
ltx/en_uk_lash/tr.d043:trVE.ApolTheotokion.mode	@ltx/en_uk_lash/miscellanea:misc.Mode1
ltx/en_uk_lash/tr.d043:trVE.ApolTheotokion.text	@ltx/en_uk_lash/oc.m1.d1:ocVE.ApolTheotokionVM.text
ltx/en_uk_lash/tr.d043:trVE.Apolytikion1.incipit	@ltx/en_uk_lash/me.m09.d14:meVE.Apolytikion1.incipit
ltx/en_uk_lash/tr.d043:trVE.Apolytikion1.melody	
ltx/en_uk_lash/tr.d043:trVE.Apolytikion1.mode	@ltx/en_uk_lash/miscellanea:misc.Mode1
ltx/en_uk_lash/tr.d043:trVE.Apolytikion1.text	@ltx/en_uk_lash/me.m09.d14:meVE.Apolytikion1.text
ltx/en_uk_lash/tr.d043:trVE.AposGlory.incipit	@ltx/en_uk_lash/me.m08.d01:meMA.LaudsBoth.incipit
ltx/en_uk_lash/tr.d043:trVE.AposGlory.melody	@ltx/en_uk_lash/miscellanea:misc.Idiomelon
ltx/en_uk_lash/tr.d043:trVE.AposGlory.mode	@ltx/en_uk_lash/miscellanea:misc.Mode4
ltx/en_uk_lash/tr.d043:trVE.AposGlory.text	@ltx/en_uk_lash/me.m08.d01:meMA.LaudsBoth.text
ltx/en_uk_lash/tr.d043:trVE.LityGlory.incipit	…
ltx/en_uk_lash/tr.d043:trVE.LityGlory.melody	@ltx/en_uk_lash/miscellanea:misc.Idiomelon
ltx/en_uk_lash/tr.d043:trVE.LityGlory.mode	@ltx/en_uk_lash/miscellanea:misc.Mode5
ltx/en_uk_lash/tr.d043:trVE.LityGlory.text	
ltx/en_uk_lash/tr.d043:trVE.SticGlory.incipit	O Christ our God, of…
ltx/en_uk_lash/tr.d043:trVE.SticGlory.melody	@ltx/en_uk_lash/miscellanea:misc.Idiomelon
ltx/en_uk_lash/tr.d043:trVE.SticGlory.mode	@ltx/en_uk_lash/miscellanea:misc.Mode3
ltx/en_uk_lash/tr.d043:trVE.SticGlory.text	O Christ our God, of your own will you accepted Crucifixion, for the common restoration of humankind. Taking the reed pen of the Cross, out of love for humankind, in the red ink of royalty with bloody fingers you signed our absolution. Do not forsake us, who are in danger once again of being parted from you. Take pity on your people in distress, for you alone are longsuffering. Rise up and fight against our enemies, as you are all-powerful.
ltx/en_uk_lash/tr.d043:trVE.Stichera01.greekmelody	@ltx/en_uk_lash/he.a.m5:heAU.ChairoisAskitikon.greekname
ltx/en_uk_lash/tr.d043:trVE.Stichera01.incipit	Shine, Cross of the Lord…
ltx/en_uk_lash/tr.d043:trVE.Stichera01.melody	@ltx/en_uk_lash/he.a.m5:heAU.ChairoisAskitikon.notmetered
ltx/en_uk_lash/tr.d043:trVE.Stichera01.mode	@ltx/en_uk_lash/miscellanea:misc.Mode5
ltx/en_uk_lash/tr.d043:trVE.Stichera01.text	Shine, Cross of the Lord, with the bright darting rays of your grace on the hearts of those who honour you, and with love inspired by God, embrace you, O desire of all the world. Through you our tears of sorrow have been wiped away; we have been delivered from the snares of death and have passed over to unending joy. Show us the splendour of your beauty, granting to us your servants the reward of our abstinence, for we entreat with faith your rich protection and great mercy.
ltx/en_uk_lash/tr.d043:trVE.Stichera02.greekmelody	@ltx/en_uk_lash/he.a.m5:heAU.ChairoisAskitikon.greekname
ltx/en_uk_lash/tr.d043:trVE.Stichera02.incipit	Hail, life-giving Cross! the fair…
ltx/en_uk_lash/tr.d043:trVE.Stichera02.melody	@ltx/en_uk_lash/he.a.m5:heAU.ChairoisAskitikon.notmetered
ltx/en_uk_lash/tr.d043:trVE.Stichera02.mode	@ltx/en_uk_lash/miscellanea:misc.Mode5
ltx/en_uk_lash/tr.d043:trVE.Stichera02.text	Hail, life-giving Cross! the fair Paradise of the Church, Tree of incorruption that blossoms for us with the enjoyment of eternal glory. Through you the hosts of demons are driven back, the companies of the Angels rejoice with one accord and the congregations of the faithful keep the feast. You are an invincible weapon, an unbroken stronghold; you are the victory of kings and the glory of priests. Grant us also now to draw near to the Passion of Christ and to His Resurrection.
ltx/en_uk_lash/tr.d043:trVE.Stichera03.greekmelody	@ltx/en_uk_lash/he.a.m5:heAU.ChairoisAskitikon.greekname
ltx/en_uk_lash/tr.d043:trVE.Stichera03.melody	@ltx/en_uk_lash/he.a.m5:heAU.ChairoisAskitikon.notmetered
ltx/en_uk_lash/tr.d043:trVE.Stichera03.mode	@ltx/en_uk_lash/miscellanea:misc.Mode5
ltx/en_uk_lash/tr.d043:trVE.Stichera03.text	@ltx/en_uk_lash/me.m09.d13:meVE.Aposticha1.text
ltx/en_uk_lash/tr.d043:trVE.Stichera04.greekmelody	@ltx/en_uk_lash/he.a.m5:heAU.ChairoisAskitikon.greekname
ltx/en_uk_lash/tr.d043:trVE.Stichera04.incipit	Come, first-fashioned pair, who fell…
ltx/en_uk_lash/tr.d043:trVE.Stichera04.melody	@ltx/en_uk_lash/he.a.m5:heAU.ChairoisAskitikon.notmetered
ltx/en_uk_lash/tr.d043:trVE.Stichera04.mode	@ltx/en_uk_lash/miscellanea:misc.Mode5
ltx/en_uk_lash/tr.d043:trVE.Stichera04.text	Come, first-fashioned pair, who fell from the choir on high through the envy of the murderer of humankind, through the bitter pleasure of tasting from the tree. See, the Tree, revered by all, draws near! Run with haste and embrace it joyfully, and cry to it with faith: O all-honoured Cross, you are our succour; partaking of your fruits we have gained incorruption; we are restored once more to Eden, and we have received great mercy.
