ltx/en_uk_lash/miscellanea:misc.Automelon	Model Melody.
ltx/en_uk_lash/miscellanea:misc.AutomelonNotMetered	Model Melody <i>(not metered).</i>
ltx/en_uk_lash/miscellanea:misc.FutureInstance	(The template is incomplete. This instance is far in the future.)
ltx/en_uk_lash/miscellanea:misc.Heirmologic	
ltx/en_uk_lash/miscellanea:misc.Heirmos	The Heirmos.
ltx/en_uk_lash/miscellanea:misc.HeirmosNotMetered	Heirmos <i>(not metered).</i>
ltx/en_uk_lash/miscellanea:misc.Idiomelon	Idiomel
ltx/en_uk_lash/miscellanea:misc.Mode0	Mode
ltx/en_uk_lash/miscellanea:misc.Mode1	Tone 1.
ltx/en_uk_lash/miscellanea:misc.Mode1.naked	Mode 1
ltx/en_uk_lash/miscellanea:misc.Mode2	Tone 2.
ltx/en_uk_lash/miscellanea:misc.Mode2.naked	Mode 2
ltx/en_uk_lash/miscellanea:misc.Mode3	Mode 3.
ltx/en_uk_lash/miscellanea:misc.Mode3.naked	Mode 3
ltx/en_uk_lash/miscellanea:misc.Mode4	Mode 4.
ltx/en_uk_lash/miscellanea:misc.Mode4.naked	Mode 4
ltx/en_uk_lash/miscellanea:misc.Mode5	Tone 5.
ltx/en_uk_lash/miscellanea:misc.Mode5.naked	Mode pl. 1
ltx/en_uk_lash/miscellanea:misc.Mode6	Tone 6.
ltx/en_uk_lash/miscellanea:misc.Mode6.naked	Mode pl. 2
ltx/en_uk_lash/miscellanea:misc.Mode7	Grave Mode.
ltx/en_uk_lash/miscellanea:misc.Mode7.naked	Grave Mode
ltx/en_uk_lash/miscellanea:misc.Mode8	Tone 8.
ltx/en_uk_lash/miscellanea:misc.Mode8.naked	Mode pl. 4
ltx/en_uk_lash/miscellanea:misc.ModeNA	
ltx/en_uk_lash/miscellanea:misc.ModeOfWeek	In the Mode of the week.
ltx/en_uk_lash/miscellanea:misc.ModeVariable	
ltx/en_uk_lash/miscellanea:misc.NA	
ltx/en_uk_lash/miscellanea:misc.NotAvailable	(not available)
ltx/en_uk_lash/miscellanea:misc.NotMetered	(not metered)
ltx/en_uk_lash/miscellanea:misc.Ode1	Ode i.
ltx/en_uk_lash/miscellanea:misc.Ode2	Ode ii.
ltx/en_uk_lash/miscellanea:misc.Ode3	Ode iii.
ltx/en_uk_lash/miscellanea:misc.Ode4	Ode iv.
ltx/en_uk_lash/miscellanea:misc.Ode5	Ode v.
ltx/en_uk_lash/miscellanea:misc.Ode6	Ode vi.
ltx/en_uk_lash/miscellanea:misc.Ode7	Ode vii.
ltx/en_uk_lash/miscellanea:misc.Ode8	Ode viii.
ltx/en_uk_lash/miscellanea:misc.Ode9	Ode ix.
ltx/en_uk_lash/miscellanea:misc.Prosomoion	
ltx/en_uk_lash/miscellanea:misc.Rnum1	I
ltx/en_uk_lash/miscellanea:misc.Rnum10	X
ltx/en_uk_lash/miscellanea:misc.Rnum2	II
ltx/en_uk_lash/miscellanea:misc.Rnum3	III
ltx/en_uk_lash/miscellanea:misc.Rnum4	IV
ltx/en_uk_lash/miscellanea:misc.Rnum5	V
ltx/en_uk_lash/miscellanea:misc.Rnum6	VI
ltx/en_uk_lash/miscellanea:misc.Rnum7	VII
ltx/en_uk_lash/miscellanea:misc.Rnum8	VIII
ltx/en_uk_lash/miscellanea:misc.Rnum9	IX
ltx/en_uk_lash/miscellanea:misc.anum1	1.
ltx/en_uk_lash/miscellanea:misc.anum10	10.
ltx/en_uk_lash/miscellanea:misc.anum11	11.
ltx/en_uk_lash/miscellanea:misc.anum12	12.
ltx/en_uk_lash/miscellanea:misc.anum13	13.
ltx/en_uk_lash/miscellanea:misc.anum14	14.
ltx/en_uk_lash/miscellanea:misc.anum15	15.
ltx/en_uk_lash/miscellanea:misc.anum16	16.
ltx/en_uk_lash/miscellanea:misc.anum17	17.
ltx/en_uk_lash/miscellanea:misc.anum18	18.
ltx/en_uk_lash/miscellanea:misc.anum19	19.
ltx/en_uk_lash/miscellanea:misc.anum2	2.
ltx/en_uk_lash/miscellanea:misc.anum20	20
ltx/en_uk_lash/miscellanea:misc.anum21	21
ltx/en_uk_lash/miscellanea:misc.anum22	22.
ltx/en_uk_lash/miscellanea:misc.anum23	23.
ltx/en_uk_lash/miscellanea:misc.anum24	24.
ltx/en_uk_lash/miscellanea:misc.anum25	25.
ltx/en_uk_lash/miscellanea:misc.anum26	26.
ltx/en_uk_lash/miscellanea:misc.anum27	27.
ltx/en_uk_lash/miscellanea:misc.anum28	28.
ltx/en_uk_lash/miscellanea:misc.anum29	29.
ltx/en_uk_lash/miscellanea:misc.anum3	3.
ltx/en_uk_lash/miscellanea:misc.anum30	30.
ltx/en_uk_lash/miscellanea:misc.anum31	31.
ltx/en_uk_lash/miscellanea:misc.anum32	32.
ltx/en_uk_lash/miscellanea:misc.anum33	33.
ltx/en_uk_lash/miscellanea:misc.anum4	4.
ltx/en_uk_lash/miscellanea:misc.anum5	5.
ltx/en_uk_lash/miscellanea:misc.anum6	6.
ltx/en_uk_lash/miscellanea:misc.anum7	7.
ltx/en_uk_lash/miscellanea:misc.anum8	8.
ltx/en_uk_lash/miscellanea:misc.anum9	9.
ltx/en_uk_lash/miscellanea:misc.book.BooksSources.title	Books - Sources
ltx/en_uk_lash/miscellanea:misc.book.Euchologion.name	
ltx/en_uk_lash/miscellanea:misc.book.Heirmologion.name	
ltx/en_uk_lash/miscellanea:misc.book.Hieratikon.name	
ltx/en_uk_lash/miscellanea:misc.book.Horologion.name	
ltx/en_uk_lash/miscellanea:misc.book.MeSupplement.name	
ltx/en_uk_lash/miscellanea:misc.book.Menaion.name	
ltx/en_uk_lash/miscellanea:misc.book.Octoechos.name	Octoechos
ltx/en_uk_lash/miscellanea:misc.book.PeSupplement.name	
ltx/en_uk_lash/miscellanea:misc.book.Pentecostarion.name	
ltx/en_uk_lash/miscellanea:misc.book.Psalter.name	
ltx/en_uk_lash/miscellanea:misc.book.Synaxarion.name	
ltx/en_uk_lash/miscellanea:misc.book.Triodion.name	
ltx/en_uk_lash/miscellanea:misc.book.Typikon.name	Typikon.
ltx/en_uk_lash/miscellanea:misc.bracket.close	]
ltx/en_uk_lash/miscellanea:misc.bracket.open	[
ltx/en_uk_lash/miscellanea:misc.greekquotation.left	«
ltx/en_uk_lash/miscellanea:misc.greekquotation.right	»
ltx/en_uk_lash/miscellanea:misc.horizontal_line.dash1	----------
ltx/en_uk_lash/miscellanea:misc.horizontal_line.solid1	__________
ltx/en_uk_lash/miscellanea:misc.parenthesis.close	)
ltx/en_uk_lash/miscellanea:misc.parenthesis.open	(
ltx/en_uk_lash/miscellanea:misc.punctuation.colon	:
ltx/en_uk_lash/miscellanea:misc.punctuation.comma	,
ltx/en_uk_lash/miscellanea:misc.punctuation.ellipsis	…
ltx/en_uk_lash/miscellanea:misc.punctuation.period	.
ltx/en_uk_lash/miscellanea:misc.rnum1	i
ltx/en_uk_lash/miscellanea:misc.rnum10	x
ltx/en_uk_lash/miscellanea:misc.rnum2	ii
ltx/en_uk_lash/miscellanea:misc.rnum3	iii
ltx/en_uk_lash/miscellanea:misc.rnum4	iv
ltx/en_uk_lash/miscellanea:misc.rnum5	v
ltx/en_uk_lash/miscellanea:misc.rnum6	vi
ltx/en_uk_lash/miscellanea:misc.rnum7	vii
ltx/en_uk_lash/miscellanea:misc.rnum8	viii
ltx/en_uk_lash/miscellanea:misc.rnum9	ix
ltx/en_uk_lash/miscellanea:misc.separator.asterisk	*
ltx/en_uk_lash/miscellanea:misc.separator.asterisks	∗∗∗∗∗∗∗∗∗∗∗∗∗∗∗∗∗∗∗∗∗∗∗∗∗∗∗∗∗∗∗∗∗∗∗∗
ltx/en_uk_lash/miscellanea:misc.separator.emdash	—
ltx/en_uk_lash/miscellanea:misc.separator.endash	–
ltx/en_uk_lash/miscellanea:misc.separator.hyphen	-
ltx/en_uk_lash/miscellanea:misc.separator.pipe	|
ltx/en_uk_lash/miscellanea:misc.separator.slash	/
ltx/en_uk_lash/miscellanea:misc.vVerse	Verse:
ltx/en_uk_lash/miscellanea:misc.vVerse1	Verse 1:
ltx/en_uk_lash/miscellanea:misc.vVerse2	Verse 2:
ltx/en_uk_lash/miscellanea:misc.vVerse3	Verse 3:
ltx/en_uk_lash/miscellanea:misc.vVerse4	Verse 4:
