ltx/en_uk_lash/le.pr.me.r08:leprVE.reading.book_abbr	@ltx/en_uk_lash/bible:Isaiah.abbr
ltx/en_uk_lash/le.pr.me.r08:leprVE.reading.book_string	@ltx/en_uk_lash/bible:Isaiah.text
ltx/en_uk_lash/le.pr.me.r08:leprVE.reading.chapverse	[12,3-6]
ltx/en_uk_lash/le.pr.me.r08:leprVE.reading.text	Thus says the Lord: Draw water with gladness from the wells of salvation.  And you will say in that day, ''Sing praise to the Lord and cry out his name.  Proclaim among the Nations his glorious deeds  Remind them that his name has been exalted. Sing praise to the name of the Lord, for he has done mighty things.  Proclaim these in all the earth.  Rejoice and be glad, you that dwell in Sion, because the Holy One of Israel has been exalted in the midst of her.
ltx/en_uk_lash/le.pr.me.r08:leprVE.reading.title	
ltx/en_uk_lash/le.pr.me.r08:leprVE.reading.version	@ltx/en_uk_lash/properties:version.designation
