ltx/en_uk_lash/tr.d041:trCO.header	
ltx/en_uk_lash/tr.d041:trDA.commemoration.full	
ltx/en_uk_lash/tr.d041:trDA.commemoration.short	
ltx/en_uk_lash/tr.d041:trDA.insert1	
ltx/en_uk_lash/tr.d041:trDA.insert2	
ltx/en_uk_lash/tr.d041:trDA.note	
ltx/en_uk_lash/tr.d041:trDA.title	
ltx/en_uk_lash/tr.d041:trHO.commemorations	
ltx/en_uk_lash/tr.d041:trHO.daytitle	
ltx/en_uk_lash/tr.d041:trHO.description1	
ltx/en_uk_lash/tr.d041:trHO.description2	
ltx/en_uk_lash/tr.d041:trHO.note1	
ltx/en_uk_lash/tr.d041:trHO.note2	
ltx/en_uk_lash/tr.d041:trMA.AposIdiomelon1.incipit	…
ltx/en_uk_lash/tr.d041:trMA.AposIdiomelon1.melody	@ltx/en_uk_lash/miscellanea:misc.Idiomelon
ltx/en_uk_lash/tr.d041:trMA.AposIdiomelon1.mode	@ltx/en_uk_lash/miscellanea:misc.Mode6
ltx/en_uk_lash/tr.d041:trMA.AposIdiomelon1.text	
ltx/en_uk_lash/tr.d041:trMA.AposMartyric.incipit	…
ltx/en_uk_lash/tr.d041:trMA.AposMartyric.melody	
ltx/en_uk_lash/tr.d041:trMA.AposMartyric.mode	@ltx/en_uk_lash/miscellanea:misc.Mode6
ltx/en_uk_lash/tr.d041:trMA.AposMartyric.text	
ltx/en_uk_lash/tr.d041:trMA.AposTheotokion.greekmelody	@ltx/en_uk_lash/he.a.m6:heAU.TriimerosAnestis.greekname
ltx/en_uk_lash/tr.d041:trMA.AposTheotokion.incipit	@ltx/en_uk_lash/oc.m6.d4:ocVE.AposTheotokion.incipit
ltx/en_uk_lash/tr.d041:trMA.AposTheotokion.melody	@ltx/en_uk_lash/he.a.m6:heAU.TriimerosAnestis.notmetered
ltx/en_uk_lash/tr.d041:trMA.AposTheotokion.mode	@ltx/en_uk_lash/miscellanea:misc.Mode6
ltx/en_uk_lash/tr.d041:trMA.AposTheotokion.text	@ltx/en_uk_lash/oc.m6.d4:ocVE.AposTheotokion.text
ltx/en_uk_lash/tr.d041:trMA.C1.poet	@ltx/en_uk_lash/poets:po.Iosif
ltx/en_uk_lash/tr.d041:trMA.C2.poet	@ltx/en_uk_lash/poets:po.Theodorou
ltx/en_uk_lash/tr.d041:trMA.Kathisma21.greekmelody	@ltx/en_uk_lash/he.a.m5:heAU.TonSynanarchonLogon.greekname
ltx/en_uk_lash/tr.d041:trMA.Kathisma21.incipit	…
ltx/en_uk_lash/tr.d041:trMA.Kathisma21.melody	@ltx/en_uk_lash/he.a.m5:heAU.TonSynanarchonLogon.notmetered
ltx/en_uk_lash/tr.d041:trMA.Kathisma21.mode	@ltx/en_uk_lash/miscellanea:misc.Mode5
ltx/en_uk_lash/tr.d041:trMA.Kathisma21.text	
ltx/en_uk_lash/tr.d041:trMA.Kathisma22.greekmelody	@ltx/en_uk_lash/he.a.m5:heAU.TonSynanarchonLogon.greekname
ltx/en_uk_lash/tr.d041:trMA.Kathisma22.incipit	…
ltx/en_uk_lash/tr.d041:trMA.Kathisma22.melody	@ltx/en_uk_lash/he.a.m5:heAU.TonSynanarchonLogon.notmetered
ltx/en_uk_lash/tr.d041:trMA.Kathisma22.mode	@ltx/en_uk_lash/miscellanea:misc.Mode5
ltx/en_uk_lash/tr.d041:trMA.Kathisma22.text	
ltx/en_uk_lash/tr.d041:trMA.Kathisma31.greekmelody	@ltx/en_uk_lash/he.a.m1:heAU.TouLithouSfragisthentos.greekname
ltx/en_uk_lash/tr.d041:trMA.Kathisma31.incipit	…
ltx/en_uk_lash/tr.d041:trMA.Kathisma31.melody	@ltx/en_uk_lash/he.a.m1:heAU.TouLithouSfragisthentos.notmetered
ltx/en_uk_lash/tr.d041:trMA.Kathisma31.mode	@ltx/en_uk_lash/miscellanea:misc.Mode1
ltx/en_uk_lash/tr.d041:trMA.Kathisma31.text	
ltx/en_uk_lash/tr.d041:trMA.Kathisma32.greekmelody	@ltx/en_uk_lash/he.a.m1:heAU.TouLithouSfragisthentos.greekname
ltx/en_uk_lash/tr.d041:trMA.Kathisma32.incipit	…
ltx/en_uk_lash/tr.d041:trMA.Kathisma32.melody	@ltx/en_uk_lash/he.a.m1:heAU.TouLithouSfragisthentos.notmetered
ltx/en_uk_lash/tr.d041:trMA.Kathisma32.mode	@ltx/en_uk_lash/miscellanea:misc.Mode1
ltx/en_uk_lash/tr.d041:trMA.Kathisma32.text	
ltx/en_uk_lash/tr.d041:trMA.Ode5C11.greekmelody	@ltx/en_uk_lash/he.h.m5:heHE.OAnavallomenos.greekname
ltx/en_uk_lash/tr.d041:trMA.Ode5C11.incipit	…
ltx/en_uk_lash/tr.d041:trMA.Ode5C11.melody	@ltx/en_uk_lash/he.h.m5:heHE.OAnavallomenos.name
ltx/en_uk_lash/tr.d041:trMA.Ode5C11.mode	@ltx/en_uk_lash/miscellanea:misc.Mode5
ltx/en_uk_lash/tr.d041:trMA.Ode5C11.ode	@ltx/en_uk_lash/miscellanea:misc.Ode5
ltx/en_uk_lash/tr.d041:trMA.Ode5C11.text	
ltx/en_uk_lash/tr.d041:trMA.Ode5C12.incipit	…
ltx/en_uk_lash/tr.d041:trMA.Ode5C12.melody	@ltx/en_uk_lash/he.h.m5:heHE.OAnavallomenos.name
ltx/en_uk_lash/tr.d041:trMA.Ode5C12.mode	@ltx/en_uk_lash/miscellanea:misc.Mode5
ltx/en_uk_lash/tr.d041:trMA.Ode5C12.ode	@ltx/en_uk_lash/miscellanea:misc.Ode5
ltx/en_uk_lash/tr.d041:trMA.Ode5C12.text	
ltx/en_uk_lash/tr.d041:trMA.Ode5C13.incipit	…
ltx/en_uk_lash/tr.d041:trMA.Ode5C13.melody	@ltx/en_uk_lash/he.h.m5:heHE.OAnavallomenos.name
ltx/en_uk_lash/tr.d041:trMA.Ode5C13.mode	@ltx/en_uk_lash/miscellanea:misc.Mode5
ltx/en_uk_lash/tr.d041:trMA.Ode5C13.ode	@ltx/en_uk_lash/miscellanea:misc.Ode5
ltx/en_uk_lash/tr.d041:trMA.Ode5C13.text	
ltx/en_uk_lash/tr.d041:trMA.Ode5C1T.incipit	…
ltx/en_uk_lash/tr.d041:trMA.Ode5C1T.melody	@ltx/en_uk_lash/he.h.m5:heHE.OAnavallomenos.name
ltx/en_uk_lash/tr.d041:trMA.Ode5C1T.mode	@ltx/en_uk_lash/miscellanea:misc.Mode5
ltx/en_uk_lash/tr.d041:trMA.Ode5C1T.ode	@ltx/en_uk_lash/miscellanea:misc.Ode5
ltx/en_uk_lash/tr.d041:trMA.Ode5C1T.text	
ltx/en_uk_lash/tr.d041:trMA.Ode5C21.greekmelody	@ltx/en_uk_lash/he.h.m1:heHE.EkNyktosOrthrizontes.greekname
ltx/en_uk_lash/tr.d041:trMA.Ode5C21.incipit	…
ltx/en_uk_lash/tr.d041:trMA.Ode5C21.melody	@ltx/en_uk_lash/he.h.m1:heHE.EkNyktosOrthrizontes.name
ltx/en_uk_lash/tr.d041:trMA.Ode5C21.mode	@ltx/en_uk_lash/miscellanea:misc.Mode1
ltx/en_uk_lash/tr.d041:trMA.Ode5C21.ode	@ltx/en_uk_lash/miscellanea:misc.Ode5
ltx/en_uk_lash/tr.d041:trMA.Ode5C21.text	
ltx/en_uk_lash/tr.d041:trMA.Ode5C22.incipit	…
ltx/en_uk_lash/tr.d041:trMA.Ode5C22.melody	@ltx/en_uk_lash/he.h.m1:heHE.EkNyktosOrthrizontes.name
ltx/en_uk_lash/tr.d041:trMA.Ode5C22.mode	@ltx/en_uk_lash/miscellanea:misc.Mode1
ltx/en_uk_lash/tr.d041:trMA.Ode5C22.ode	@ltx/en_uk_lash/miscellanea:misc.Ode5
ltx/en_uk_lash/tr.d041:trMA.Ode5C22.text	
ltx/en_uk_lash/tr.d041:trMA.Ode5C2A1.incipit	…
ltx/en_uk_lash/tr.d041:trMA.Ode5C2A1.melody	@ltx/en_uk_lash/he.h.m1:heHE.EkNyktosOrthrizontes.name
ltx/en_uk_lash/tr.d041:trMA.Ode5C2A1.mode	@ltx/en_uk_lash/miscellanea:misc.Mode1
ltx/en_uk_lash/tr.d041:trMA.Ode5C2A1.ode	@ltx/en_uk_lash/miscellanea:misc.Ode5
ltx/en_uk_lash/tr.d041:trMA.Ode5C2A1.text	
ltx/en_uk_lash/tr.d041:trMA.Ode5C2H.greekmelody	@ltx/en_uk_lash/he.h.m1:heHE.EkNyktosOrthrizontes.greekname
ltx/en_uk_lash/tr.d041:trMA.Ode5C2H.incipit	@ltx/en_uk_lash/he.h.m1:heHE.EkNyktosOrthrizontes.incipit
ltx/en_uk_lash/tr.d041:trMA.Ode5C2H.melody	@ltx/en_uk_lash/he.h.m1:heHE.EkNyktosOrthrizontes.melody
ltx/en_uk_lash/tr.d041:trMA.Ode5C2H.mode	@ltx/en_uk_lash/miscellanea:misc.Mode1
ltx/en_uk_lash/tr.d041:trMA.Ode5C2H.ode	@ltx/en_uk_lash/miscellanea:misc.Ode5
ltx/en_uk_lash/tr.d041:trMA.Ode5C2H.text	@ltx/en_uk_lash/he.h.m1:heHE.EkNyktosOrthrizontes.text
ltx/en_uk_lash/tr.d041:trMA.Ode5C2T.incipit	…
ltx/en_uk_lash/tr.d041:trMA.Ode5C2T.melody	@ltx/en_uk_lash/he.h.m1:heHE.EkNyktosOrthrizontes.name
ltx/en_uk_lash/tr.d041:trMA.Ode5C2T.mode	@ltx/en_uk_lash/miscellanea:misc.Mode1
ltx/en_uk_lash/tr.d041:trMA.Ode5C2T.ode	@ltx/en_uk_lash/miscellanea:misc.Ode5
ltx/en_uk_lash/tr.d041:trMA.Ode5C2T.text	
ltx/en_uk_lash/tr.d041:trMA.Ode5C2Tr.incipit	…
ltx/en_uk_lash/tr.d041:trMA.Ode5C2Tr.melody	@ltx/en_uk_lash/he.h.m1:heHE.EkNyktosOrthrizontes.name
ltx/en_uk_lash/tr.d041:trMA.Ode5C2Tr.mode	@ltx/en_uk_lash/miscellanea:misc.Mode1
ltx/en_uk_lash/tr.d041:trMA.Ode5C2Tr.ode	@ltx/en_uk_lash/miscellanea:misc.Ode5
ltx/en_uk_lash/tr.d041:trMA.Ode5C2Tr.text	
ltx/en_uk_lash/tr.d041:trMA.Ode8C11.greekmelody	@ltx/en_uk_lash/he.h.m5:heHE.SoiToPantourgo.greekname
ltx/en_uk_lash/tr.d041:trMA.Ode8C11.incipit	…
ltx/en_uk_lash/tr.d041:trMA.Ode8C11.melody	@ltx/en_uk_lash/he.h.m5:heHE.SoiToPantourgo.name
ltx/en_uk_lash/tr.d041:trMA.Ode8C11.mode	@ltx/en_uk_lash/miscellanea:misc.Mode5
ltx/en_uk_lash/tr.d041:trMA.Ode8C11.ode	@ltx/en_uk_lash/miscellanea:misc.Ode8
ltx/en_uk_lash/tr.d041:trMA.Ode8C11.text	
ltx/en_uk_lash/tr.d041:trMA.Ode8C12.incipit	…
ltx/en_uk_lash/tr.d041:trMA.Ode8C12.melody	@ltx/en_uk_lash/he.h.m5:heHE.SoiToPantourgo.name
ltx/en_uk_lash/tr.d041:trMA.Ode8C12.mode	@ltx/en_uk_lash/miscellanea:misc.Mode5
ltx/en_uk_lash/tr.d041:trMA.Ode8C12.ode	@ltx/en_uk_lash/miscellanea:misc.Ode8
ltx/en_uk_lash/tr.d041:trMA.Ode8C12.text	
ltx/en_uk_lash/tr.d041:trMA.Ode8C13.incipit	…
ltx/en_uk_lash/tr.d041:trMA.Ode8C13.melody	@ltx/en_uk_lash/he.h.m5:heHE.SoiToPantourgo.name
ltx/en_uk_lash/tr.d041:trMA.Ode8C13.mode	@ltx/en_uk_lash/miscellanea:misc.Mode5
ltx/en_uk_lash/tr.d041:trMA.Ode8C13.ode	@ltx/en_uk_lash/miscellanea:misc.Ode8
ltx/en_uk_lash/tr.d041:trMA.Ode8C13.text	
ltx/en_uk_lash/tr.d041:trMA.Ode8C1T.incipit	…
ltx/en_uk_lash/tr.d041:trMA.Ode8C1T.melody	@ltx/en_uk_lash/he.h.m5:heHE.SoiToPantourgo.name
ltx/en_uk_lash/tr.d041:trMA.Ode8C1T.mode	@ltx/en_uk_lash/miscellanea:misc.Mode5
ltx/en_uk_lash/tr.d041:trMA.Ode8C1T.ode	@ltx/en_uk_lash/miscellanea:misc.Ode8
ltx/en_uk_lash/tr.d041:trMA.Ode8C1T.text	
ltx/en_uk_lash/tr.d041:trMA.Ode8C21.greekmelody	@ltx/en_uk_lash/he.h.m1:heHE.TonTousYmnologousEnKamino.greekname
ltx/en_uk_lash/tr.d041:trMA.Ode8C21.incipit	…
ltx/en_uk_lash/tr.d041:trMA.Ode8C21.melody	@ltx/en_uk_lash/he.h.m1:heHE.TonTousYmnologousEnKamino.name
ltx/en_uk_lash/tr.d041:trMA.Ode8C21.mode	@ltx/en_uk_lash/miscellanea:misc.Mode1
ltx/en_uk_lash/tr.d041:trMA.Ode8C21.ode	@ltx/en_uk_lash/miscellanea:misc.Ode8
ltx/en_uk_lash/tr.d041:trMA.Ode8C21.text	
ltx/en_uk_lash/tr.d041:trMA.Ode8C22.incipit	…
ltx/en_uk_lash/tr.d041:trMA.Ode8C22.melody	@ltx/en_uk_lash/he.h.m1:heHE.TonTousYmnologousEnKamino.name
ltx/en_uk_lash/tr.d041:trMA.Ode8C22.mode	@ltx/en_uk_lash/miscellanea:misc.Mode1
ltx/en_uk_lash/tr.d041:trMA.Ode8C22.ode	@ltx/en_uk_lash/miscellanea:misc.Ode8
ltx/en_uk_lash/tr.d041:trMA.Ode8C22.text	
ltx/en_uk_lash/tr.d041:trMA.Ode8C2A1.incipit	…
ltx/en_uk_lash/tr.d041:trMA.Ode8C2A1.melody	@ltx/en_uk_lash/he.h.m1:heHE.TonTousYmnologousEnKamino.name
ltx/en_uk_lash/tr.d041:trMA.Ode8C2A1.mode	@ltx/en_uk_lash/miscellanea:misc.Mode1
ltx/en_uk_lash/tr.d041:trMA.Ode8C2A1.ode	@ltx/en_uk_lash/miscellanea:misc.Ode8
ltx/en_uk_lash/tr.d041:trMA.Ode8C2A1.text	
ltx/en_uk_lash/tr.d041:trMA.Ode8C2H.greekmelody	@ltx/en_uk_lash/he.h.m1:heHE.TonTousYmnologousEnKamino.greekname
ltx/en_uk_lash/tr.d041:trMA.Ode8C2H.incipit	@ltx/en_uk_lash/he.h.m1:heHE.TonTousYmnologousEnKamino.incipit
ltx/en_uk_lash/tr.d041:trMA.Ode8C2H.melody	@ltx/en_uk_lash/he.h.m1:heHE.TonTousYmnologousEnKamino.melody
ltx/en_uk_lash/tr.d041:trMA.Ode8C2H.mode	@ltx/en_uk_lash/miscellanea:misc.Mode1
ltx/en_uk_lash/tr.d041:trMA.Ode8C2H.ode	@ltx/en_uk_lash/miscellanea:misc.Ode8
ltx/en_uk_lash/tr.d041:trMA.Ode8C2H.text	@ltx/en_uk_lash/he.h.m1:heHE.TonTousYmnologousEnKamino.text
ltx/en_uk_lash/tr.d041:trMA.Ode8C2T.incipit	…
ltx/en_uk_lash/tr.d041:trMA.Ode8C2T.melody	@ltx/en_uk_lash/he.h.m1:heHE.TonTousYmnologousEnKamino.name
ltx/en_uk_lash/tr.d041:trMA.Ode8C2T.mode	@ltx/en_uk_lash/miscellanea:misc.Mode1
ltx/en_uk_lash/tr.d041:trMA.Ode8C2T.ode	@ltx/en_uk_lash/miscellanea:misc.Ode8
ltx/en_uk_lash/tr.d041:trMA.Ode8C2T.text	
ltx/en_uk_lash/tr.d041:trMA.Ode8C2Tr.incipit	…
ltx/en_uk_lash/tr.d041:trMA.Ode8C2Tr.melody	@ltx/en_uk_lash/he.h.m1:heHE.TonTousYmnologousEnKamino.name
ltx/en_uk_lash/tr.d041:trMA.Ode8C2Tr.mode	@ltx/en_uk_lash/miscellanea:misc.Mode1
ltx/en_uk_lash/tr.d041:trMA.Ode8C2Tr.ode	@ltx/en_uk_lash/miscellanea:misc.Ode8
ltx/en_uk_lash/tr.d041:trMA.Ode8C2Tr.text	
ltx/en_uk_lash/tr.d041:trMA.Ode9C11.greekmelody	@ltx/en_uk_lash/he.h.m5:heHE.IsaiaChoreve.greekname
ltx/en_uk_lash/tr.d041:trMA.Ode9C11.incipit	…
ltx/en_uk_lash/tr.d041:trMA.Ode9C11.melody	@ltx/en_uk_lash/he.h.m5:heHE.IsaiaChoreve.name
ltx/en_uk_lash/tr.d041:trMA.Ode9C11.mode	@ltx/en_uk_lash/miscellanea:misc.Mode5
ltx/en_uk_lash/tr.d041:trMA.Ode9C11.ode	@ltx/en_uk_lash/miscellanea:misc.Ode9
ltx/en_uk_lash/tr.d041:trMA.Ode9C11.text	
ltx/en_uk_lash/tr.d041:trMA.Ode9C12.incipit	…
ltx/en_uk_lash/tr.d041:trMA.Ode9C12.melody	@ltx/en_uk_lash/he.h.m5:heHE.IsaiaChoreve.name
ltx/en_uk_lash/tr.d041:trMA.Ode9C12.mode	@ltx/en_uk_lash/miscellanea:misc.Mode5
ltx/en_uk_lash/tr.d041:trMA.Ode9C12.ode	@ltx/en_uk_lash/miscellanea:misc.Ode9
ltx/en_uk_lash/tr.d041:trMA.Ode9C12.text	
ltx/en_uk_lash/tr.d041:trMA.Ode9C13.incipit	…
ltx/en_uk_lash/tr.d041:trMA.Ode9C13.melody	@ltx/en_uk_lash/he.h.m5:heHE.IsaiaChoreve.name
ltx/en_uk_lash/tr.d041:trMA.Ode9C13.mode	@ltx/en_uk_lash/miscellanea:misc.Mode5
ltx/en_uk_lash/tr.d041:trMA.Ode9C13.ode	@ltx/en_uk_lash/miscellanea:misc.Ode9
ltx/en_uk_lash/tr.d041:trMA.Ode9C13.text	
ltx/en_uk_lash/tr.d041:trMA.Ode9C1T.incipit	…
ltx/en_uk_lash/tr.d041:trMA.Ode9C1T.melody	@ltx/en_uk_lash/he.h.m5:heHE.IsaiaChoreve.name
ltx/en_uk_lash/tr.d041:trMA.Ode9C1T.mode	@ltx/en_uk_lash/miscellanea:misc.Mode5
ltx/en_uk_lash/tr.d041:trMA.Ode9C1T.ode	@ltx/en_uk_lash/miscellanea:misc.Ode9
ltx/en_uk_lash/tr.d041:trMA.Ode9C1T.text	
ltx/en_uk_lash/tr.d041:trMA.Ode9C21.greekmelody	@ltx/en_uk_lash/he.h.m1:heHE.SeInPerEideMoysis.greekname
ltx/en_uk_lash/tr.d041:trMA.Ode9C21.incipit	…
ltx/en_uk_lash/tr.d041:trMA.Ode9C21.melody	@ltx/en_uk_lash/he.h.m1:heHE.SeInPerEideMoysis.name
ltx/en_uk_lash/tr.d041:trMA.Ode9C21.mode	@ltx/en_uk_lash/miscellanea:misc.Mode1
ltx/en_uk_lash/tr.d041:trMA.Ode9C21.ode	@ltx/en_uk_lash/miscellanea:misc.Ode9
ltx/en_uk_lash/tr.d041:trMA.Ode9C21.text	
ltx/en_uk_lash/tr.d041:trMA.Ode9C22.incipit	…
ltx/en_uk_lash/tr.d041:trMA.Ode9C22.melody	@ltx/en_uk_lash/he.h.m1:heHE.SeInPerEideMoysis.name
ltx/en_uk_lash/tr.d041:trMA.Ode9C22.mode	@ltx/en_uk_lash/miscellanea:misc.Mode1
ltx/en_uk_lash/tr.d041:trMA.Ode9C22.ode	@ltx/en_uk_lash/miscellanea:misc.Ode9
ltx/en_uk_lash/tr.d041:trMA.Ode9C22.text	
ltx/en_uk_lash/tr.d041:trMA.Ode9C2A1.incipit	…
ltx/en_uk_lash/tr.d041:trMA.Ode9C2A1.melody	@ltx/en_uk_lash/he.h.m1:heHE.SeInPerEideMoysis.name
ltx/en_uk_lash/tr.d041:trMA.Ode9C2A1.mode	@ltx/en_uk_lash/miscellanea:misc.Mode1
ltx/en_uk_lash/tr.d041:trMA.Ode9C2A1.ode	@ltx/en_uk_lash/miscellanea:misc.Ode9
ltx/en_uk_lash/tr.d041:trMA.Ode9C2A1.text	
ltx/en_uk_lash/tr.d041:trMA.Ode9C2H.greekmelody	@ltx/en_uk_lash/he.h.m1:heHE.SeInPerEideMoysis.greekname
ltx/en_uk_lash/tr.d041:trMA.Ode9C2H.incipit	@ltx/en_uk_lash/he.h.m1:heHE.SeInPerEideMoysis.incipit
ltx/en_uk_lash/tr.d041:trMA.Ode9C2H.melody	@ltx/en_uk_lash/he.h.m1:heHE.SeInPerEideMoysis.melody
ltx/en_uk_lash/tr.d041:trMA.Ode9C2H.mode	@ltx/en_uk_lash/miscellanea:misc.Mode1
ltx/en_uk_lash/tr.d041:trMA.Ode9C2H.ode	@ltx/en_uk_lash/miscellanea:misc.Ode9
ltx/en_uk_lash/tr.d041:trMA.Ode9C2H.text	@ltx/en_uk_lash/he.h.m1:heHE.SeInPerEideMoysis.text
ltx/en_uk_lash/tr.d041:trMA.Ode9C2T.incipit	…
ltx/en_uk_lash/tr.d041:trMA.Ode9C2T.melody	@ltx/en_uk_lash/he.h.m1:heHE.SeInPerEideMoysis.name
ltx/en_uk_lash/tr.d041:trMA.Ode9C2T.mode	@ltx/en_uk_lash/miscellanea:misc.Mode1
ltx/en_uk_lash/tr.d041:trMA.Ode9C2T.ode	@ltx/en_uk_lash/miscellanea:misc.Ode9
ltx/en_uk_lash/tr.d041:trMA.Ode9C2T.text	
ltx/en_uk_lash/tr.d041:trMA.Ode9C2Tr.incipit	…
ltx/en_uk_lash/tr.d041:trMA.Ode9C2Tr.melody	@ltx/en_uk_lash/he.h.m1:heHE.SeInPerEideMoysis.name
ltx/en_uk_lash/tr.d041:trMA.Ode9C2Tr.mode	@ltx/en_uk_lash/miscellanea:misc.Mode1
ltx/en_uk_lash/tr.d041:trMA.Ode9C2Tr.ode	@ltx/en_uk_lash/miscellanea:misc.Ode9
ltx/en_uk_lash/tr.d041:trMA.Ode9C2Tr.text	
ltx/en_uk_lash/tr.d041:trTE.Troparion.incipit	With a word you perfected…
ltx/en_uk_lash/tr.d041:trTE.Troparion.melody	
ltx/en_uk_lash/tr.d041:trTE.Troparion.mode	@ltx/en_uk_lash/miscellanea:misc.Mode8
ltx/en_uk_lash/tr.d041:trTE.Troparion.text	With a word you perfected all things by your power, O God, and you brought us into being out of nothing. * Do not hand us over to our iniquities, we entreat you, sinless Lord.
ltx/en_uk_lash/tr.d041:trTE.Troparion2.incipit	Do not hand us over…
ltx/en_uk_lash/tr.d041:trTE.Troparion2.text	Do not hand us over to our iniquities, we entreat you, sinless Lord.
ltx/en_uk_lash/tr.d041:trVE.AposIdiomelon1.incipit	…
ltx/en_uk_lash/tr.d041:trVE.AposIdiomelon1.melody	@ltx/en_uk_lash/miscellanea:misc.Idiomelon
ltx/en_uk_lash/tr.d041:trVE.AposIdiomelon1.mode	@ltx/en_uk_lash/miscellanea:misc.Mode6
ltx/en_uk_lash/tr.d041:trVE.AposIdiomelon1.text	
ltx/en_uk_lash/tr.d041:trVE.AposMartyric.incipit	@ltx/en_uk_lash/oc.m6.d2:ocVE.Aposticha3.incipit
ltx/en_uk_lash/tr.d041:trVE.AposMartyric.melody	
ltx/en_uk_lash/tr.d041:trVE.AposMartyric.mode	@ltx/en_uk_lash/miscellanea:misc.Mode6
ltx/en_uk_lash/tr.d041:trVE.AposMartyric.text	@ltx/en_uk_lash/oc.m6.d2:ocVE.Aposticha3.text
ltx/en_uk_lash/tr.d041:trVE.AposTheotokion.greekmelody	@ltx/en_uk_lash/he.a.m6:heAU.TriimerosAnestis.greekname
ltx/en_uk_lash/tr.d041:trVE.AposTheotokion.incipit	@ltx/en_uk_lash/oc.m6.d4:ocVE.AposTheotokion.incipit
ltx/en_uk_lash/tr.d041:trVE.AposTheotokion.melody	@ltx/en_uk_lash/he.a.m6:heAU.TriimerosAnestis.notmetered
ltx/en_uk_lash/tr.d041:trVE.AposTheotokion.mode	@ltx/en_uk_lash/miscellanea:misc.Mode6
ltx/en_uk_lash/tr.d041:trVE.AposTheotokion.text	@ltx/en_uk_lash/oc.m6.d4:ocVE.AposTheotokion.text
ltx/en_uk_lash/tr.d041:trVE.Stichera01.greekmelody	@ltx/en_uk_lash/he.a.m5:heAU.ChairoisAskitikon.greekname
ltx/en_uk_lash/tr.d041:trVE.Stichera01.incipit	…
ltx/en_uk_lash/tr.d041:trVE.Stichera01.melody	@ltx/en_uk_lash/he.a.m5:heAU.ChairoisAskitikon.notmetered
ltx/en_uk_lash/tr.d041:trVE.Stichera01.mode	@ltx/en_uk_lash/miscellanea:misc.Mode5
ltx/en_uk_lash/tr.d041:trVE.Stichera01.poet	@ltx/en_uk_lash/poets:po.Iosif
ltx/en_uk_lash/tr.d041:trVE.Stichera01.text	
ltx/en_uk_lash/tr.d041:trVE.Stichera02.greekmelody	@ltx/en_uk_lash/he.a.m5:heAU.ChairoisAskitikon.greekname
ltx/en_uk_lash/tr.d041:trVE.Stichera02.incipit	…
ltx/en_uk_lash/tr.d041:trVE.Stichera02.melody	@ltx/en_uk_lash/he.a.m5:heAU.ChairoisAskitikon.notmetered
ltx/en_uk_lash/tr.d041:trVE.Stichera02.mode	@ltx/en_uk_lash/miscellanea:misc.Mode5
ltx/en_uk_lash/tr.d041:trVE.Stichera02.text	
ltx/en_uk_lash/tr.d041:trVE.Stichera03.greekmelody	@ltx/en_uk_lash/he.a.m1:heAU.NefelinSeFotos.greekname
ltx/en_uk_lash/tr.d041:trVE.Stichera03.incipit	…
ltx/en_uk_lash/tr.d041:trVE.Stichera03.melody	@ltx/en_uk_lash/he.a.m1:heAU.NefelinSeFotos.notmetered
ltx/en_uk_lash/tr.d041:trVE.Stichera03.mode	@ltx/en_uk_lash/miscellanea:misc.Mode1
ltx/en_uk_lash/tr.d041:trVE.Stichera03.poet	@ltx/en_uk_lash/poets:po.Theodorou
ltx/en_uk_lash/tr.d041:trVE.Stichera03.text	
