ltx/en_uk_lash/he.h.m7:heHE.AflektosPyri.greekname	
ltx/en_uk_lash/he.h.m7:heHE.AflektosPyri.incipit	Unconsumed by fire. …
ltx/en_uk_lash/he.h.m7:heHE.AflektosPyri.melody	@ltx/en_uk_lash/miscellanea:misc.Heirmos
ltx/en_uk_lash/he.h.m7:heHE.AflektosPyri.mode	@ltx/en_uk_lash/miscellanea:misc.Mode7
ltx/en_uk_lash/he.h.m7:heHE.AflektosPyri.name	Unconsumed by fire. (NM)
ltx/en_uk_lash/he.h.m7:heHE.AflektosPyri.ode	@ltx/en_uk_lash/miscellanea:misc.Ode8
ltx/en_uk_lash/he.h.m7:heHE.AflektosPyri.text	Unconsumed by fire, the bush on Sinai spoke and made God known to the slow-tongued Moses, clumsy in speech; and the burning zeal for God revealed the three young men unharmed by fire and singing, ''All you works of the Lord, praise the Lord, and highly exalt him to all the ages''.
ltx/en_uk_lash/he.h.m7:heHE.AkikoaTinAkoinSou.greekname	
ltx/en_uk_lash/he.h.m7:heHE.AkikoaTinAkoinSou.incipit	…
ltx/en_uk_lash/he.h.m7:heHE.AkikoaTinAkoinSou.melody	@ltx/en_uk_lash/miscellanea:misc.Heirmos
ltx/en_uk_lash/he.h.m7:heHE.AkikoaTinAkoinSou.mode	@ltx/en_uk_lash/miscellanea:misc.Mode7
ltx/en_uk_lash/he.h.m7:heHE.AkikoaTinAkoinSou.name	
ltx/en_uk_lash/he.h.m7:heHE.AkikoaTinAkoinSou.ode	@ltx/en_uk_lash/miscellanea:misc.Ode4
ltx/en_uk_lash/he.h.m7:heHE.AkikoaTinAkoinSou.text	
ltx/en_uk_lash/he.h.m7:heHE.AsomenToKyrio.greekname	
ltx/en_uk_lash/he.h.m7:heHE.AsomenToKyrio.incipit	…
ltx/en_uk_lash/he.h.m7:heHE.AsomenToKyrio.melody	@ltx/en_uk_lash/miscellanea:misc.Heirmos
ltx/en_uk_lash/he.h.m7:heHE.AsomenToKyrio.mode	@ltx/en_uk_lash/miscellanea:misc.Mode7
ltx/en_uk_lash/he.h.m7:heHE.AsomenToKyrio.name	
ltx/en_uk_lash/he.h.m7:heHE.AsomenToKyrio.ode	@ltx/en_uk_lash/miscellanea:misc.Ode1
ltx/en_uk_lash/he.h.m7:heHE.AsomenToKyrio.text	
ltx/en_uk_lash/he.h.m7:heHE.AsporouTokouSyllipsin.greekname	
ltx/en_uk_lash/he.h.m7:heHE.AsporouTokouSyllipsin.incipit	…
ltx/en_uk_lash/he.h.m7:heHE.AsporouTokouSyllipsin.melody	@ltx/en_uk_lash/miscellanea:misc.Heirmos
ltx/en_uk_lash/he.h.m7:heHE.AsporouTokouSyllipsin.mode	@ltx/en_uk_lash/miscellanea:misc.Mode7
ltx/en_uk_lash/he.h.m7:heHE.AsporouTokouSyllipsin.name	
ltx/en_uk_lash/he.h.m7:heHE.AsporouTokouSyllipsin.ode	@ltx/en_uk_lash/miscellanea:misc.Ode9
ltx/en_uk_lash/he.h.m7:heHE.AsporouTokouSyllipsin.text	
ltx/en_uk_lash/he.h.m7:heHE.DiaskedasasTinNykta.greekname	
ltx/en_uk_lash/he.h.m7:heHE.DiaskedasasTinNykta.incipit	…
ltx/en_uk_lash/he.h.m7:heHE.DiaskedasasTinNykta.melody	@ltx/en_uk_lash/miscellanea:misc.Heirmos
ltx/en_uk_lash/he.h.m7:heHE.DiaskedasasTinNykta.mode	@ltx/en_uk_lash/miscellanea:misc.Mode7
ltx/en_uk_lash/he.h.m7:heHE.DiaskedasasTinNykta.name	
ltx/en_uk_lash/he.h.m7:heHE.DiaskedasasTinNykta.ode	@ltx/en_uk_lash/miscellanea:misc.Ode5
ltx/en_uk_lash/he.h.m7:heHE.DiaskedasasTinNykta.text	
ltx/en_uk_lash/he.h.m7:heHE.EisakikoaTinAkoin.greekname	
ltx/en_uk_lash/he.h.m7:heHE.EisakikoaTinAkoin.incipit	…
ltx/en_uk_lash/he.h.m7:heHE.EisakikoaTinAkoin.melody	@ltx/en_uk_lash/miscellanea:misc.Heirmos
ltx/en_uk_lash/he.h.m7:heHE.EisakikoaTinAkoin.mode	@ltx/en_uk_lash/miscellanea:misc.Mode7
ltx/en_uk_lash/he.h.m7:heHE.EisakikoaTinAkoin.name	
ltx/en_uk_lash/he.h.m7:heHE.EisakikoaTinAkoin.ode	@ltx/en_uk_lash/miscellanea:misc.Ode4
ltx/en_uk_lash/he.h.m7:heHE.EisakikoaTinAkoin.text	
ltx/en_uk_lash/he.h.m7:heHE.EkalypsenOuranous.greekname	
ltx/en_uk_lash/he.h.m7:heHE.EkalypsenOuranous.incipit	Christ God, the virtue. …
ltx/en_uk_lash/he.h.m7:heHE.EkalypsenOuranous.melody	@ltx/en_uk_lash/miscellanea:misc.Heirmos
ltx/en_uk_lash/he.h.m7:heHE.EkalypsenOuranous.mode	@ltx/en_uk_lash/miscellanea:misc.Mode7
ltx/en_uk_lash/he.h.m7:heHE.EkalypsenOuranous.name	Christ God, the virtue. (NM)
ltx/en_uk_lash/he.h.m7:heHE.EkalypsenOuranous.ode	@ltx/en_uk_lash/miscellanea:misc.Ode4
ltx/en_uk_lash/he.h.m7:heHE.EkalypsenOuranous.text	
ltx/en_uk_lash/he.h.m7:heHE.EstereothiIKardiaMou.greekname	
ltx/en_uk_lash/he.h.m7:heHE.EstereothiIKardiaMou.incipit	…
ltx/en_uk_lash/he.h.m7:heHE.EstereothiIKardiaMou.melody	@ltx/en_uk_lash/miscellanea:misc.Heirmos
ltx/en_uk_lash/he.h.m7:heHE.EstereothiIKardiaMou.mode	@ltx/en_uk_lash/miscellanea:misc.Mode7
ltx/en_uk_lash/he.h.m7:heHE.EstereothiIKardiaMou.name	
ltx/en_uk_lash/he.h.m7:heHE.EstereothiIKardiaMou.ode	@ltx/en_uk_lash/miscellanea:misc.Ode3
ltx/en_uk_lash/he.h.m7:heHE.EstereothiIKardiaMou.text	
ltx/en_uk_lash/he.h.m7:heHE.EstereothiTiPistei.greekname	
ltx/en_uk_lash/he.h.m7:heHE.EstereothiTiPistei.incipit	…
ltx/en_uk_lash/he.h.m7:heHE.EstereothiTiPistei.melody	@ltx/en_uk_lash/miscellanea:misc.Heirmos
ltx/en_uk_lash/he.h.m7:heHE.EstereothiTiPistei.mode	@ltx/en_uk_lash/miscellanea:misc.Mode7
ltx/en_uk_lash/he.h.m7:heHE.EstereothiTiPistei.name	
ltx/en_uk_lash/he.h.m7:heHE.EstereothiTiPistei.ode	@ltx/en_uk_lash/miscellanea:misc.Ode3
ltx/en_uk_lash/he.h.m7:heHE.EstereothiTiPistei.text	
ltx/en_uk_lash/he.h.m7:heHE.KaminonKaiomenin.greekname	
ltx/en_uk_lash/he.h.m7:heHE.KaminonKaiomenin.incipit	…
ltx/en_uk_lash/he.h.m7:heHE.KaminonKaiomenin.melody	@ltx/en_uk_lash/miscellanea:misc.Heirmos
ltx/en_uk_lash/he.h.m7:heHE.KaminonKaiomenin.mode	@ltx/en_uk_lash/miscellanea:misc.Mode7
ltx/en_uk_lash/he.h.m7:heHE.KaminonKaiomenin.name	
ltx/en_uk_lash/he.h.m7:heHE.KaminonKaiomenin.ode	@ltx/en_uk_lash/miscellanea:misc.Ode7
ltx/en_uk_lash/he.h.m7:heHE.KaminonKaiomenin.text	
ltx/en_uk_lash/he.h.m7:heHE.KaminonPaides.greekname	
ltx/en_uk_lash/he.h.m7:heHE.KaminonPaides.incipit	The Youths of old revealed. …
ltx/en_uk_lash/he.h.m7:heHE.KaminonPaides.melody	@ltx/en_uk_lash/miscellanea:misc.Heirmos
ltx/en_uk_lash/he.h.m7:heHE.KaminonPaides.mode	@ltx/en_uk_lash/miscellanea:misc.Mode7
ltx/en_uk_lash/he.h.m7:heHE.KaminonPaides.name	The Youths of old revealed. (NM)
ltx/en_uk_lash/he.h.m7:heHE.KaminonPaides.ode	@ltx/en_uk_lash/miscellanea:misc.Ode7
ltx/en_uk_lash/he.h.m7:heHE.KaminonPaides.text	The Youths of old revealed the furnace that blazed with fire to be moist with dew, as they sang the praise of the one God and said, ''O highly exalted and highly glorified God of our Fathers''.
ltx/en_uk_lash/he.h.m7:heHE.KatanoonOProfitis.greekname	
ltx/en_uk_lash/he.h.m7:heHE.KatanoonOProfitis.incipit	The Prophet, O Christ. …
ltx/en_uk_lash/he.h.m7:heHE.KatanoonOProfitis.melody	@ltx/en_uk_lash/miscellanea:misc.Heirmos
ltx/en_uk_lash/he.h.m7:heHE.KatanoonOProfitis.mode	@ltx/en_uk_lash/miscellanea:misc.Mode7
ltx/en_uk_lash/he.h.m7:heHE.KatanoonOProfitis.name	The Prophet, O Christ. (NM)
ltx/en_uk_lash/he.h.m7:heHE.KatanoonOProfitis.ode	@ltx/en_uk_lash/miscellanea:misc.Ode4
ltx/en_uk_lash/he.h.m7:heHE.KatanoonOProfitis.text	The prophet, O Christ, perceiving your coming in the last times, cried out: I have heard of your power, Lord, for you have come to save all your anointed.
ltx/en_uk_lash/he.h.m7:heHE.KyrieOTheosMou.greekname	
ltx/en_uk_lash/he.h.m7:heHE.KyrieOTheosMou.incipit	O Lord my God. …
ltx/en_uk_lash/he.h.m7:heHE.KyrieOTheosMou.melody	@ltx/en_uk_lash/miscellanea:misc.Heirmos
ltx/en_uk_lash/he.h.m7:heHE.KyrieOTheosMou.mode	@ltx/en_uk_lash/miscellanea:misc.Mode7
ltx/en_uk_lash/he.h.m7:heHE.KyrieOTheosMou.name	O Lord my God. (NM)
ltx/en_uk_lash/he.h.m7:heHE.KyrieOTheosMou.ode	@ltx/en_uk_lash/miscellanea:misc.Ode5
ltx/en_uk_lash/he.h.m7:heHE.KyrieOTheosMou.text	Lord my God, from nightfall I watch at dawn and implore you: grant me forgiveness of offences, and direct my ways to the light of your commandments I pray.
ltx/en_uk_lash/he.h.m7:heHE.MiTisFthoras.greekname	
ltx/en_uk_lash/he.h.m7:heHE.MiTisFthoras.incipit	Conceiving without knowing corruption. …
ltx/en_uk_lash/he.h.m7:heHE.MiTisFthoras.melody	@ltx/en_uk_lash/miscellanea:misc.Heirmos
ltx/en_uk_lash/he.h.m7:heHE.MiTisFthoras.mode	@ltx/en_uk_lash/miscellanea:misc.Mode7
ltx/en_uk_lash/he.h.m7:heHE.MiTisFthoras.name	Conceiving without knowing corruption. (NM)
ltx/en_uk_lash/he.h.m7:heHE.MiTisFthoras.ode	@ltx/en_uk_lash/miscellanea:misc.Ode9
ltx/en_uk_lash/he.h.m7:heHE.MiTisFthoras.text	Conceiving without knowing corruption, lending your flesh to the Word, the deviser of all, Mother knowing no man, Virgin Mother of God, vessel of the uncontainable, space for your infinite Maker, we magnify you.
ltx/en_uk_lash/he.h.m7:heHE.MitirTheouKaiParthenos.greekname	
ltx/en_uk_lash/he.h.m7:heHE.MitirTheouKaiParthenos.incipit	Mother of God and Virgin. …
ltx/en_uk_lash/he.h.m7:heHE.MitirTheouKaiParthenos.melody	@ltx/en_uk_lash/miscellanea:misc.Heirmos
ltx/en_uk_lash/he.h.m7:heHE.MitirTheouKaiParthenos.mode	@ltx/en_uk_lash/miscellanea:misc.Mode7
ltx/en_uk_lash/he.h.m7:heHE.MitirTheouKaiParthenos.name	Mother of God and Virgin. (NM)
ltx/en_uk_lash/he.h.m7:heHE.MitirTheouKaiParthenos.ode	@ltx/en_uk_lash/miscellanea:misc.Ode9
ltx/en_uk_lash/he.h.m7:heHE.MitirTheouKaiParthenos.text	
ltx/en_uk_lash/he.h.m7:heHE.NaftionToSalo.greekname	
ltx/en_uk_lash/he.h.m7:heHE.NaftionToSalo.incipit	Sick on the rolling swell. …
ltx/en_uk_lash/he.h.m7:heHE.NaftionToSalo.melody	@ltx/en_uk_lash/miscellanea:misc.Heirmos
ltx/en_uk_lash/he.h.m7:heHE.NaftionToSalo.mode	@ltx/en_uk_lash/miscellanea:misc.Mode7
ltx/en_uk_lash/he.h.m7:heHE.NaftionToSalo.name	Sick on the rolling swell. (NM)
ltx/en_uk_lash/he.h.m7:heHE.NaftionToSalo.ode	@ltx/en_uk_lash/miscellanea:misc.Ode6
ltx/en_uk_lash/he.h.m7:heHE.NaftionToSalo.text	Sick on the rolling swell of the cares of this life, thrown overboard by the sins that sail with me and hurled to the soul-destroying beast, like Jonas I cry out to you, O Christ, ''Bring me up from this death-dealing deep''.
ltx/en_uk_lash/he.h.m7:heHE.NefseiSouProsGeodi.greekname	
ltx/en_uk_lash/he.h.m7:heHE.NefseiSouProsGeodi.incipit	At your behest, O Lord…
ltx/en_uk_lash/he.h.m7:heHE.NefseiSouProsGeodi.melody	@ltx/en_uk_lash/miscellanea:misc.Heirmos
ltx/en_uk_lash/he.h.m7:heHE.NefseiSouProsGeodi.mode	@ltx/en_uk_lash/miscellanea:misc.Mode7
ltx/en_uk_lash/he.h.m7:heHE.NefseiSouProsGeodi.name	By your will. (NM)
ltx/en_uk_lash/he.h.m7:heHE.NefseiSouProsGeodi.ode	@ltx/en_uk_lash/miscellanea:misc.Ode1
ltx/en_uk_lash/he.h.m7:heHE.NefseiSouProsGeodi.text	At your behest, O Lord, the nature of the waters that before flowed freely was transformed and became like earth; and so Israel having marched dryshod sings you a song of victory.
ltx/en_uk_lash/he.h.m7:heHE.NyxAfengis.greekname	
ltx/en_uk_lash/he.h.m7:heHE.NyxAfengis.incipit	Night is without light. …
ltx/en_uk_lash/he.h.m7:heHE.NyxAfengis.melody	@ltx/en_uk_lash/miscellanea:misc.Heirmos
ltx/en_uk_lash/he.h.m7:heHE.NyxAfengis.mode	@ltx/en_uk_lash/miscellanea:misc.Mode7
ltx/en_uk_lash/he.h.m7:heHE.NyxAfengis.name	Night is without light. (NM)
ltx/en_uk_lash/he.h.m7:heHE.NyxAfengis.ode	@ltx/en_uk_lash/miscellanea:misc.Ode5
ltx/en_uk_lash/he.h.m7:heHE.NyxAfengis.text	Night is without light for unbelievers, O Christ, but enlightenment to believers in the delight of divine words. Therefore I rise to you at dawn and sing the praise of your Godhead.
ltx/en_uk_lash/he.h.m7:heHE.OIonasEkKoilias.greekname	
ltx/en_uk_lash/he.h.m7:heHE.OIonasEkKoilias.incipit	Jonas from the bowels of Hell. …
ltx/en_uk_lash/he.h.m7:heHE.OIonasEkKoilias.melody	@ltx/en_uk_lash/miscellanea:misc.Heirmos
ltx/en_uk_lash/he.h.m7:heHE.OIonasEkKoilias.mode	@ltx/en_uk_lash/miscellanea:misc.Mode7
ltx/en_uk_lash/he.h.m7:heHE.OIonasEkKoilias.name	Jonas from the bowels of Hell. (NM)
ltx/en_uk_lash/he.h.m7:heHE.OIonasEkKoilias.ode	@ltx/en_uk_lash/miscellanea:misc.Ode6
ltx/en_uk_lash/he.h.m7:heHE.OIonasEkKoilias.text	
ltx/en_uk_lash/he.h.m7:heHE.OKatArchasTousOuranous.greekname	
ltx/en_uk_lash/he.h.m7:heHE.OKatArchasTousOuranous.incipit	Lord, who First You established. …
ltx/en_uk_lash/he.h.m7:heHE.OKatArchasTousOuranous.melody	@ltx/en_uk_lash/miscellanea:misc.Heirmos
ltx/en_uk_lash/he.h.m7:heHE.OKatArchasTousOuranous.mode	@ltx/en_uk_lash/miscellanea:misc.Mode7
ltx/en_uk_lash/he.h.m7:heHE.OKatArchasTousOuranous.name	Lord, who First You established. (NM)
ltx/en_uk_lash/he.h.m7:heHE.OKatArchasTousOuranous.ode	@ltx/en_uk_lash/miscellanea:misc.Ode3
ltx/en_uk_lash/he.h.m7:heHE.OKatArchasTousOuranous.text	Lord, Saviour, who established the heavens First You established by your all-powerful Word and by the divine and all-effecting Spirit all their power, establish me on the unshakeable rock of confession of you.
ltx/en_uk_lash/he.h.m7:heHE.OOuranousToLogo.greekname	
ltx/en_uk_lash/he.h.m7:heHE.OOuranousToLogo.incipit	You established the heavens. …
ltx/en_uk_lash/he.h.m7:heHE.OOuranousToLogo.melody	@ltx/en_uk_lash/miscellanea:misc.Heirmos
ltx/en_uk_lash/he.h.m7:heHE.OOuranousToLogo.mode	@ltx/en_uk_lash/miscellanea:misc.Mode7
ltx/en_uk_lash/he.h.m7:heHE.OOuranousToLogo.name	You established the heavens. (NM)
ltx/en_uk_lash/he.h.m7:heHE.OOuranousToLogo.ode	@ltx/en_uk_lash/miscellanea:misc.Ode1
ltx/en_uk_lash/he.h.m7:heHE.OOuranousToLogo.text	
ltx/en_uk_lash/he.h.m7:heHE.OPatrikousKolpous.greekname	
ltx/en_uk_lash/he.h.m7:heHE.OPatrikousKolpous.incipit	Christ God, who did not leave. …
ltx/en_uk_lash/he.h.m7:heHE.OPatrikousKolpous.melody	@ltx/en_uk_lash/miscellanea:misc.Heirmos
ltx/en_uk_lash/he.h.m7:heHE.OPatrikousKolpous.mode	@ltx/en_uk_lash/miscellanea:misc.Mode7
ltx/en_uk_lash/he.h.m7:heHE.OPatrikousKolpous.name	Christ God, who did not leave. (NM)
ltx/en_uk_lash/he.h.m7:heHE.OPatrikousKolpous.ode	@ltx/en_uk_lash/miscellanea:misc.Ode4
ltx/en_uk_lash/he.h.m7:heHE.OPatrikousKolpous.text	Christ God, who did not leave the Father''s bosom and who came down to earth, I have heard of the mystery of your dispensation and I have glorified you, only Lover of humankind.
ltx/en_uk_lash/he.h.m7:heHE.OStereosasToLogo.greekname	
ltx/en_uk_lash/he.h.m7:heHE.OStereosasToLogo.incipit	…
ltx/en_uk_lash/he.h.m7:heHE.OStereosasToLogo.melody	@ltx/en_uk_lash/miscellanea:misc.Heirmos
ltx/en_uk_lash/he.h.m7:heHE.OStereosasToLogo.mode	@ltx/en_uk_lash/miscellanea:misc.Mode7
ltx/en_uk_lash/he.h.m7:heHE.OStereosasToLogo.name	
ltx/en_uk_lash/he.h.m7:heHE.OStereosasToLogo.ode	@ltx/en_uk_lash/miscellanea:misc.Ode3
ltx/en_uk_lash/he.h.m7:heHE.OStereosasToLogo.text	
ltx/en_uk_lash/he.h.m7:heHE.OTonPateron.greekname	
ltx/en_uk_lash/he.h.m7:heHE.OTonPateron.incipit	…
ltx/en_uk_lash/he.h.m7:heHE.OTonPateron.melody	@ltx/en_uk_lash/miscellanea:misc.Heirmos
ltx/en_uk_lash/he.h.m7:heHE.OTonPateron.mode	@ltx/en_uk_lash/miscellanea:misc.Mode7
ltx/en_uk_lash/he.h.m7:heHE.OTonPateron.name	
ltx/en_uk_lash/he.h.m7:heHE.OTonPateron.ode	@ltx/en_uk_lash/miscellanea:misc.Ode7
ltx/en_uk_lash/he.h.m7:heHE.OTonPateron.text	
ltx/en_uk_lash/he.h.m7:heHE.OiEnKaminoTouPyros.greekname	
ltx/en_uk_lash/he.h.m7:heHE.OiEnKaminoTouPyros.incipit	Cast into the furnace of fire. …
ltx/en_uk_lash/he.h.m7:heHE.OiEnKaminoTouPyros.melody	@ltx/en_uk_lash/miscellanea:misc.Heirmos
ltx/en_uk_lash/he.h.m7:heHE.OiEnKaminoTouPyros.mode	@ltx/en_uk_lash/miscellanea:misc.Mode7
ltx/en_uk_lash/he.h.m7:heHE.OiEnKaminoTouPyros.name	Cast into the furnace of fire. (NM)
ltx/en_uk_lash/he.h.m7:heHE.OiEnKaminoTouPyros.ode	@ltx/en_uk_lash/miscellanea:misc.Ode7
ltx/en_uk_lash/he.h.m7:heHE.OiEnKaminoTouPyros.text	Cast into the furnace of fire, the holy Youths changed the fire to dew through their hymns of praise, as thus they sang: Blessed are you, O Lord, the God of our fathers.
ltx/en_uk_lash/he.h.m7:heHE.OiOrthrizontesLoge.greekname	
ltx/en_uk_lash/he.h.m7:heHE.OiOrthrizontesLoge.incipit	We who rise at dawn. …
ltx/en_uk_lash/he.h.m7:heHE.OiOrthrizontesLoge.melody	@ltx/en_uk_lash/miscellanea:misc.Heirmos
ltx/en_uk_lash/he.h.m7:heHE.OiOrthrizontesLoge.mode	@ltx/en_uk_lash/miscellanea:misc.Mode7
ltx/en_uk_lash/he.h.m7:heHE.OiOrthrizontesLoge.name	We who rise at dawn. (NM)
ltx/en_uk_lash/he.h.m7:heHE.OiOrthrizontesLoge.ode	@ltx/en_uk_lash/miscellanea:misc.Ode5
ltx/en_uk_lash/he.h.m7:heHE.OiOrthrizontesLoge.text	
ltx/en_uk_lash/he.h.m7:heHE.OrthrizeiToPnevmaMou.greekname	
ltx/en_uk_lash/he.h.m7:heHE.OrthrizeiToPnevmaMou.incipit	At dawn my spirit rises. …
ltx/en_uk_lash/he.h.m7:heHE.OrthrizeiToPnevmaMou.melody	@ltx/en_uk_lash/miscellanea:misc.Heirmos
ltx/en_uk_lash/he.h.m7:heHE.OrthrizeiToPnevmaMou.mode	@ltx/en_uk_lash/miscellanea:misc.Mode7
ltx/en_uk_lash/he.h.m7:heHE.OrthrizeiToPnevmaMou.name	At dawn my spirit rises. (NM)
ltx/en_uk_lash/he.h.m7:heHE.OrthrizeiToPnevmaMou.ode	@ltx/en_uk_lash/miscellanea:misc.Ode5
ltx/en_uk_lash/he.h.m7:heHE.OrthrizeiToPnevmaMou.text	
ltx/en_uk_lash/he.h.m7:heHE.PanymniteTonOuranonYpsilotera.greekname	
ltx/en_uk_lash/he.h.m7:heHE.PanymniteTonOuranonYpsilotera.incipit	…
ltx/en_uk_lash/he.h.m7:heHE.PanymniteTonOuranonYpsilotera.melody	@ltx/en_uk_lash/miscellanea:misc.Heirmos
ltx/en_uk_lash/he.h.m7:heHE.PanymniteTonOuranonYpsilotera.mode	@ltx/en_uk_lash/miscellanea:misc.Mode7
ltx/en_uk_lash/he.h.m7:heHE.PanymniteTonOuranonYpsilotera.name	
ltx/en_uk_lash/he.h.m7:heHE.PanymniteTonOuranonYpsilotera.ode	@ltx/en_uk_lash/miscellanea:misc.Ode9
ltx/en_uk_lash/he.h.m7:heHE.PanymniteTonOuranonYpsilotera.text	
ltx/en_uk_lash/he.h.m7:heHE.PontoEkalypse.greekname	
ltx/en_uk_lash/he.h.m7:heHE.PontoEkalypse.incipit	He who brings wars. …
ltx/en_uk_lash/he.h.m7:heHE.PontoEkalypse.melody	@ltx/en_uk_lash/miscellanea:misc.Heirmos
ltx/en_uk_lash/he.h.m7:heHE.PontoEkalypse.mode	@ltx/en_uk_lash/miscellanea:misc.Mode7
ltx/en_uk_lash/he.h.m7:heHE.PontoEkalypse.name	He who brings wars. (NM)
ltx/en_uk_lash/he.h.m7:heHE.PontoEkalypse.ode	@ltx/en_uk_lash/miscellanea:misc.Ode1
ltx/en_uk_lash/he.h.m7:heHE.PontoEkalypse.text	He who brings wars to nothing with his upraised arm covered Pharao and his chariots in the deep; let us sing to him, for he has been glorified.
ltx/en_uk_lash/he.h.m7:heHE.ProsSeOrthrizo.greekname	
ltx/en_uk_lash/he.h.m7:heHE.ProsSeOrthrizo.incipit	…
ltx/en_uk_lash/he.h.m7:heHE.ProsSeOrthrizo.melody	@ltx/en_uk_lash/miscellanea:misc.Heirmos
ltx/en_uk_lash/he.h.m7:heHE.ProsSeOrthrizo.mode	@ltx/en_uk_lash/miscellanea:misc.Mode7
ltx/en_uk_lash/he.h.m7:heHE.ProsSeOrthrizo.name	
ltx/en_uk_lash/he.h.m7:heHE.ProsSeOrthrizo.ode	@ltx/en_uk_lash/miscellanea:misc.Ode5
ltx/en_uk_lash/he.h.m7:heHE.ProsSeOrthrizo.text	
ltx/en_uk_lash/he.h.m7:heHE.SeTinAchranton.greekname	
ltx/en_uk_lash/he.h.m7:heHE.SeTinAchranton.incipit	…
ltx/en_uk_lash/he.h.m7:heHE.SeTinAchranton.melody	@ltx/en_uk_lash/miscellanea:misc.Heirmos
ltx/en_uk_lash/he.h.m7:heHE.SeTinAchranton.mode	@ltx/en_uk_lash/miscellanea:misc.Mode7
ltx/en_uk_lash/he.h.m7:heHE.SeTinAchranton.name	
ltx/en_uk_lash/he.h.m7:heHE.SeTinAchranton.ode	@ltx/en_uk_lash/miscellanea:misc.Ode9
ltx/en_uk_lash/he.h.m7:heHE.SeTinAchranton.text	
ltx/en_uk_lash/he.h.m7:heHE.StereomaMouGenou.greekname	
ltx/en_uk_lash/he.h.m7:heHE.StereomaMouGenou.incipit	Be my firm foundation. …
ltx/en_uk_lash/he.h.m7:heHE.StereomaMouGenou.melody	@ltx/en_uk_lash/miscellanea:misc.Heirmos
ltx/en_uk_lash/he.h.m7:heHE.StereomaMouGenou.mode	@ltx/en_uk_lash/miscellanea:misc.Mode7
ltx/en_uk_lash/he.h.m7:heHE.StereomaMouGenou.name	Be my firm foundation. (NM)
ltx/en_uk_lash/he.h.m7:heHE.StereomaMouGenou.ode	@ltx/en_uk_lash/miscellanea:misc.Ode3
ltx/en_uk_lash/he.h.m7:heHE.StereomaMouGenou.text	
ltx/en_uk_lash/he.h.m7:heHE.TinEnsarkonParousianSou.greekname	
ltx/en_uk_lash/he.h.m7:heHE.TinEnsarkonParousianSou.incipit	…
ltx/en_uk_lash/he.h.m7:heHE.TinEnsarkonParousianSou.melody	@ltx/en_uk_lash/miscellanea:misc.Heirmos
ltx/en_uk_lash/he.h.m7:heHE.TinEnsarkonParousianSou.mode	@ltx/en_uk_lash/miscellanea:misc.Mode7
ltx/en_uk_lash/he.h.m7:heHE.TinEnsarkonParousianSou.name	
ltx/en_uk_lash/he.h.m7:heHE.TinEnsarkonParousianSou.ode	@ltx/en_uk_lash/miscellanea:misc.Ode4
ltx/en_uk_lash/he.h.m7:heHE.TinEnsarkonParousianSou.text	
ltx/en_uk_lash/he.h.m7:heHE.TinExYpsousDynamin.greekname	
ltx/en_uk_lash/he.h.m7:heHE.TinExYpsousDynamin.incipit	You told your Disciples. …
ltx/en_uk_lash/he.h.m7:heHE.TinExYpsousDynamin.melody	@ltx/en_uk_lash/miscellanea:misc.Heirmos
ltx/en_uk_lash/he.h.m7:heHE.TinExYpsousDynamin.mode	@ltx/en_uk_lash/miscellanea:misc.Mode7
ltx/en_uk_lash/he.h.m7:heHE.TinExYpsousDynamin.name	You told your Disciples. (NM)
ltx/en_uk_lash/he.h.m7:heHE.TinExYpsousDynamin.ode	@ltx/en_uk_lash/miscellanea:misc.Ode3
ltx/en_uk_lash/he.h.m7:heHE.TinExYpsousDynamin.text	You told your Disciples, O Christ: Wait in Jerusalem, until you are clothed with the power from on high; while I will send you another Advocate as myself, my Spirit and the Father''s, in whom you will be established.
ltx/en_uk_lash/he.h.m7:heHE.TinYperFysinMitera.greekname	
ltx/en_uk_lash/he.h.m7:heHE.TinYperFysinMitera.incipit	The Mother beyond nature. …
ltx/en_uk_lash/he.h.m7:heHE.TinYperFysinMitera.melody	@ltx/en_uk_lash/miscellanea:misc.Heirmos
ltx/en_uk_lash/he.h.m7:heHE.TinYperFysinMitera.mode	@ltx/en_uk_lash/miscellanea:misc.Mode7
ltx/en_uk_lash/he.h.m7:heHE.TinYperFysinMitera.name	The Mother beyond nature. (NM)
ltx/en_uk_lash/he.h.m7:heHE.TinYperFysinMitera.ode	@ltx/en_uk_lash/miscellanea:misc.Ode9
ltx/en_uk_lash/he.h.m7:heHE.TinYperFysinMitera.text	
ltx/en_uk_lash/he.h.m7:heHE.ToDiaTonFovonSou.greekname	
ltx/en_uk_lash/he.h.m7:heHE.ToDiaTonFovonSou.incipit	Through fear of you. …
ltx/en_uk_lash/he.h.m7:heHE.ToDiaTonFovonSou.melody	@ltx/en_uk_lash/miscellanea:misc.Heirmos
ltx/en_uk_lash/he.h.m7:heHE.ToDiaTonFovonSou.mode	@ltx/en_uk_lash/miscellanea:misc.Mode7
ltx/en_uk_lash/he.h.m7:heHE.ToDiaTonFovonSou.name	Through fear of you. (NM)
ltx/en_uk_lash/he.h.m7:heHE.ToDiaTonFovonSou.ode	@ltx/en_uk_lash/miscellanea:misc.Ode5
ltx/en_uk_lash/he.h.m7:heHE.ToDiaTonFovonSou.text	Through fear of you, Lord, the Spirit of salvation, conceived in the womb of the Prophets, and brought to birth on earth, creates clean hearts in the Apostles, and renews a right Spirit in the faithful; for your commandments are light and peace.
ltx/en_uk_lash/he.h.m7:heHE.ToEktinaxantiTheo.greekname	
ltx/en_uk_lash/he.h.m7:heHE.ToEktinaxantiTheo.incipit	…
ltx/en_uk_lash/he.h.m7:heHE.ToEktinaxantiTheo.melody	@ltx/en_uk_lash/miscellanea:misc.Heirmos
ltx/en_uk_lash/he.h.m7:heHE.ToEktinaxantiTheo.mode	@ltx/en_uk_lash/miscellanea:misc.Mode7
ltx/en_uk_lash/he.h.m7:heHE.ToEktinaxantiTheo.name	
ltx/en_uk_lash/he.h.m7:heHE.ToEktinaxantiTheo.ode	@ltx/en_uk_lash/miscellanea:misc.Ode1
ltx/en_uk_lash/he.h.m7:heHE.ToEktinaxantiTheo.text	
ltx/en_uk_lash/he.h.m7:heHE.ToSynergisantiTheo.greekname	
ltx/en_uk_lash/he.h.m7:heHE.ToSynergisantiTheo.incipit	To God who worked. …
ltx/en_uk_lash/he.h.m7:heHE.ToSynergisantiTheo.melody	@ltx/en_uk_lash/miscellanea:misc.Heirmos
ltx/en_uk_lash/he.h.m7:heHE.ToSynergisantiTheo.mode	@ltx/en_uk_lash/miscellanea:misc.Mode7
ltx/en_uk_lash/he.h.m7:heHE.ToSynergisantiTheo.name	To God who worked. (NM)
ltx/en_uk_lash/he.h.m7:heHE.ToSynergisantiTheo.ode	@ltx/en_uk_lash/miscellanea:misc.Ode1
ltx/en_uk_lash/he.h.m7:heHE.ToSynergisantiTheo.text	
ltx/en_uk_lash/he.h.m7:heHE.ToSyntripsantiPolemous.greekname	
ltx/en_uk_lash/he.h.m7:heHE.ToSyntripsantiPolemous.incipit	…
ltx/en_uk_lash/he.h.m7:heHE.ToSyntripsantiPolemous.melody	@ltx/en_uk_lash/miscellanea:misc.Heirmos
ltx/en_uk_lash/he.h.m7:heHE.ToSyntripsantiPolemous.mode	@ltx/en_uk_lash/miscellanea:misc.Mode7
ltx/en_uk_lash/he.h.m7:heHE.ToSyntripsantiPolemous.name	
ltx/en_uk_lash/he.h.m7:heHE.ToSyntripsantiPolemous.ode	@ltx/en_uk_lash/miscellanea:misc.Ode1
ltx/en_uk_lash/he.h.m7:heHE.ToSyntripsantiPolemous.text	
ltx/en_uk_lash/he.h.m7:heHE.TonFoveronToisCherouvim.greekname	
ltx/en_uk_lash/he.h.m7:heHE.TonFoveronToisCherouvim.incipit	…
ltx/en_uk_lash/he.h.m7:heHE.TonFoveronToisCherouvim.melody	@ltx/en_uk_lash/miscellanea:misc.Heirmos
ltx/en_uk_lash/he.h.m7:heHE.TonFoveronToisCherouvim.mode	@ltx/en_uk_lash/miscellanea:misc.Mode7
ltx/en_uk_lash/he.h.m7:heHE.TonFoveronToisCherouvim.name	
ltx/en_uk_lash/he.h.m7:heHE.TonFoveronToisCherouvim.ode	@ltx/en_uk_lash/miscellanea:misc.Ode8
ltx/en_uk_lash/he.h.m7:heHE.TonFoveronToisCherouvim.text	
ltx/en_uk_lash/he.h.m7:heHE.TonMononAnarchon.greekname	
ltx/en_uk_lash/he.h.m7:heHE.TonMononAnarchon.incipit	The King of glory, alone without beginning. …
ltx/en_uk_lash/he.h.m7:heHE.TonMononAnarchon.melody	@ltx/en_uk_lash/miscellanea:misc.Heirmos
ltx/en_uk_lash/he.h.m7:heHE.TonMononAnarchon.mode	@ltx/en_uk_lash/miscellanea:misc.Mode7
ltx/en_uk_lash/he.h.m7:heHE.TonMononAnarchon.name	The King of glory, alone without beginning. (NM)
ltx/en_uk_lash/he.h.m7:heHE.TonMononAnarchon.ode	@ltx/en_uk_lash/miscellanea:misc.Ode8
ltx/en_uk_lash/he.h.m7:heHE.TonMononAnarchon.text	
ltx/en_uk_lash/he.h.m7:heHE.TonYpAngelonAsigitos.greekname	
ltx/en_uk_lash/he.h.m7:heHE.TonYpAngelonAsigitos.incipit	…
ltx/en_uk_lash/he.h.m7:heHE.TonYpAngelonAsigitos.melody	@ltx/en_uk_lash/miscellanea:misc.Heirmos
ltx/en_uk_lash/he.h.m7:heHE.TonYpAngelonAsigitos.mode	@ltx/en_uk_lash/miscellanea:misc.Mode7
ltx/en_uk_lash/he.h.m7:heHE.TonYpAngelonAsigitos.name	
ltx/en_uk_lash/he.h.m7:heHE.TonYpAngelonAsigitos.ode	@ltx/en_uk_lash/miscellanea:misc.Ode8
ltx/en_uk_lash/he.h.m7:heHE.TonYpAngelonAsigitos.text	
ltx/en_uk_lash/he.h.m7:heHE.TousEnKaminoPaidasMimoumenoi.greekname	
ltx/en_uk_lash/he.h.m7:heHE.TousEnKaminoPaidasMimoumenoi.incipit	Imitating the Youths. …
ltx/en_uk_lash/he.h.m7:heHE.TousEnKaminoPaidasMimoumenoi.melody	@ltx/en_uk_lash/miscellanea:misc.Heirmos
ltx/en_uk_lash/he.h.m7:heHE.TousEnKaminoPaidasMimoumenoi.mode	@ltx/en_uk_lash/miscellanea:misc.Mode7
ltx/en_uk_lash/he.h.m7:heHE.TousEnKaminoPaidasMimoumenoi.name	Imitating the Youths. (NM)
ltx/en_uk_lash/he.h.m7:heHE.TousEnKaminoPaidasMimoumenoi.ode	@ltx/en_uk_lash/miscellanea:misc.Ode8
ltx/en_uk_lash/he.h.m7:heHE.TousEnKaminoPaidasMimoumenoi.text	
ltx/en_uk_lash/he.h.m7:heHE.TousEnKaminoPaidasOukEflexen.greekname	
ltx/en_uk_lash/he.h.m7:heHE.TousEnKaminoPaidasOukEflexen.incipit	…
ltx/en_uk_lash/he.h.m7:heHE.TousEnKaminoPaidasOukEflexen.melody	@ltx/en_uk_lash/miscellanea:misc.Heirmos
ltx/en_uk_lash/he.h.m7:heHE.TousEnKaminoPaidasOukEflexen.mode	@ltx/en_uk_lash/miscellanea:misc.Mode7
ltx/en_uk_lash/he.h.m7:heHE.TousEnKaminoPaidasOukEflexen.name	
ltx/en_uk_lash/he.h.m7:heHE.TousEnKaminoPaidasOukEflexen.ode	@ltx/en_uk_lash/miscellanea:misc.Ode7
ltx/en_uk_lash/he.h.m7:heHE.TousEnKaminoPaidasOukEflexen.text	
ltx/en_uk_lash/he.h.m7:heHE.VythoAmartimaton.greekname	
ltx/en_uk_lash/he.h.m7:heHE.VythoAmartimaton.incipit	…
ltx/en_uk_lash/he.h.m7:heHE.VythoAmartimaton.melody	@ltx/en_uk_lash/miscellanea:misc.Heirmos
ltx/en_uk_lash/he.h.m7:heHE.VythoAmartimaton.mode	@ltx/en_uk_lash/miscellanea:misc.Mode7
ltx/en_uk_lash/he.h.m7:heHE.VythoAmartimaton.name	
ltx/en_uk_lash/he.h.m7:heHE.VythoAmartimaton.ode	@ltx/en_uk_lash/miscellanea:misc.Ode6
ltx/en_uk_lash/he.h.m7:heHE.VythoAmartimaton.text	
