ltx/en_uk_lash/oc.m7.d1:ocBK.ModeNaked	@ltx/en_uk_lash/miscellanea:misc.Mode7.naked
ltx/en_uk_lash/oc.m7.d1:ocBK.mode.title	PERIOD OF TONE 7
ltx/en_uk_lash/oc.m7.d1:ocGE.MM.BothHeirmologic.text	@ltx/en_uk_lash/properties:media.key
ltx/en_uk_lash/oc.m7.d1:ocGE.MM.BothSticheraric.text	@ltx/en_uk_lash/properties:media.key
ltx/en_uk_lash/oc.m7.d1:ocGE.MM.GloryHeirmologic.text	@ltx/en_uk_lash/properties:media.key
ltx/en_uk_lash/oc.m7.d1:ocGE.MM.GlorySticheraric.text	@ltx/en_uk_lash/properties:media.key
ltx/en_uk_lash/oc.m7.d1:ocLI.Beatitudes1.incipit	…
ltx/en_uk_lash/oc.m7.d1:ocLI.Beatitudes1.melody	
ltx/en_uk_lash/oc.m7.d1:ocLI.Beatitudes1.mode	@ltx/en_uk_lash/miscellanea:misc.Mode7
ltx/en_uk_lash/oc.m7.d1:ocLI.Beatitudes1.text	
ltx/en_uk_lash/oc.m7.d1:ocLI.Beatitudes2.incipit	…
ltx/en_uk_lash/oc.m7.d1:ocLI.Beatitudes2.melody	
ltx/en_uk_lash/oc.m7.d1:ocLI.Beatitudes2.mode	@ltx/en_uk_lash/miscellanea:misc.Mode7
ltx/en_uk_lash/oc.m7.d1:ocLI.Beatitudes2.text	
ltx/en_uk_lash/oc.m7.d1:ocLI.Beatitudes3.incipit	…
ltx/en_uk_lash/oc.m7.d1:ocLI.Beatitudes3.melody	
ltx/en_uk_lash/oc.m7.d1:ocLI.Beatitudes3.mode	@ltx/en_uk_lash/miscellanea:misc.Mode7
ltx/en_uk_lash/oc.m7.d1:ocLI.Beatitudes3.text	
ltx/en_uk_lash/oc.m7.d1:ocLI.Beatitudes4.incipit	…
ltx/en_uk_lash/oc.m7.d1:ocLI.Beatitudes4.melody	
ltx/en_uk_lash/oc.m7.d1:ocLI.Beatitudes4.mode	@ltx/en_uk_lash/miscellanea:misc.Mode7
ltx/en_uk_lash/oc.m7.d1:ocLI.Beatitudes4.text	
ltx/en_uk_lash/oc.m7.d1:ocLI.Beatitudes5.incipit	…
ltx/en_uk_lash/oc.m7.d1:ocLI.Beatitudes5.melody	
ltx/en_uk_lash/oc.m7.d1:ocLI.Beatitudes5.mode	@ltx/en_uk_lash/miscellanea:misc.Mode7
ltx/en_uk_lash/oc.m7.d1:ocLI.Beatitudes5.text	
ltx/en_uk_lash/oc.m7.d1:ocLI.Beatitudes6.incipit	…
ltx/en_uk_lash/oc.m7.d1:ocLI.Beatitudes6.melody	
ltx/en_uk_lash/oc.m7.d1:ocLI.Beatitudes6.mode	@ltx/en_uk_lash/miscellanea:misc.Mode7
ltx/en_uk_lash/oc.m7.d1:ocLI.Beatitudes6.text	
ltx/en_uk_lash/oc.m7.d1:ocLI.BeatitudesT.incipit	…
ltx/en_uk_lash/oc.m7.d1:ocLI.BeatitudesT.melody	
ltx/en_uk_lash/oc.m7.d1:ocLI.BeatitudesT.mode	@ltx/en_uk_lash/miscellanea:misc.Mode7
ltx/en_uk_lash/oc.m7.d1:ocLI.BeatitudesT.text	
ltx/en_uk_lash/oc.m7.d1:ocLI.BeatitudesTr.incipit	…
ltx/en_uk_lash/oc.m7.d1:ocLI.BeatitudesTr.melody	
ltx/en_uk_lash/oc.m7.d1:ocLI.BeatitudesTr.mode	@ltx/en_uk_lash/miscellanea:misc.Mode7
ltx/en_uk_lash/oc.m7.d1:ocLI.BeatitudesTr.text	
ltx/en_uk_lash/oc.m7.d1:ocMA.Antiphon11.incipit	You turned back the captivity…
ltx/en_uk_lash/oc.m7.d1:ocMA.Antiphon11.melody	
ltx/en_uk_lash/oc.m7.d1:ocMA.Antiphon11.mode	@ltx/en_uk_lash/miscellanea:misc.Mode7
ltx/en_uk_lash/oc.m7.d1:ocMA.Antiphon11.text	You turned back the captivity of Sion from error, make me too live, O Saviour, seizing me from the slavery of the passions.
ltx/en_uk_lash/oc.m7.d1:ocMA.Antiphon12.incipit	He who sows tribulations in…
ltx/en_uk_lash/oc.m7.d1:ocMA.Antiphon12.melody	
ltx/en_uk_lash/oc.m7.d1:ocMA.Antiphon12.mode	@ltx/en_uk_lash/miscellanea:misc.Mode7
ltx/en_uk_lash/oc.m7.d1:ocMA.Antiphon12.text	He who sows tribulations in the south with tears of fasting, he will reap with joy sheaves of nourishment that lives for ever.
ltx/en_uk_lash/oc.m7.d1:ocMA.Antiphon13.incipit	In the Holy Spirit is…
ltx/en_uk_lash/oc.m7.d1:ocMA.Antiphon13.melody	
ltx/en_uk_lash/oc.m7.d1:ocMA.Antiphon13.mode	@ltx/en_uk_lash/miscellanea:misc.Mode7
ltx/en_uk_lash/oc.m7.d1:ocMA.Antiphon13.text	In the Holy Spirit is the source of divine treasures, from him come wisdom, understanding, fear; to him be praise, glory, honour and might.
ltx/en_uk_lash/oc.m7.d1:ocMA.Antiphon21.incipit	Unless the Lord build the…
ltx/en_uk_lash/oc.m7.d1:ocMA.Antiphon21.melody	
ltx/en_uk_lash/oc.m7.d1:ocMA.Antiphon21.mode	@ltx/en_uk_lash/miscellanea:misc.Mode7
ltx/en_uk_lash/oc.m7.d1:ocMA.Antiphon21.text	Unless the Lord build the house of the soul, we labour in vain; for without him no deed or word is perfected.
ltx/en_uk_lash/oc.m7.d1:ocMA.Antiphon22.incipit	Of the fruit of the…
ltx/en_uk_lash/oc.m7.d1:ocMA.Antiphon22.melody	
ltx/en_uk_lash/oc.m7.d1:ocMA.Antiphon22.mode	@ltx/en_uk_lash/miscellanea:misc.Mode7
ltx/en_uk_lash/oc.m7.d1:ocMA.Antiphon22.text	Of the fruit of the womb the Saints, moved by the Spirit, produce the Father''s teachings of filial adoption.
ltx/en_uk_lash/oc.m7.d1:ocMA.Antiphon23.incipit	By the Holy Spirit all…
ltx/en_uk_lash/oc.m7.d1:ocMA.Antiphon23.melody	
ltx/en_uk_lash/oc.m7.d1:ocMA.Antiphon23.mode	@ltx/en_uk_lash/miscellanea:misc.Mode7
ltx/en_uk_lash/oc.m7.d1:ocMA.Antiphon23.text	By the Holy Spirit all things have being; before all he is God, lordship of the universe, unapproachable Light, Life of all.
ltx/en_uk_lash/oc.m7.d1:ocMA.Antiphon31.incipit	Those who fear the Lord…
ltx/en_uk_lash/oc.m7.d1:ocMA.Antiphon31.melody	
ltx/en_uk_lash/oc.m7.d1:ocMA.Antiphon31.mode	@ltx/en_uk_lash/miscellanea:misc.Mode7
ltx/en_uk_lash/oc.m7.d1:ocMA.Antiphon31.text	Those who fear the Lord and find the ways of life, now and always are blest with unsullied glory.
ltx/en_uk_lash/oc.m7.d1:ocMA.Antiphon32.incipit	As you see your offspring…
ltx/en_uk_lash/oc.m7.d1:ocMA.Antiphon32.melody	
ltx/en_uk_lash/oc.m7.d1:ocMA.Antiphon32.mode	@ltx/en_uk_lash/miscellanea:misc.Mode7
ltx/en_uk_lash/oc.m7.d1:ocMA.Antiphon32.text	As you see your offspring like a shoot around your table, rejoice, be glad as you bring them to Christ the Chief Shepherd.
ltx/en_uk_lash/oc.m7.d1:ocMA.Antiphon33.incipit	In the Holy Spirit is…
ltx/en_uk_lash/oc.m7.d1:ocMA.Antiphon33.melody	
ltx/en_uk_lash/oc.m7.d1:ocMA.Antiphon33.mode	@ltx/en_uk_lash/miscellanea:misc.Mode7
ltx/en_uk_lash/oc.m7.d1:ocMA.Antiphon33.text	In the Holy Spirit is an abyss of graces, a wealth of glory and a great deep of judgements; for he is to be worshipped as identical in glory with the Father and the Son.
ltx/en_uk_lash/oc.m7.d1:ocMA.ApolTheotokion.incipit	…
ltx/en_uk_lash/oc.m7.d1:ocMA.ApolTheotokion.melody	
ltx/en_uk_lash/oc.m7.d1:ocMA.ApolTheotokion.mode	@ltx/en_uk_lash/miscellanea:misc.Mode7
ltx/en_uk_lash/oc.m7.d1:ocMA.ApolTheotokion.text	
ltx/en_uk_lash/oc.m7.d1:ocMA.C2.poet	@ltx/en_uk_lash/poets:po.Kosma
ltx/en_uk_lash/oc.m7.d1:ocMA.C3.acrostic.notice1	
ltx/en_uk_lash/oc.m7.d1:ocMA.C3.acrostic.title	
ltx/en_uk_lash/oc.m7.d1:ocMA.Hypakoe.incipit	Christ God, who took our…
ltx/en_uk_lash/oc.m7.d1:ocMA.Hypakoe.melody	
ltx/en_uk_lash/oc.m7.d1:ocMA.Hypakoe.mode	@ltx/en_uk_lash/miscellanea:misc.Mode7
ltx/en_uk_lash/oc.m7.d1:ocMA.Hypakoe.text	Christ God, who took our form and endured the Cross in the body, save me by your Resurrection, as you love humankind.
ltx/en_uk_lash/oc.m7.d1:ocMA.Kathisma11.incipit	When Life had been laid…
ltx/en_uk_lash/oc.m7.d1:ocMA.Kathisma11.melody	
ltx/en_uk_lash/oc.m7.d1:ocMA.Kathisma11.mode	@ltx/en_uk_lash/miscellanea:misc.Mode7
ltx/en_uk_lash/oc.m7.d1:ocMA.Kathisma11.text	When Life had been laid in the tomb and a seal laid on the stone, soldiers guarded Christ as a sleeping King and Angels glorified him as immortal God; while women cried aloud: The Lord has risen, granting the world his great mercy.
ltx/en_uk_lash/oc.m7.d1:ocMA.Kathisma12.incipit	By your burial for three…
ltx/en_uk_lash/oc.m7.d1:ocMA.Kathisma12.melody	
ltx/en_uk_lash/oc.m7.d1:ocMA.Kathisma12.mode	@ltx/en_uk_lash/miscellanea:misc.Mode7
ltx/en_uk_lash/oc.m7.d1:ocMA.Kathisma12.text	By your burial for three days you despoiled death, and by your life-bearing Rising you raised corrupted humanity, O Christ god, as you love humankind. Glory to you!
ltx/en_uk_lash/oc.m7.d1:ocMA.Kathisma13.incipit	Virgin Mother of God unceasingly…
ltx/en_uk_lash/oc.m7.d1:ocMA.Kathisma13.melody	
ltx/en_uk_lash/oc.m7.d1:ocMA.Kathisma13.mode	@ltx/en_uk_lash/miscellanea:misc.Mode7
ltx/en_uk_lash/oc.m7.d1:ocMA.Kathisma13.text	Virgin Mother of God unceasingly implore Christ God, who was crucified for us and rose again and destroyed the might of death, to save our souls.
ltx/en_uk_lash/oc.m7.d1:ocMA.Kathisma21.incipit	While the grave was sealed…
ltx/en_uk_lash/oc.m7.d1:ocMA.Kathisma21.melody	
ltx/en_uk_lash/oc.m7.d1:ocMA.Kathisma21.mode	@ltx/en_uk_lash/miscellanea:misc.Mode7
ltx/en_uk_lash/oc.m7.d1:ocMA.Kathisma21.text	While the grave was sealed, Christ God, you dawned as life from the tomb, and while the doors were shut you came, the resurrection of all, to your Disciples, through them renewing a right spirit for us, according to your great mercy.
ltx/en_uk_lash/oc.m7.d1:ocMA.Kathisma22.incipit	Bringing sweet spices with their…
ltx/en_uk_lash/oc.m7.d1:ocMA.Kathisma22.melody	
ltx/en_uk_lash/oc.m7.d1:ocMA.Kathisma22.mode	@ltx/en_uk_lash/miscellanea:misc.Mode7
ltx/en_uk_lash/oc.m7.d1:ocMA.Kathisma22.text	Bringing sweet spices with their tears, women ran to the grave, and while soldiers guarded you, the King of all, they said to one another: Who will roll away the stone for us? The Angel of great Counsel has risen, trampling on death. All-powerful Lord, glory to you!
ltx/en_uk_lash/oc.m7.d1:ocMA.Kathisma23.incipit	Hail full of grace, Virgin…
ltx/en_uk_lash/oc.m7.d1:ocMA.Kathisma23.melody	
ltx/en_uk_lash/oc.m7.d1:ocMA.Kathisma23.mode	@ltx/en_uk_lash/miscellanea:misc.Mode7
ltx/en_uk_lash/oc.m7.d1:ocMA.Kathisma23.text	Hail full of grace, Virgin Mother of God, haven and protection of the human race, for from you the Redeemer of the world took flesh, for you alone are Mother and Virgin, ever blessed and glorified; intercede with Christ God to grant the whole world peace.
ltx/en_uk_lash/oc.m7.d1:ocMA.Kontakion.incipit	No longer does the might…
ltx/en_uk_lash/oc.m7.d1:ocMA.Kontakion.melody	@ltx/en_uk_lash/he.a.m7:heAU.OukEtiKolyometha.notmetered
ltx/en_uk_lash/oc.m7.d1:ocMA.Kontakion.mode	@ltx/en_uk_lash/miscellanea:misc.Mode7
ltx/en_uk_lash/oc.m7.d1:ocMA.Kontakion.text	No longer does the might of death have power to keep mortals captive; for Christ came down, breaking in pieces and destroying its power. Now Hell is bound, the Prophets with one in joy declare, ''The Saviour has appeared to those with faith. Come out you faithful to the Resurrection!''
ltx/en_uk_lash/oc.m7.d1:ocMA.Lauds1.incipit	Christ has risen from the…
ltx/en_uk_lash/oc.m7.d1:ocMA.Lauds1.melody	
ltx/en_uk_lash/oc.m7.d1:ocMA.Lauds1.mode	@ltx/en_uk_lash/miscellanea:misc.Mode7
ltx/en_uk_lash/oc.m7.d1:ocMA.Lauds1.text	Christ has risen from the dead, loosing the bonds of death; earth proclaim the good tidings of great joy; heavens sing out the glory of God.
ltx/en_uk_lash/oc.m7.d1:ocMA.Lauds2.incipit	Having seen the Resurrection of…
ltx/en_uk_lash/oc.m7.d1:ocMA.Lauds2.melody	
ltx/en_uk_lash/oc.m7.d1:ocMA.Lauds2.mode	@ltx/en_uk_lash/miscellanea:misc.Mode7
ltx/en_uk_lash/oc.m7.d1:ocMA.Lauds2.text	Having seen the Resurrection of Christ, let us worship holy Lord Jesus, the only sinless one.
ltx/en_uk_lash/oc.m7.d1:ocMA.Lauds3.incipit	We do not cease to…
ltx/en_uk_lash/oc.m7.d1:ocMA.Lauds3.melody	
ltx/en_uk_lash/oc.m7.d1:ocMA.Lauds3.mode	@ltx/en_uk_lash/miscellanea:misc.Mode7
ltx/en_uk_lash/oc.m7.d1:ocMA.Lauds3.text	We do not cease to worship Christ''s Resurrection, for he has saved us from our iniquities, holy is Lord Jesus who showed forth the Resurrection.
ltx/en_uk_lash/oc.m7.d1:ocMA.Lauds4.incipit	What return shall we make…
ltx/en_uk_lash/oc.m7.d1:ocMA.Lauds4.melody	
ltx/en_uk_lash/oc.m7.d1:ocMA.Lauds4.mode	@ltx/en_uk_lash/miscellanea:misc.Mode7
ltx/en_uk_lash/oc.m7.d1:ocMA.Lauds4.text	What return shall we make to the Lord for all that he has given back to us? For us God came among men; for our corrupted nature the Word became flesh and dwelt amongst us; the Benefactor to the ungrateful; the Liberator to the prisoners; the Sun of justice to those who sat in darkness; the impassible to the Cross; the Light to Hades; Life to death; Resurrection for the fallen: to him we cry out: Our God, glory to you!
ltx/en_uk_lash/oc.m7.d1:ocMA.Lauds5.incipit	By your mighty power, Lord…
ltx/en_uk_lash/oc.m7.d1:ocMA.Lauds5.melody	
ltx/en_uk_lash/oc.m7.d1:ocMA.Lauds5.mode	@ltx/en_uk_lash/miscellanea:misc.Mode7
ltx/en_uk_lash/oc.m7.d1:ocMA.Lauds5.text	By your mighty power, Lord, you have smashed the gates of Hades and destroyed the might of death; and raised with yourself the dead who slept from eternity in darkness, by your divine and glorious Resurrection, as King of the universe and all-powerful God.
ltx/en_uk_lash/oc.m7.d1:ocMA.Lauds6.incipit	Come, let us rejoice in…
ltx/en_uk_lash/oc.m7.d1:ocMA.Lauds6.melody	
ltx/en_uk_lash/oc.m7.d1:ocMA.Lauds6.mode	@ltx/en_uk_lash/miscellanea:misc.Mode7
ltx/en_uk_lash/oc.m7.d1:ocMA.Lauds6.text	Come, let us rejoice in the Lord and be glad in his Resurrection; for he has raised the dead with himself from the indissoluble bonds of Hades, and as God granted the world eternal life and his great mercy.
ltx/en_uk_lash/oc.m7.d1:ocMA.Lauds7.incipit	A dazzling Angel sat on…
ltx/en_uk_lash/oc.m7.d1:ocMA.Lauds7.melody	
ltx/en_uk_lash/oc.m7.d1:ocMA.Lauds7.mode	@ltx/en_uk_lash/miscellanea:misc.Mode7
ltx/en_uk_lash/oc.m7.d1:ocMA.Lauds7.text	A dazzling Angel sat on the stone of the grave that held Life, and gave the good tidings to the Myrrh-bearing women saying: The Lord has risen, as he foretold to you; announce to his Disciples that he goes before you into Galilee; while to the world he grants eternal life and his great mercy.
ltx/en_uk_lash/oc.m7.d1:ocMA.Lauds8.incipit	Lawless Jews, why did you…
ltx/en_uk_lash/oc.m7.d1:ocMA.Lauds8.melody	
ltx/en_uk_lash/oc.m7.d1:ocMA.Lauds8.mode	@ltx/en_uk_lash/miscellanea:misc.Mode7
ltx/en_uk_lash/oc.m7.d1:ocMA.Lauds8.text	Lawless Jews, why did you reject the Cornerstone? This is the stone which God placed in Sion, the God who made water spring from the rock in the wilderness, and poured immortality for us from his side; this is the stone which was hewn from the Virgin mountain, with the will of man, the Son of man who is coming on the clouds of heaven before the Ancient of days, as Daniel said, and his Kingdom is eternal.
ltx/en_uk_lash/oc.m7.d1:ocMA.MM.GodIsTheLord.text	@ltx/en_uk_lash/properties:media.key
ltx/en_uk_lash/oc.m7.d1:ocMA.MM.Lauds01.text	@ltx/en_uk_lash/properties:media.key
ltx/en_uk_lash/oc.m7.d1:ocMA.MM.Lauds02.text	@ltx/en_uk_lash/properties:media.key
ltx/en_uk_lash/oc.m7.d1:ocMA.MM.LaudsStichologia.text	
ltx/en_uk_lash/oc.m7.d1:ocMA.MM.Prokeimenon.text	@ltx/en_uk_lash/properties:media.key
ltx/en_uk_lash/oc.m7.d1:ocMA.Magnificat.incipit	@ltx/en_uk_lash/he.h.m6:heHE.TinTimioteran.incipit
ltx/en_uk_lash/oc.m7.d1:ocMA.Magnificat.mode	@ltx/en_uk_lash/miscellanea:misc.Mode7
ltx/en_uk_lash/oc.m7.d1:ocMA.Magnificat.text	@ltx/en_uk_lash/he.h.m6:heHE.TinTimioteran.text
ltx/en_uk_lash/oc.m7.d1:ocMA.OdeS1C11.incipit	The tyranny of death was…
ltx/en_uk_lash/oc.m7.d1:ocMA.OdeS1C11.melody	@ltx/en_uk_lash/he.h.m7:heHE.NefseiSouProsGeodi.name
ltx/en_uk_lash/oc.m7.d1:ocMA.OdeS1C11.mode	@ltx/en_uk_lash/miscellanea:misc.Mode7
ltx/en_uk_lash/oc.m7.d1:ocMA.OdeS1C11.ode	@ltx/en_uk_lash/miscellanea:misc.Ode1
ltx/en_uk_lash/oc.m7.d1:ocMA.OdeS1C11.text	The tyranny of death was judged through a tree, Lord, when you were condemned to an unjust death; and so the ruler of darkness had no power over you and was rightly cast out.
ltx/en_uk_lash/oc.m7.d1:ocMA.OdeS1C12.incipit	Hades drew near you and…
ltx/en_uk_lash/oc.m7.d1:ocMA.OdeS1C12.melody	@ltx/en_uk_lash/he.h.m7:heHE.NefseiSouProsGeodi.name
ltx/en_uk_lash/oc.m7.d1:ocMA.OdeS1C12.mode	@ltx/en_uk_lash/miscellanea:misc.Mode7
ltx/en_uk_lash/oc.m7.d1:ocMA.OdeS1C12.ode	@ltx/en_uk_lash/miscellanea:misc.Ode1
ltx/en_uk_lash/oc.m7.d1:ocMA.OdeS1C12.text	Hades drew near you and having no strength to crush your body with its teeth it broke its jaws; and so, O Saviour, loosing the pains of death, you rose on the third day.
ltx/en_uk_lash/oc.m7.d1:ocMA.OdeS1C1H.greekmelody	@ltx/en_uk_lash/he.h.m7:heHE.NefseiSouProsGeodi.greekname
ltx/en_uk_lash/oc.m7.d1:ocMA.OdeS1C1H.incipit	@ltx/en_uk_lash/he.h.m7:heHE.NefseiSouProsGeodi.incipit
ltx/en_uk_lash/oc.m7.d1:ocMA.OdeS1C1H.melody	@ltx/en_uk_lash/he.h.m7:heHE.NefseiSouProsGeodi.melody
ltx/en_uk_lash/oc.m7.d1:ocMA.OdeS1C1H.mode	@ltx/en_uk_lash/miscellanea:misc.Mode7
ltx/en_uk_lash/oc.m7.d1:ocMA.OdeS1C1H.ode	@ltx/en_uk_lash/miscellanea:misc.Ode1
ltx/en_uk_lash/oc.m7.d1:ocMA.OdeS1C1H.text	@ltx/en_uk_lash/he.h.m7:heHE.NefseiSouProsGeodi.text
ltx/en_uk_lash/oc.m7.d1:ocMA.OdeS1C1T.incipit	The pangs of the foremother…
ltx/en_uk_lash/oc.m7.d1:ocMA.OdeS1C1T.melody	@ltx/en_uk_lash/he.h.m7:heHE.NefseiSouProsGeodi.name
ltx/en_uk_lash/oc.m7.d1:ocMA.OdeS1C1T.mode	@ltx/en_uk_lash/miscellanea:misc.Mode7
ltx/en_uk_lash/oc.m7.d1:ocMA.OdeS1C1T.ode	@ltx/en_uk_lash/miscellanea:misc.Ode1
ltx/en_uk_lash/oc.m7.d1:ocMA.OdeS1C1T.text	The pangs of the foremother Eve have been abolished, for you escaped pangs when you gave birth without wedlock; and so knowing you to be truly Mother of God we all glorify you.
ltx/en_uk_lash/oc.m7.d1:ocMA.OdeS1C21.greekmelody	@ltx/en_uk_lash/he.h.m7:heHE.PontoEkalypse.greekname
ltx/en_uk_lash/oc.m7.d1:ocMA.OdeS1C21.incipit	Two life-bearing sources the Saviour…
ltx/en_uk_lash/oc.m7.d1:ocMA.OdeS1C21.melody	@ltx/en_uk_lash/he.h.m7:heHE.PontoEkalypse.name
ltx/en_uk_lash/oc.m7.d1:ocMA.OdeS1C21.mode	@ltx/en_uk_lash/miscellanea:misc.Mode7
ltx/en_uk_lash/oc.m7.d1:ocMA.OdeS1C21.ode	@ltx/en_uk_lash/miscellanea:misc.Ode1
ltx/en_uk_lash/oc.m7.d1:ocMA.OdeS1C21.text	Two life-bearing sources the Saviour poured out for us on the Cross from his pierced side. Let us sing to him, for he has been glorified.
ltx/en_uk_lash/oc.m7.d1:ocMA.OdeS1C22.incipit	By dwelling in a tomb…
ltx/en_uk_lash/oc.m7.d1:ocMA.OdeS1C22.melody	@ltx/en_uk_lash/he.h.m7:heHE.PontoEkalypse.name
ltx/en_uk_lash/oc.m7.d1:ocMA.OdeS1C22.mode	@ltx/en_uk_lash/miscellanea:misc.Mode7
ltx/en_uk_lash/oc.m7.d1:ocMA.OdeS1C22.ode	@ltx/en_uk_lash/miscellanea:misc.Ode1
ltx/en_uk_lash/oc.m7.d1:ocMA.OdeS1C22.text	By dwelling in a tomb and rising on the third day Christ granted mortals the expectation of incorruption. Let us sing to him, for he has been glorified.
ltx/en_uk_lash/oc.m7.d1:ocMA.OdeS1C2T.incipit	Alone you were revealed a…
ltx/en_uk_lash/oc.m7.d1:ocMA.OdeS1C2T.melody	@ltx/en_uk_lash/he.h.m7:heHE.PontoEkalypse.name
ltx/en_uk_lash/oc.m7.d1:ocMA.OdeS1C2T.mode	@ltx/en_uk_lash/miscellanea:misc.Mode7
ltx/en_uk_lash/oc.m7.d1:ocMA.OdeS1C2T.ode	@ltx/en_uk_lash/miscellanea:misc.Ode1
ltx/en_uk_lash/oc.m7.d1:ocMA.OdeS1C2T.text	Alone you were revealed a virgin even after child-birth; for you gave birth to the Creator of the world made flesh. Therefore we all cry to you, ''Hail!''
ltx/en_uk_lash/oc.m7.d1:ocMA.OdeS1C31.greekmelody	@ltx/en_uk_lash/he.h.m7:heHE.NefseiSouProsGeodi.greekname
ltx/en_uk_lash/oc.m7.d1:ocMA.OdeS1C31.incipit	O Virgin who gave birth…
ltx/en_uk_lash/oc.m7.d1:ocMA.OdeS1C31.melody	@ltx/en_uk_lash/he.h.m7:heHE.NefseiSouProsGeodi.name
ltx/en_uk_lash/oc.m7.d1:ocMA.OdeS1C31.mode	@ltx/en_uk_lash/miscellanea:misc.Mode7
ltx/en_uk_lash/oc.m7.d1:ocMA.OdeS1C31.ode	@ltx/en_uk_lash/miscellanea:misc.Ode1
ltx/en_uk_lash/oc.m7.d1:ocMA.OdeS1C31.text	O Virgin who gave birth of the abyss of compassion, flood my soul with your light-bearing radiance, that I may sing with love the praise of the abyss of your wonders.
ltx/en_uk_lash/oc.m7.d1:ocMA.OdeS1C32.incipit	Seeing us wounded by the…
ltx/en_uk_lash/oc.m7.d1:ocMA.OdeS1C32.melody	@ltx/en_uk_lash/he.h.m7:heHE.NefseiSouProsGeodi.name
ltx/en_uk_lash/oc.m7.d1:ocMA.OdeS1C32.mode	@ltx/en_uk_lash/miscellanea:misc.Mode7
ltx/en_uk_lash/oc.m7.d1:ocMA.OdeS1C32.ode	@ltx/en_uk_lash/miscellanea:misc.Ode1
ltx/en_uk_lash/oc.m7.d1:ocMA.OdeS1C32.text	Seeing us wounded by the arrow of sin, the Word took pity on us as benefactor. Therefore the One who is beyond godhead, O all-pure, was united ineffably to flesh from you.
ltx/en_uk_lash/oc.m7.d1:ocMA.OdeS1C33.incipit	Human nature had become subject…
ltx/en_uk_lash/oc.m7.d1:ocMA.OdeS1C33.melody	@ltx/en_uk_lash/he.h.m7:heHE.NefseiSouProsGeodi.name
ltx/en_uk_lash/oc.m7.d1:ocMA.OdeS1C33.mode	@ltx/en_uk_lash/miscellanea:misc.Mode7
ltx/en_uk_lash/oc.m7.d1:ocMA.OdeS1C33.ode	@ltx/en_uk_lash/miscellanea:misc.Ode1
ltx/en_uk_lash/oc.m7.d1:ocMA.OdeS1C33.text	Human nature had become subject to death, corruptible and mortal. But by conceiving life, O all-pure, you led it back from corruption to life.
ltx/en_uk_lash/oc.m7.d1:ocMA.OdeS3C11.incipit	Ascending the Tree for our…
ltx/en_uk_lash/oc.m7.d1:ocMA.OdeS3C11.melody	@ltx/en_uk_lash/he.h.m7:heHE.OKatArchasTousOuranous.name
ltx/en_uk_lash/oc.m7.d1:ocMA.OdeS3C11.mode	@ltx/en_uk_lash/miscellanea:misc.Mode7
ltx/en_uk_lash/oc.m7.d1:ocMA.OdeS3C11.ode	@ltx/en_uk_lash/miscellanea:misc.Ode3
ltx/en_uk_lash/oc.m7.d1:ocMA.OdeS3C11.text	Ascending the Tree for our sake, compassionate Saviour, willingly to suffer pain, you bear the wound, cause of peace and salvation for the faithful. Through it, O Merciful, we have all been reconciled to your Begetter.
ltx/en_uk_lash/oc.m7.d1:ocMA.OdeS3C12.incipit	You cleansed me, wounded in…
ltx/en_uk_lash/oc.m7.d1:ocMA.OdeS3C12.melody	@ltx/en_uk_lash/he.h.m7:heHE.OKatArchasTousOuranous.name
ltx/en_uk_lash/oc.m7.d1:ocMA.OdeS3C12.mode	@ltx/en_uk_lash/miscellanea:misc.Mode7
ltx/en_uk_lash/oc.m7.d1:ocMA.OdeS3C12.ode	@ltx/en_uk_lash/miscellanea:misc.Ode3
ltx/en_uk_lash/oc.m7.d1:ocMA.OdeS3C12.text	You cleansed me, wounded in soul by the bite of the serpent, of my wound, O Christ, and showed me light, who of old dwelt in darkness and corruption; for through the Cross you descended into Hades and raised me up with yourself.
ltx/en_uk_lash/oc.m7.d1:ocMA.OdeS3C1H.greekmelody	@ltx/en_uk_lash/he.h.m7:heHE.OKatArchasTousOuranous.greekname
ltx/en_uk_lash/oc.m7.d1:ocMA.OdeS3C1H.incipit	@ltx/en_uk_lash/he.h.m7:heHE.OKatArchasTousOuranous.incipit
ltx/en_uk_lash/oc.m7.d1:ocMA.OdeS3C1H.melody	@ltx/en_uk_lash/he.h.m7:heHE.OKatArchasTousOuranous.melody
ltx/en_uk_lash/oc.m7.d1:ocMA.OdeS3C1H.mode	@ltx/en_uk_lash/miscellanea:misc.Mode7
ltx/en_uk_lash/oc.m7.d1:ocMA.OdeS3C1H.ode	@ltx/en_uk_lash/miscellanea:misc.Ode3
ltx/en_uk_lash/oc.m7.d1:ocMA.OdeS3C1H.text	@ltx/en_uk_lash/he.h.m7:heHE.OKatArchasTousOuranous.text
ltx/en_uk_lash/oc.m7.d1:ocMA.OdeS3C1T.incipit	At the entreaties of your…
ltx/en_uk_lash/oc.m7.d1:ocMA.OdeS3C1T.melody	@ltx/en_uk_lash/he.h.m7:heHE.OKatArchasTousOuranous.name
ltx/en_uk_lash/oc.m7.d1:ocMA.OdeS3C1T.mode	@ltx/en_uk_lash/miscellanea:misc.Mode7
ltx/en_uk_lash/oc.m7.d1:ocMA.OdeS3C1T.ode	@ltx/en_uk_lash/miscellanea:misc.Ode3
ltx/en_uk_lash/oc.m7.d1:ocMA.OdeS3C1T.text	At the entreaties of your Mother who did not know man, grant peace to your world, O Saviour; give victory to the King over hostile barbarians and count those who glorify you worthy of your ineffable glory.
ltx/en_uk_lash/oc.m7.d1:ocMA.OdeS3C21.greekmelody	@ltx/en_uk_lash/he.h.m7:heHE.OOuranousToLogo.greekname
ltx/en_uk_lash/oc.m7.d1:ocMA.OdeS3C21.incipit	You endured the sufferings on…
ltx/en_uk_lash/oc.m7.d1:ocMA.OdeS3C21.melody	@ltx/en_uk_lash/he.h.m7:heHE.OOuranousToLogo.name
ltx/en_uk_lash/oc.m7.d1:ocMA.OdeS3C21.mode	@ltx/en_uk_lash/miscellanea:misc.Mode7
ltx/en_uk_lash/oc.m7.d1:ocMA.OdeS3C21.ode	@ltx/en_uk_lash/miscellanea:misc.Ode3
ltx/en_uk_lash/oc.m7.d1:ocMA.OdeS3C21.text	You endured the sufferings on the Cross and opened Paradise to the Thief, as benefactor and God; establish my mind to do your will, only Lover of humankind.
ltx/en_uk_lash/oc.m7.d1:ocMA.OdeS3C22.incipit	You rose from the tomb…
ltx/en_uk_lash/oc.m7.d1:ocMA.OdeS3C22.melody	@ltx/en_uk_lash/he.h.m7:heHE.OOuranousToLogo.name
ltx/en_uk_lash/oc.m7.d1:ocMA.OdeS3C22.mode	@ltx/en_uk_lash/miscellanea:misc.Mode7
ltx/en_uk_lash/oc.m7.d1:ocMA.OdeS3C22.ode	@ltx/en_uk_lash/miscellanea:misc.Ode3
ltx/en_uk_lash/oc.m7.d1:ocMA.OdeS3C22.text	You rose from the tomb on the third day and made life dawn for the world, as giver of life and God; establish my mind to do your will, only Lover of humankind.
ltx/en_uk_lash/oc.m7.d1:ocMA.OdeS3C2T.incipit	O Virgin-mother Mary, who conceived…
ltx/en_uk_lash/oc.m7.d1:ocMA.OdeS3C2T.melody	@ltx/en_uk_lash/he.h.m7:heHE.OOuranousToLogo.name
ltx/en_uk_lash/oc.m7.d1:ocMA.OdeS3C2T.mode	@ltx/en_uk_lash/miscellanea:misc.Mode7
ltx/en_uk_lash/oc.m7.d1:ocMA.OdeS3C2T.ode	@ltx/en_uk_lash/miscellanea:misc.Ode3
ltx/en_uk_lash/oc.m7.d1:ocMA.OdeS3C2T.text	O Virgin-mother Mary, who conceived God without seed and delivered Eve from the curse, entreat God who was incarnate from you to save your flock.
ltx/en_uk_lash/oc.m7.d1:ocMA.OdeS3C31.greekmelody	@ltx/en_uk_lash/he.h.m7:heHE.OKatArchasTousOuranous.greekname
ltx/en_uk_lash/oc.m7.d1:ocMA.OdeS3C31.incipit	A serpent crawling out of…
ltx/en_uk_lash/oc.m7.d1:ocMA.OdeS3C31.melody	@ltx/en_uk_lash/he.h.m7:heHE.OKatArchasTousOuranous.name
ltx/en_uk_lash/oc.m7.d1:ocMA.OdeS3C31.mode	@ltx/en_uk_lash/miscellanea:misc.Mode7
ltx/en_uk_lash/oc.m7.d1:ocMA.OdeS3C31.ode	@ltx/en_uk_lash/miscellanea:misc.Ode3
ltx/en_uk_lash/oc.m7.d1:ocMA.OdeS3C31.text	A serpent crawling out of Eden enticed me with a longing to be divine and hurled me to the earth. But he who is by nature compassionate and kind took pity on me and having dwelt in your womb and been made like me, O Virgin-Mother, he makes me divine.
ltx/en_uk_lash/oc.m7.d1:ocMA.OdeS3C32.incipit	Blessed is the fruit of…
ltx/en_uk_lash/oc.m7.d1:ocMA.OdeS3C32.melody	@ltx/en_uk_lash/he.h.m7:heHE.OKatArchasTousOuranous.name
ltx/en_uk_lash/oc.m7.d1:ocMA.OdeS3C32.mode	@ltx/en_uk_lash/miscellanea:misc.Mode7
ltx/en_uk_lash/oc.m7.d1:ocMA.OdeS3C32.ode	@ltx/en_uk_lash/miscellanea:misc.Ode3
ltx/en_uk_lash/oc.m7.d1:ocMA.OdeS3C32.text	Blessed is the fruit of your womb, Virgin Mother of God, the joy of all; for you gave birth to joy for all the world and to gladness that truly scatters the grief of sin, O Bride of God.
ltx/en_uk_lash/oc.m7.d1:ocMA.OdeS3C33.incipit	Virgin Mother of God, you…
ltx/en_uk_lash/oc.m7.d1:ocMA.OdeS3C33.melody	@ltx/en_uk_lash/he.h.m7:heHE.OKatArchasTousOuranous.name
ltx/en_uk_lash/oc.m7.d1:ocMA.OdeS3C33.mode	@ltx/en_uk_lash/miscellanea:misc.Mode7
ltx/en_uk_lash/oc.m7.d1:ocMA.OdeS3C33.ode	@ltx/en_uk_lash/miscellanea:misc.Ode3
ltx/en_uk_lash/oc.m7.d1:ocMA.OdeS3C33.text	Virgin Mother of God, you gave birth for us to eternal life and light and peace, ending the warfare of the old man against his Father and God by faith and the acknowledgement of grace.
ltx/en_uk_lash/oc.m7.d1:ocMA.OdeS4C11.incipit	The innocent Master who was…
ltx/en_uk_lash/oc.m7.d1:ocMA.OdeS4C11.melody	@ltx/en_uk_lash/he.h.m7:heHE.OPatrikousKolpous.name
ltx/en_uk_lash/oc.m7.d1:ocMA.OdeS4C11.mode	@ltx/en_uk_lash/miscellanea:misc.Mode7
ltx/en_uk_lash/oc.m7.d1:ocMA.OdeS4C11.ode	@ltx/en_uk_lash/miscellanea:misc.Ode4
ltx/en_uk_lash/oc.m7.d1:ocMA.OdeS4C11.text	The innocent Master who was incarnate from a Virgin, having given his own back to the scourges of a fallen slave, is maltreated, abolishing the charges against me.
ltx/en_uk_lash/oc.m7.d1:ocMA.OdeS4C12.incipit	The One who as God…
ltx/en_uk_lash/oc.m7.d1:ocMA.OdeS4C12.melody	@ltx/en_uk_lash/he.h.m7:heHE.OPatrikousKolpous.name
ltx/en_uk_lash/oc.m7.d1:ocMA.OdeS4C12.mode	@ltx/en_uk_lash/miscellanea:misc.Mode7
ltx/en_uk_lash/oc.m7.d1:ocMA.OdeS4C12.ode	@ltx/en_uk_lash/miscellanea:misc.Ode4
ltx/en_uk_lash/oc.m7.d1:ocMA.OdeS4C12.text	The One who as God fashioned humankind and who judges the whole earth with justice, standing before a tribunal of lawless judges, is examined like a culprit and struck by a hand of clay.
ltx/en_uk_lash/oc.m7.d1:ocMA.OdeS4C1H.greekmelody	@ltx/en_uk_lash/he.h.m7:heHE.OPatrikousKolpous.greekname
ltx/en_uk_lash/oc.m7.d1:ocMA.OdeS4C1H.incipit	@ltx/en_uk_lash/he.h.m7:heHE.OPatrikousKolpous.incipit
ltx/en_uk_lash/oc.m7.d1:ocMA.OdeS4C1H.melody	@ltx/en_uk_lash/he.h.m7:heHE.OPatrikousKolpous.melody
ltx/en_uk_lash/oc.m7.d1:ocMA.OdeS4C1H.mode	@ltx/en_uk_lash/miscellanea:misc.Mode7
ltx/en_uk_lash/oc.m7.d1:ocMA.OdeS4C1H.ode	@ltx/en_uk_lash/miscellanea:misc.Ode4
ltx/en_uk_lash/oc.m7.d1:ocMA.OdeS4C1H.text	@ltx/en_uk_lash/he.h.m7:heHE.OPatrikousKolpous.text
ltx/en_uk_lash/oc.m7.d1:ocMA.OdeS4C1T.incipit	As truly Mother of God…
ltx/en_uk_lash/oc.m7.d1:ocMA.OdeS4C1T.melody	@ltx/en_uk_lash/he.h.m7:heHE.OPatrikousKolpous.name
ltx/en_uk_lash/oc.m7.d1:ocMA.OdeS4C1T.mode	@ltx/en_uk_lash/miscellanea:misc.Mode7
ltx/en_uk_lash/oc.m7.d1:ocMA.OdeS4C1T.ode	@ltx/en_uk_lash/miscellanea:misc.Ode4
ltx/en_uk_lash/oc.m7.d1:ocMA.OdeS4C1T.text	As truly Mother of God, implore your Maker and Son to direct me, O all-blameless, to the saving harbour of his glorious will.
ltx/en_uk_lash/oc.m7.d1:ocMA.OdeS4C21.greekmelody	@ltx/en_uk_lash/he.h.m7:heHE.KatanoonOProfitis.greekname
ltx/en_uk_lash/oc.m7.d1:ocMA.OdeS4C21.incipit	O Lord, who do not…
ltx/en_uk_lash/oc.m7.d1:ocMA.OdeS4C21.melody	@ltx/en_uk_lash/he.h.m7:heHE.KatanoonOProfitis.name
ltx/en_uk_lash/oc.m7.d1:ocMA.OdeS4C21.mode	@ltx/en_uk_lash/miscellanea:misc.Mode7
ltx/en_uk_lash/oc.m7.d1:ocMA.OdeS4C21.ode	@ltx/en_uk_lash/miscellanea:misc.Ode4
ltx/en_uk_lash/oc.m7.d1:ocMA.OdeS4C21.text	O Lord, who do not know sin, because of which you became what you were not, you took a form that was another''s, that you might save the world and lure the tyrant and slay him.
ltx/en_uk_lash/oc.m7.d1:ocMA.OdeS4C22.incipit	You were hung upon a…
ltx/en_uk_lash/oc.m7.d1:ocMA.OdeS4C22.melody	@ltx/en_uk_lash/he.h.m7:heHE.KatanoonOProfitis.name
ltx/en_uk_lash/oc.m7.d1:ocMA.OdeS4C22.mode	@ltx/en_uk_lash/miscellanea:misc.Mode7
ltx/en_uk_lash/oc.m7.d1:ocMA.OdeS4C22.ode	@ltx/en_uk_lash/miscellanea:misc.Ode4
ltx/en_uk_lash/oc.m7.d1:ocMA.OdeS4C22.text	You were hung upon a cross, O Lord, and, having abolished the sin of our forefather Adam, you filled our foremother with joy; because you had come to save all your anointed.
ltx/en_uk_lash/oc.m7.d1:ocMA.OdeS4C2T.incipit	Born from a Virgin, you…
ltx/en_uk_lash/oc.m7.d1:ocMA.OdeS4C2T.melody	@ltx/en_uk_lash/he.h.m7:heHE.KatanoonOProfitis.name
ltx/en_uk_lash/oc.m7.d1:ocMA.OdeS4C2T.mode	@ltx/en_uk_lash/miscellanea:misc.Mode7
ltx/en_uk_lash/oc.m7.d1:ocMA.OdeS4C2T.ode	@ltx/en_uk_lash/miscellanea:misc.Ode4
ltx/en_uk_lash/oc.m7.d1:ocMA.OdeS4C2T.text	Born from a Virgin, you die, but you give life to Adam, who had been led astray of his own accord; for death too quailed at your strength, when you came to save all who had been corrupted.
ltx/en_uk_lash/oc.m7.d1:ocMA.OdeS4C31.greekmelody	@ltx/en_uk_lash/he.h.m7:heHE.OPatrikousKolpous.greekname
ltx/en_uk_lash/oc.m7.d1:ocMA.OdeS4C31.incipit	Wholly chosen and fair, you…
ltx/en_uk_lash/oc.m7.d1:ocMA.OdeS4C31.melody	@ltx/en_uk_lash/he.h.m7:heHE.OPatrikousKolpous.name
ltx/en_uk_lash/oc.m7.d1:ocMA.OdeS4C31.mode	@ltx/en_uk_lash/miscellanea:misc.Mode7
ltx/en_uk_lash/oc.m7.d1:ocMA.OdeS4C31.ode	@ltx/en_uk_lash/miscellanea:misc.Ode4
ltx/en_uk_lash/oc.m7.d1:ocMA.OdeS4C31.text	Wholly chosen and fair, you appeared to God before creation; by the splendour of the light that pours from you make radiant those who sing your praise.
ltx/en_uk_lash/oc.m7.d1:ocMA.OdeS4C32.incipit	Pure Virgin Mother, for mortals…
ltx/en_uk_lash/oc.m7.d1:ocMA.OdeS4C32.melody	@ltx/en_uk_lash/he.h.m7:heHE.OPatrikousKolpous.name
ltx/en_uk_lash/oc.m7.d1:ocMA.OdeS4C32.mode	@ltx/en_uk_lash/miscellanea:misc.Mode7
ltx/en_uk_lash/oc.m7.d1:ocMA.OdeS4C32.ode	@ltx/en_uk_lash/miscellanea:misc.Ode4
ltx/en_uk_lash/oc.m7.d1:ocMA.OdeS4C32.text	Pure Virgin Mother, for mortals you gave birth to God, incarnate from your pure blood, who redeems from many faults those who love honour you and sing your praise.
ltx/en_uk_lash/oc.m7.d1:ocMA.OdeS4C33.incipit	Rational nature, now initiated into…
ltx/en_uk_lash/oc.m7.d1:ocMA.OdeS4C33.melody	@ltx/en_uk_lash/he.h.m7:heHE.OPatrikousKolpous.name
ltx/en_uk_lash/oc.m7.d1:ocMA.OdeS4C33.mode	@ltx/en_uk_lash/miscellanea:misc.Mode7
ltx/en_uk_lash/oc.m7.d1:ocMA.OdeS4C33.ode	@ltx/en_uk_lash/miscellanea:misc.Ode4
ltx/en_uk_lash/oc.m7.d1:ocMA.OdeS4C33.text	Rational nature, now initiated into the ineffable mystery of your child-bearing, ministers as priest to the One who dawned from you, O All-praised.
ltx/en_uk_lash/oc.m7.d1:ocMA.OdeS5C11.incipit	You are sold on behalf…
ltx/en_uk_lash/oc.m7.d1:ocMA.OdeS5C11.melody	@ltx/en_uk_lash/he.h.m7:heHE.NyxAfengis.name
ltx/en_uk_lash/oc.m7.d1:ocMA.OdeS5C11.mode	@ltx/en_uk_lash/miscellanea:misc.Mode7
ltx/en_uk_lash/oc.m7.d1:ocMA.OdeS5C11.ode	@ltx/en_uk_lash/miscellanea:misc.Ode5
ltx/en_uk_lash/oc.m7.d1:ocMA.OdeS5C11.text	You are sold on behalf of your slaves, O Christ, and endure a blow, cause of freedom for those who sing to you. I rise to you at dawn and sing the praise of your Godhead.
ltx/en_uk_lash/oc.m7.d1:ocMA.OdeS5C12.incipit	By your divine power, O…
ltx/en_uk_lash/oc.m7.d1:ocMA.OdeS5C12.melody	@ltx/en_uk_lash/he.h.m7:heHE.NyxAfengis.name
ltx/en_uk_lash/oc.m7.d1:ocMA.OdeS5C12.mode	@ltx/en_uk_lash/miscellanea:misc.Mode7
ltx/en_uk_lash/oc.m7.d1:ocMA.OdeS5C12.ode	@ltx/en_uk_lash/miscellanea:misc.Ode5
ltx/en_uk_lash/oc.m7.d1:ocMA.OdeS5C12.text	By your divine power, O Christ, through the weakness of the flesh you overthrew the strong one and declared me victor over death, O Saviour, through your Resurrection.
ltx/en_uk_lash/oc.m7.d1:ocMA.OdeS5C1H.greekmelody	@ltx/en_uk_lash/he.h.m7:heHE.NyxAfengis.greekname
ltx/en_uk_lash/oc.m7.d1:ocMA.OdeS5C1H.incipit	@ltx/en_uk_lash/he.h.m7:heHE.NyxAfengis.incipit
ltx/en_uk_lash/oc.m7.d1:ocMA.OdeS5C1H.melody	@ltx/en_uk_lash/he.h.m7:heHE.NyxAfengis.melody
ltx/en_uk_lash/oc.m7.d1:ocMA.OdeS5C1H.mode	@ltx/en_uk_lash/miscellanea:misc.Mode7
ltx/en_uk_lash/oc.m7.d1:ocMA.OdeS5C1H.ode	@ltx/en_uk_lash/miscellanea:misc.Ode5
ltx/en_uk_lash/oc.m7.d1:ocMA.OdeS5C1H.text	@ltx/en_uk_lash/he.h.m7:heHE.NyxAfengis.text
ltx/en_uk_lash/oc.m7.d1:ocMA.OdeS5C1T.incipit	In a manner fitting God…
ltx/en_uk_lash/oc.m7.d1:ocMA.OdeS5C1T.melody	@ltx/en_uk_lash/he.h.m7:heHE.NyxAfengis.name
ltx/en_uk_lash/oc.m7.d1:ocMA.OdeS5C1T.mode	@ltx/en_uk_lash/miscellanea:misc.Mode7
ltx/en_uk_lash/oc.m7.d1:ocMA.OdeS5C1T.ode	@ltx/en_uk_lash/miscellanea:misc.Ode5
ltx/en_uk_lash/oc.m7.d1:ocMA.OdeS5C1T.text	In a manner fitting God, All-praised Mother, you gave birth to God become incarnate from you; since you did not know the marriage bed of a male, but you conceived from the holy Spirit.
ltx/en_uk_lash/oc.m7.d1:ocMA.OdeS5C21.greekmelody	@ltx/en_uk_lash/he.h.m7:heHE.KyrieOTheosMou.greekname
ltx/en_uk_lash/oc.m7.d1:ocMA.OdeS5C21.incipit	When, numbered with the lawless…
ltx/en_uk_lash/oc.m7.d1:ocMA.OdeS5C21.melody	@ltx/en_uk_lash/he.h.m7:heHE.KyrieOTheosMou.name
ltx/en_uk_lash/oc.m7.d1:ocMA.OdeS5C21.mode	@ltx/en_uk_lash/miscellanea:misc.Mode7
ltx/en_uk_lash/oc.m7.d1:ocMA.OdeS5C21.ode	@ltx/en_uk_lash/miscellanea:misc.Ode5
ltx/en_uk_lash/oc.m7.d1:ocMA.OdeS5C21.text	When, numbered with the lawless, you were lifted up on Calvary, the great lights hid themselves and the earth was shaken, and the splendour of the Temple was rent, showing the rejection of the Hebrews.
ltx/en_uk_lash/oc.m7.d1:ocMA.OdeS5C22.incipit	With hymns we glorify you…
ltx/en_uk_lash/oc.m7.d1:ocMA.OdeS5C22.melody	@ltx/en_uk_lash/he.h.m7:heHE.KyrieOTheosMou.name
ltx/en_uk_lash/oc.m7.d1:ocMA.OdeS5C22.mode	@ltx/en_uk_lash/miscellanea:misc.Mode7
ltx/en_uk_lash/oc.m7.d1:ocMA.OdeS5C22.ode	@ltx/en_uk_lash/miscellanea:misc.Ode5
ltx/en_uk_lash/oc.m7.d1:ocMA.OdeS5C22.text	With hymns we glorify you that destroyed all the power of the tyrant by the incomprehensible strength of your Godhead and raised the dead by your Resurrection.
ltx/en_uk_lash/oc.m7.d1:ocMA.OdeS5C2T.incipit	All-praised Mother of God, Mother…
ltx/en_uk_lash/oc.m7.d1:ocMA.OdeS5C2T.melody	@ltx/en_uk_lash/he.h.m7:heHE.KyrieOTheosMou.name
ltx/en_uk_lash/oc.m7.d1:ocMA.OdeS5C2T.mode	@ltx/en_uk_lash/miscellanea:misc.Mode7
ltx/en_uk_lash/oc.m7.d1:ocMA.OdeS5C2T.ode	@ltx/en_uk_lash/miscellanea:misc.Ode5
ltx/en_uk_lash/oc.m7.d1:ocMA.OdeS5C2T.text	All-praised Mother of God, Mother of the King and God, by your intercessions send down pardon of offences to those who with faith and love ever praise you in hymns.
ltx/en_uk_lash/oc.m7.d1:ocMA.OdeS5C31.greekmelody	@ltx/en_uk_lash/he.h.m7:heHE.KyrieOTheosMou.greekname
ltx/en_uk_lash/oc.m7.d1:ocMA.OdeS5C31.incipit	When Jacob saw a ladder…
ltx/en_uk_lash/oc.m7.d1:ocMA.OdeS5C31.melody	@ltx/en_uk_lash/he.h.m7:heHE.KyrieOTheosMou.name
ltx/en_uk_lash/oc.m7.d1:ocMA.OdeS5C31.mode	@ltx/en_uk_lash/miscellanea:misc.Mode7
ltx/en_uk_lash/oc.m7.d1:ocMA.OdeS5C31.ode	@ltx/en_uk_lash/miscellanea:misc.Ode5
ltx/en_uk_lash/oc.m7.d1:ocMA.OdeS5C31.text	When Jacob saw a ladder stretching to the heights he learned an image of your virginity; for through you, all-pure Lady, God associated with humankind.
ltx/en_uk_lash/oc.m7.d1:ocMA.OdeS5C32.incipit	O Virgin, as through you…
ltx/en_uk_lash/oc.m7.d1:ocMA.OdeS5C32.melody	@ltx/en_uk_lash/he.h.m7:heHE.KyrieOTheosMou.name
ltx/en_uk_lash/oc.m7.d1:ocMA.OdeS5C32.mode	@ltx/en_uk_lash/miscellanea:misc.Mode7
ltx/en_uk_lash/oc.m7.d1:ocMA.OdeS5C32.ode	@ltx/en_uk_lash/miscellanea:misc.Ode5
ltx/en_uk_lash/oc.m7.d1:ocMA.OdeS5C32.text	O Virgin, as through you we have now found eternal redemption, with eagerness we cry to you, ''Hail, Bride of God!'' And joyful in your light with hymns we sing to you, All-praised.
ltx/en_uk_lash/oc.m7.d1:ocMA.OdeS5C33.incipit	The Bridegroom found you, O…
ltx/en_uk_lash/oc.m7.d1:ocMA.OdeS5C33.melody	@ltx/en_uk_lash/he.h.m7:heHE.KyrieOTheosMou.name
ltx/en_uk_lash/oc.m7.d1:ocMA.OdeS5C33.mode	@ltx/en_uk_lash/miscellanea:misc.Mode7
ltx/en_uk_lash/oc.m7.d1:ocMA.OdeS5C33.ode	@ltx/en_uk_lash/miscellanea:misc.Ode5
ltx/en_uk_lash/oc.m7.d1:ocMA.OdeS5C33.text	The Bridegroom found you, O Virgin, only lily among thorns, shining with the brightness of purity and the light of virginity, he made you his Bride.
ltx/en_uk_lash/oc.m7.d1:ocMA.OdeS6C11.incipit	The souls of the righteous…
ltx/en_uk_lash/oc.m7.d1:ocMA.OdeS6C11.melody	@ltx/en_uk_lash/he.h.m7:heHE.NaftionToSalo.name
ltx/en_uk_lash/oc.m7.d1:ocMA.OdeS6C11.mode	@ltx/en_uk_lash/miscellanea:misc.Mode7
ltx/en_uk_lash/oc.m7.d1:ocMA.OdeS6C11.ode	@ltx/en_uk_lash/miscellanea:misc.Ode6
ltx/en_uk_lash/oc.m7.d1:ocMA.OdeS6C11.text	The souls of the righteous, shut up and forsaken in Hell, remembered you and prayed for salvation from you. This you granted through the Cross, O Christ, when in your compassion you went down to the regions below the earth.
ltx/en_uk_lash/oc.m7.d1:ocMA.OdeS6C12.incipit	The choir of the Apostles…
ltx/en_uk_lash/oc.m7.d1:ocMA.OdeS6C12.melody	@ltx/en_uk_lash/he.h.m7:heHE.NaftionToSalo.name
ltx/en_uk_lash/oc.m7.d1:ocMA.OdeS6C12.mode	@ltx/en_uk_lash/miscellanea:misc.Mode7
ltx/en_uk_lash/oc.m7.d1:ocMA.OdeS6C12.ode	@ltx/en_uk_lash/miscellanea:misc.Ode6
ltx/en_uk_lash/oc.m7.d1:ocMA.OdeS6C12.text	The choir of the Apostles despaired of looking again towards your living temple, not made with hands, that had been destroyed by sufferings. But worshipping beyond hope they proclaimed everywhere that it had been raised again.
ltx/en_uk_lash/oc.m7.d1:ocMA.OdeS6C1H.greekmelody	@ltx/en_uk_lash/he.h.m7:heHE.NaftionToSalo.greekname
ltx/en_uk_lash/oc.m7.d1:ocMA.OdeS6C1H.incipit	@ltx/en_uk_lash/he.h.m7:heHE.NaftionToSalo.incipit
ltx/en_uk_lash/oc.m7.d1:ocMA.OdeS6C1H.melody	@ltx/en_uk_lash/he.h.m7:heHE.NaftionToSalo.melody
ltx/en_uk_lash/oc.m7.d1:ocMA.OdeS6C1H.mode	@ltx/en_uk_lash/miscellanea:misc.Mode7
ltx/en_uk_lash/oc.m7.d1:ocMA.OdeS6C1H.ode	@ltx/en_uk_lash/miscellanea:misc.Ode6
ltx/en_uk_lash/oc.m7.d1:ocMA.OdeS6C1H.text	@ltx/en_uk_lash/he.h.m7:heHE.NaftionToSalo.text
ltx/en_uk_lash/oc.m7.d1:ocMA.OdeS6C1T.incipit	What human can explain the…
ltx/en_uk_lash/oc.m7.d1:ocMA.OdeS6C1T.melody	@ltx/en_uk_lash/he.h.m7:heHE.NaftionToSalo.name
ltx/en_uk_lash/oc.m7.d1:ocMA.OdeS6C1T.mode	@ltx/en_uk_lash/miscellanea:misc.Mode7
ltx/en_uk_lash/oc.m7.d1:ocMA.OdeS6C1T.ode	@ltx/en_uk_lash/miscellanea:misc.Ode6
ltx/en_uk_lash/oc.m7.d1:ocMA.OdeS6C1T.text	What human can explain the manner of your ineffable child-bearing for our sake, all-blameless Virgin, Bride of God? For God the Word, who is uncircumscribed, being made one with you, from you became flesh.
ltx/en_uk_lash/oc.m7.d1:ocMA.OdeS6C21.greekmelody	@ltx/en_uk_lash/he.h.m7:heHE.OIonasEkKoilias.greekname
ltx/en_uk_lash/oc.m7.d1:ocMA.OdeS6C21.incipit	Willingly lifted up on the…
ltx/en_uk_lash/oc.m7.d1:ocMA.OdeS6C21.melody	@ltx/en_uk_lash/he.h.m7:heHE.OIonasEkKoilias.name
ltx/en_uk_lash/oc.m7.d1:ocMA.OdeS6C21.mode	@ltx/en_uk_lash/miscellanea:misc.Mode7
ltx/en_uk_lash/oc.m7.d1:ocMA.OdeS6C21.ode	@ltx/en_uk_lash/miscellanea:misc.Ode6
ltx/en_uk_lash/oc.m7.d1:ocMA.OdeS6C21.text	Willingly lifted up on the Cross, O Saviour, you took prisoner the might of the foe. On it, loving Lord, you nailed the record of our sin.
ltx/en_uk_lash/oc.m7.d1:ocMA.OdeS6C22.incipit	When you rose from the…
ltx/en_uk_lash/oc.m7.d1:ocMA.OdeS6C22.melody	@ltx/en_uk_lash/he.h.m7:heHE.OIonasEkKoilias.name
ltx/en_uk_lash/oc.m7.d1:ocMA.OdeS6C22.mode	@ltx/en_uk_lash/miscellanea:misc.Mode7
ltx/en_uk_lash/oc.m7.d1:ocMA.OdeS6C22.ode	@ltx/en_uk_lash/miscellanea:misc.Ode6
ltx/en_uk_lash/oc.m7.d1:ocMA.OdeS6C22.text	When you rose from the dead, O Saviour, you raised up with you the human race, granting us life and incorruption, for you love humankind.
ltx/en_uk_lash/oc.m7.d1:ocMA.OdeS6C2T.incipit	Mother of God, do not…
ltx/en_uk_lash/oc.m7.d1:ocMA.OdeS6C2T.melody	@ltx/en_uk_lash/he.h.m7:heHE.OIonasEkKoilias.name
ltx/en_uk_lash/oc.m7.d1:ocMA.OdeS6C2T.mode	@ltx/en_uk_lash/miscellanea:misc.Mode7
ltx/en_uk_lash/oc.m7.d1:ocMA.OdeS6C2T.ode	@ltx/en_uk_lash/miscellanea:misc.Ode6
ltx/en_uk_lash/oc.m7.d1:ocMA.OdeS6C2T.text	Mother of God, do not cease to entreat our God, to whom you gave birth beyond explanation, that those who sing your praise, ever-Virgin, may be delivered from dangers.
ltx/en_uk_lash/oc.m7.d1:ocMA.OdeS6C31.greekmelody	@ltx/en_uk_lash/he.h.m7:heHE.NaftionToSalo.greekname
ltx/en_uk_lash/oc.m7.d1:ocMA.OdeS6C31.incipit	Types in the Law and…
ltx/en_uk_lash/oc.m7.d1:ocMA.OdeS6C31.melody	@ltx/en_uk_lash/he.h.m7:heHE.NaftionToSalo.name
ltx/en_uk_lash/oc.m7.d1:ocMA.OdeS6C31.mode	@ltx/en_uk_lash/miscellanea:misc.Mode7
ltx/en_uk_lash/oc.m7.d1:ocMA.OdeS6C31.ode	@ltx/en_uk_lash/miscellanea:misc.Ode6
ltx/en_uk_lash/oc.m7.d1:ocMA.OdeS6C31.text	Types in the Law and the sayings of the Prophets clearly foretold that you would give birth to the Benefactor of all creation, Pure Virgin, who in many and varied ways had bestowed benefits on those who with faith sing your praise.
ltx/en_uk_lash/oc.m7.d1:ocMA.OdeS6C32.incipit	Adam, the first-formed, was exiled…
ltx/en_uk_lash/oc.m7.d1:ocMA.OdeS6C32.melody	@ltx/en_uk_lash/he.h.m7:heHE.NaftionToSalo.name
ltx/en_uk_lash/oc.m7.d1:ocMA.OdeS6C32.mode	@ltx/en_uk_lash/miscellanea:misc.Mode7
ltx/en_uk_lash/oc.m7.d1:ocMA.OdeS6C32.ode	@ltx/en_uk_lash/miscellanea:misc.Ode6
ltx/en_uk_lash/oc.m7.d1:ocMA.OdeS6C32.text	Adam, the first-formed, was exiled of old by the plot of the slayer of mortals, from the delight of Paradise. But you, Virgin who knew not wedlock, led him back again, by giving birth to the One who delivered us from transgression.
ltx/en_uk_lash/oc.m7.d1:ocMA.OdeS6C33.incipit	The One who by his…
ltx/en_uk_lash/oc.m7.d1:ocMA.OdeS6C33.melody	@ltx/en_uk_lash/he.h.m7:heHE.NaftionToSalo.name
ltx/en_uk_lash/oc.m7.d1:ocMA.OdeS6C33.mode	@ltx/en_uk_lash/miscellanea:misc.Mode7
ltx/en_uk_lash/oc.m7.d1:ocMA.OdeS6C33.ode	@ltx/en_uk_lash/miscellanea:misc.Ode6
ltx/en_uk_lash/oc.m7.d1:ocMA.OdeS6C33.text	The One who by his divine purpose and creative power brought the universe into being from non-existence came forth from your womb, pure Virgin, and shone with the blaze of divine lightning on those in the shadow of death.
ltx/en_uk_lash/oc.m7.d1:ocMA.OdeS7C11.incipit	Adam having by his own…
ltx/en_uk_lash/oc.m7.d1:ocMA.OdeS7C11.melody	@ltx/en_uk_lash/he.h.m7:heHE.KaminonPaides.name
ltx/en_uk_lash/oc.m7.d1:ocMA.OdeS7C11.mode	@ltx/en_uk_lash/miscellanea:misc.Mode7
ltx/en_uk_lash/oc.m7.d1:ocMA.OdeS7C11.ode	@ltx/en_uk_lash/miscellanea:misc.Ode7
ltx/en_uk_lash/oc.m7.d1:ocMA.OdeS7C11.text	Adam having by his own will worked disobedience was slain by a tree, but by Christ''s obedience he was refashioned. Because for my sake was crucified the Son of God, the highly glorified.
ltx/en_uk_lash/oc.m7.d1:ocMA.OdeS7C12.incipit	All creation sang your praise…
ltx/en_uk_lash/oc.m7.d1:ocMA.OdeS7C12.melody	@ltx/en_uk_lash/he.h.m7:heHE.KaminonPaides.name
ltx/en_uk_lash/oc.m7.d1:ocMA.OdeS7C12.mode	@ltx/en_uk_lash/miscellanea:misc.Mode7
ltx/en_uk_lash/oc.m7.d1:ocMA.OdeS7C12.ode	@ltx/en_uk_lash/miscellanea:misc.Ode7
ltx/en_uk_lash/oc.m7.d1:ocMA.OdeS7C12.text	All creation sang your praise, O Christ, when you rose from the tomb; for you made life flower for those in Hades, resurrection for the dead and light for those in darkness, O highly glorified.
ltx/en_uk_lash/oc.m7.d1:ocMA.OdeS7C1H.greekmelody	@ltx/en_uk_lash/he.h.m7:heHE.KaminonPaides.greekname
ltx/en_uk_lash/oc.m7.d1:ocMA.OdeS7C1H.incipit	@ltx/en_uk_lash/he.h.m7:heHE.KaminonPaides.incipit
ltx/en_uk_lash/oc.m7.d1:ocMA.OdeS7C1H.melody	@ltx/en_uk_lash/he.h.m7:heHE.KaminonPaides.melody
ltx/en_uk_lash/oc.m7.d1:ocMA.OdeS7C1H.mode	@ltx/en_uk_lash/miscellanea:misc.Mode7
ltx/en_uk_lash/oc.m7.d1:ocMA.OdeS7C1H.ode	@ltx/en_uk_lash/miscellanea:misc.Ode7
ltx/en_uk_lash/oc.m7.d1:ocMA.OdeS7C1H.text	@ltx/en_uk_lash/he.h.m7:heHE.KaminonPaides.text
ltx/en_uk_lash/oc.m7.d1:ocMA.OdeS7C1T.incipit	Hail, daughter of Adam, who…
ltx/en_uk_lash/oc.m7.d1:ocMA.OdeS7C1T.melody	@ltx/en_uk_lash/he.h.m7:heHE.KaminonPaides.name
ltx/en_uk_lash/oc.m7.d1:ocMA.OdeS7C1T.mode	@ltx/en_uk_lash/miscellanea:misc.Mode7
ltx/en_uk_lash/oc.m7.d1:ocMA.OdeS7C1T.ode	@ltx/en_uk_lash/miscellanea:misc.Ode7
ltx/en_uk_lash/oc.m7.d1:ocMA.OdeS7C1T.text	Hail, daughter of Adam, who fell into corruption! Hail, only Bride of God! Hail, who bore God and through whom corruption was banished! Entreat him, Pure Virgin that we may all be saved.
ltx/en_uk_lash/oc.m7.d1:ocMA.OdeS7C21.greekmelody	@ltx/en_uk_lash/he.h.m7:heHE.OiEnKaminoTouPyros.greekname
ltx/en_uk_lash/oc.m7.d1:ocMA.OdeS7C21.incipit	On the Tree of the…
ltx/en_uk_lash/oc.m7.d1:ocMA.OdeS7C21.melody	@ltx/en_uk_lash/he.h.m7:heHE.OiEnKaminoTouPyros.name
ltx/en_uk_lash/oc.m7.d1:ocMA.OdeS7C21.mode	@ltx/en_uk_lash/miscellanea:misc.Mode7
ltx/en_uk_lash/oc.m7.d1:ocMA.OdeS7C21.ode	@ltx/en_uk_lash/miscellanea:misc.Ode7
ltx/en_uk_lash/oc.m7.d1:ocMA.OdeS7C21.text	On the Tree of the Cross you blunted the goad of sin, and by the lance in your side you abolished the record of Adam''s transgression. Blessed are you, O Lord, the God of our Fathers.
ltx/en_uk_lash/oc.m7.d1:ocMA.OdeS7C22.incipit	You were pierced in the…
ltx/en_uk_lash/oc.m7.d1:ocMA.OdeS7C22.melody	@ltx/en_uk_lash/he.h.m7:heHE.OiEnKaminoTouPyros.name
ltx/en_uk_lash/oc.m7.d1:ocMA.OdeS7C22.mode	@ltx/en_uk_lash/miscellanea:misc.Mode7
ltx/en_uk_lash/oc.m7.d1:ocMA.OdeS7C22.ode	@ltx/en_uk_lash/miscellanea:misc.Ode7
ltx/en_uk_lash/oc.m7.d1:ocMA.OdeS7C22.text	You were pierced in the side and with the drops of your divine Blood you cleaned the earth that had been polluted with the bloodshed of the folly of idolatry. Blessed are you, O Lord, the God of our Fathers.
ltx/en_uk_lash/oc.m7.d1:ocMA.OdeS7C2T.incipit	Mother of God, you made…
ltx/en_uk_lash/oc.m7.d1:ocMA.OdeS7C2T.melody	@ltx/en_uk_lash/he.h.m7:heHE.OiEnKaminoTouPyros.name
ltx/en_uk_lash/oc.m7.d1:ocMA.OdeS7C2T.mode	@ltx/en_uk_lash/miscellanea:misc.Mode7
ltx/en_uk_lash/oc.m7.d1:ocMA.OdeS7C2T.ode	@ltx/en_uk_lash/miscellanea:misc.Ode7
ltx/en_uk_lash/oc.m7.d1:ocMA.OdeS7C2T.text	Mother of God, you made the enlightenment that is before the sun dawn for world, Christ who delivered from darkness and enlightened all with knowledge of God, as they cried, Blessed are you, O Lord, the God of our Fathers.
ltx/en_uk_lash/oc.m7.d1:ocMA.OdeS7C31.greekmelody	@ltx/en_uk_lash/he.h.m7:heHE.KaminonPaides.greekname
ltx/en_uk_lash/oc.m7.d1:ocMA.OdeS7C31.incipit	Having you as his possession…
ltx/en_uk_lash/oc.m7.d1:ocMA.OdeS7C31.melody	@ltx/en_uk_lash/he.h.m7:heHE.KaminonPaides.name
ltx/en_uk_lash/oc.m7.d1:ocMA.OdeS7C31.mode	@ltx/en_uk_lash/miscellanea:misc.Mode7
ltx/en_uk_lash/oc.m7.d1:ocMA.OdeS7C31.ode	@ltx/en_uk_lash/miscellanea:misc.Ode7
ltx/en_uk_lash/oc.m7.d1:ocMA.OdeS7C31.text	Having you as his possession, O Virgin, an adornment wrought in gold, of many colours, he loved you, your Creator and Lord, the highly exalted and highly glorified God of our Fathers.
ltx/en_uk_lash/oc.m7.d1:ocMA.OdeS7C32.incipit	When Isaias of old received…
ltx/en_uk_lash/oc.m7.d1:ocMA.OdeS7C32.melody	@ltx/en_uk_lash/he.h.m7:heHE.KaminonPaides.name
ltx/en_uk_lash/oc.m7.d1:ocMA.OdeS7C32.mode	@ltx/en_uk_lash/miscellanea:misc.Mode7
ltx/en_uk_lash/oc.m7.d1:ocMA.OdeS7C32.ode	@ltx/en_uk_lash/miscellanea:misc.Ode7
ltx/en_uk_lash/oc.m7.d1:ocMA.OdeS7C32.text	When Isaias of old received the coal and was cleansed, O Maiden, he saw in symbol your Offspring, the highly exalted and highly glorified God of our Fathers.
ltx/en_uk_lash/oc.m7.d1:ocMA.OdeS7C33.incipit	When the godly Prophets of…
ltx/en_uk_lash/oc.m7.d1:ocMA.OdeS7C33.melody	@ltx/en_uk_lash/he.h.m7:heHE.KaminonPaides.name
ltx/en_uk_lash/oc.m7.d1:ocMA.OdeS7C33.mode	@ltx/en_uk_lash/miscellanea:misc.Mode7
ltx/en_uk_lash/oc.m7.d1:ocMA.OdeS7C33.ode	@ltx/en_uk_lash/miscellanea:misc.Ode7
ltx/en_uk_lash/oc.m7.d1:ocMA.OdeS7C33.text	When the godly Prophets of old saw symbols of your godly child-bearing they raise in harO Virgin, clothed in a robe of many coloursmony a song of praise and cried, ''O highly exalted and highly glorified God of our Fathers''.
ltx/en_uk_lash/oc.m7.d1:ocMA.OdeS8C11.incipit	The most-pure spiritual Lamb, slaughtered…
ltx/en_uk_lash/oc.m7.d1:ocMA.OdeS8C11.melody	@ltx/en_uk_lash/he.h.m7:heHE.AflektosPyri.name
ltx/en_uk_lash/oc.m7.d1:ocMA.OdeS8C11.mode	@ltx/en_uk_lash/miscellanea:misc.Mode7
ltx/en_uk_lash/oc.m7.d1:ocMA.OdeS8C11.ode	@ltx/en_uk_lash/miscellanea:misc.Ode8
ltx/en_uk_lash/oc.m7.d1:ocMA.OdeS8C11.text	The most-pure spiritual Lamb, slaughtered for the sake of the world, brought to an end the offerings according to the Law, purifying as God without transgressions the world which ever cries, ''All you works of the Lord, praise the Lord, and highly exalt him to all the ages''.
ltx/en_uk_lash/oc.m7.d1:ocMA.OdeS8C12.incipit	The flesh assumed by our…
ltx/en_uk_lash/oc.m7.d1:ocMA.OdeS8C12.melody	@ltx/en_uk_lash/he.h.m7:heHE.AflektosPyri.name
ltx/en_uk_lash/oc.m7.d1:ocMA.OdeS8C12.mode	@ltx/en_uk_lash/miscellanea:misc.Mode7
ltx/en_uk_lash/oc.m7.d1:ocMA.OdeS8C12.ode	@ltx/en_uk_lash/miscellanea:misc.Ode8
ltx/en_uk_lash/oc.m7.d1:ocMA.OdeS8C12.text	The flesh assumed by our Creator, which was not incorruptible before the Passion, after his Passion and his Rising was rendered inaccessible to corruption, and it makes mortals new as they cry, ''All you works of the Lord, praise the Lord, and highly exalt him to all the ages''.
ltx/en_uk_lash/oc.m7.d1:ocMA.OdeS8C1H.greekmelody	@ltx/en_uk_lash/he.h.m7:heHE.AflektosPyri.greekname
ltx/en_uk_lash/oc.m7.d1:ocMA.OdeS8C1H.incipit	@ltx/en_uk_lash/he.h.m7:heHE.AflektosPyri.incipit
ltx/en_uk_lash/oc.m7.d1:ocMA.OdeS8C1H.melody	@ltx/en_uk_lash/he.h.m7:heHE.AflektosPyri.melody
ltx/en_uk_lash/oc.m7.d1:ocMA.OdeS8C1H.mode	@ltx/en_uk_lash/miscellanea:misc.Mode7
ltx/en_uk_lash/oc.m7.d1:ocMA.OdeS8C1H.ode	@ltx/en_uk_lash/miscellanea:misc.Ode8
ltx/en_uk_lash/oc.m7.d1:ocMA.OdeS8C1H.text	@ltx/en_uk_lash/he.h.m7:heHE.AflektosPyri.text
ltx/en_uk_lash/oc.m7.d1:ocMA.OdeS8C1T.incipit	Your total purity and lack…
ltx/en_uk_lash/oc.m7.d1:ocMA.OdeS8C1T.melody	@ltx/en_uk_lash/he.h.m7:heHE.AflektosPyri.name
ltx/en_uk_lash/oc.m7.d1:ocMA.OdeS8C1T.mode	@ltx/en_uk_lash/miscellanea:misc.Mode7
ltx/en_uk_lash/oc.m7.d1:ocMA.OdeS8C1T.ode	@ltx/en_uk_lash/miscellanea:misc.Ode8
ltx/en_uk_lash/oc.m7.d1:ocMA.OdeS8C1T.text	Your total purity and lack of blemish, O Virgin, purified the inhabited world of filth and pollution, and you became for us, O all-pure, the cause of our being reconciled to God. Therefore, O Virgin, we bless and highly exalt you to all the ages.
ltx/en_uk_lash/oc.m7.d1:ocMA.OdeS8C21.greekmelody	@ltx/en_uk_lash/he.h.m7:heHE.TonMononAnarchon.greekname
ltx/en_uk_lash/oc.m7.d1:ocMA.OdeS8C21.incipit	The One who willingly endured…
ltx/en_uk_lash/oc.m7.d1:ocMA.OdeS8C21.melody	@ltx/en_uk_lash/he.h.m7:heHE.TonMononAnarchon.name
ltx/en_uk_lash/oc.m7.d1:ocMA.OdeS8C21.mode	@ltx/en_uk_lash/miscellanea:misc.Mode7
ltx/en_uk_lash/oc.m7.d1:ocMA.OdeS8C21.ode	@ltx/en_uk_lash/miscellanea:misc.Ode8
ltx/en_uk_lash/oc.m7.d1:ocMA.OdeS8C21.text	The One who willingly endured the Passion and by his own design was nailed to a Cross and abolished the powers of Hades, praise him, you Priests, highly exalt him, you peoples, to all the ages.
ltx/en_uk_lash/oc.m7.d1:ocMA.OdeS8C22.incipit	The One who made the…
ltx/en_uk_lash/oc.m7.d1:ocMA.OdeS8C22.melody	@ltx/en_uk_lash/he.h.m7:heHE.TonMononAnarchon.name
ltx/en_uk_lash/oc.m7.d1:ocMA.OdeS8C22.mode	@ltx/en_uk_lash/miscellanea:misc.Mode7
ltx/en_uk_lash/oc.m7.d1:ocMA.OdeS8C22.ode	@ltx/en_uk_lash/miscellanea:misc.Ode8
ltx/en_uk_lash/oc.m7.d1:ocMA.OdeS8C22.text	The One who made the might of death of no effect and who rose from the tomb in glory and saved the human race, praise him, you Priests, highly exalt him, you peoples, to all the ages.
ltx/en_uk_lash/oc.m7.d1:ocMA.OdeS8C2T.incipit	The Word, alone compassionate and…
ltx/en_uk_lash/oc.m7.d1:ocMA.OdeS8C2T.melody	@ltx/en_uk_lash/he.h.m7:heHE.TonMononAnarchon.name
ltx/en_uk_lash/oc.m7.d1:ocMA.OdeS8C2T.mode	@ltx/en_uk_lash/miscellanea:misc.Mode7
ltx/en_uk_lash/oc.m7.d1:ocMA.OdeS8C2T.ode	@ltx/en_uk_lash/miscellanea:misc.Ode8
ltx/en_uk_lash/oc.m7.d1:ocMA.OdeS8C2T.text	The Word, alone compassionate and pre-eternal, who was born in the last times from a Virgin and abolished the ancient curse, praise him, you Priests, highly exalt him, you peoples, to all the ages.
ltx/en_uk_lash/oc.m7.d1:ocMA.OdeS8C31.greekmelody	@ltx/en_uk_lash/he.h.m7:heHE.AflektosPyri.greekname
ltx/en_uk_lash/oc.m7.d1:ocMA.OdeS8C31.incipit	By the splendour of your…
ltx/en_uk_lash/oc.m7.d1:ocMA.OdeS8C31.melody	@ltx/en_uk_lash/he.h.m7:heHE.AflektosPyri.name
ltx/en_uk_lash/oc.m7.d1:ocMA.OdeS8C31.mode	@ltx/en_uk_lash/miscellanea:misc.Mode7
ltx/en_uk_lash/oc.m7.d1:ocMA.OdeS8C31.ode	@ltx/en_uk_lash/miscellanea:misc.Ode8
ltx/en_uk_lash/oc.m7.d1:ocMA.OdeS8C31.text	By the splendour of your child-bearing, Mother of God, you have marvellously enlightened the inhabited world. For you carry in your arms the true God, who makes radiant the faithful who ever cry, ''All you works of the Lord, praise the Lord, and highly exalt him to all the ages''.
ltx/en_uk_lash/oc.m7.d1:ocMA.OdeS8C32.incipit	Pure Virgin, we devoutly sing…
ltx/en_uk_lash/oc.m7.d1:ocMA.OdeS8C32.melody	@ltx/en_uk_lash/he.h.m7:heHE.AflektosPyri.name
ltx/en_uk_lash/oc.m7.d1:ocMA.OdeS8C32.mode	@ltx/en_uk_lash/miscellanea:misc.Mode7
ltx/en_uk_lash/oc.m7.d1:ocMA.OdeS8C32.ode	@ltx/en_uk_lash/miscellanea:misc.Ode8
ltx/en_uk_lash/oc.m7.d1:ocMA.OdeS8C32.text	Pure Virgin, we devoutly sing the praise of your womb which contained God, incarnate beyond explanation, who gives the enlightenment of the knowledge of God to all the faithful who ever cry, ''All you works of the Lord, praise the Lord, and highly exalt him to all the ages''.
ltx/en_uk_lash/oc.m7.d1:ocMA.OdeS8C33.incipit	With the bright rays of…
ltx/en_uk_lash/oc.m7.d1:ocMA.OdeS8C33.melody	@ltx/en_uk_lash/he.h.m7:heHE.AflektosPyri.name
ltx/en_uk_lash/oc.m7.d1:ocMA.OdeS8C33.mode	@ltx/en_uk_lash/miscellanea:misc.Mode7
ltx/en_uk_lash/oc.m7.d1:ocMA.OdeS8C33.ode	@ltx/en_uk_lash/miscellanea:misc.Ode8
ltx/en_uk_lash/oc.m7.d1:ocMA.OdeS8C33.text	With the bright rays of your light you make light those who sing your praise, pure Mother of God, parent of the light; for you appeared as tabernacle of light, making radiant with light those who ever cry, ''All you works of the Lord, praise the Lord, and highly exalt him to all the ages''.
ltx/en_uk_lash/oc.m7.d1:ocMA.OdeS9C11.incipit	Shut your mouths, all you…
ltx/en_uk_lash/oc.m7.d1:ocMA.OdeS9C11.melody	@ltx/en_uk_lash/he.h.m7:heHE.MiTisFthoras.name
ltx/en_uk_lash/oc.m7.d1:ocMA.OdeS9C11.mode	@ltx/en_uk_lash/miscellanea:misc.Mode7
ltx/en_uk_lash/oc.m7.d1:ocMA.OdeS9C11.ode	@ltx/en_uk_lash/miscellanea:misc.Ode9
ltx/en_uk_lash/oc.m7.d1:ocMA.OdeS9C11.text	Shut your mouths, all you that with minds gone astray make sufferings harmonize with Godhead; for it is the Lord of glory, crucified in the flesh, but not crucified in his divine nature, as one in two natures, that we magnify.
ltx/en_uk_lash/oc.m7.d1:ocMA.OdeS9C12.incipit	You that reject the resurrection…
ltx/en_uk_lash/oc.m7.d1:ocMA.OdeS9C12.melody	@ltx/en_uk_lash/he.h.m7:heHE.MiTisFthoras.name
ltx/en_uk_lash/oc.m7.d1:ocMA.OdeS9C12.mode	@ltx/en_uk_lash/miscellanea:misc.Mode7
ltx/en_uk_lash/oc.m7.d1:ocMA.OdeS9C12.ode	@ltx/en_uk_lash/miscellanea:misc.Ode9
ltx/en_uk_lash/oc.m7.d1:ocMA.OdeS9C12.text	You that reject the resurrection of bodies go to the grave of Christ and be taught that the flesh of the Giver of life was slain and rose again in confirmation of the final Resurrection, for we hope.
ltx/en_uk_lash/oc.m7.d1:ocMA.OdeS9C1H.greekmelody	@ltx/en_uk_lash/he.h.m7:heHE.MiTisFthoras.greekname
ltx/en_uk_lash/oc.m7.d1:ocMA.OdeS9C1H.incipit	@ltx/en_uk_lash/he.h.m7:heHE.MiTisFthoras.incipit
ltx/en_uk_lash/oc.m7.d1:ocMA.OdeS9C1H.melody	@ltx/en_uk_lash/he.h.m7:heHE.MiTisFthoras.melody
ltx/en_uk_lash/oc.m7.d1:ocMA.OdeS9C1H.mode	@ltx/en_uk_lash/miscellanea:misc.Mode7
ltx/en_uk_lash/oc.m7.d1:ocMA.OdeS9C1H.ode	@ltx/en_uk_lash/miscellanea:misc.Ode9
ltx/en_uk_lash/oc.m7.d1:ocMA.OdeS9C1H.text	@ltx/en_uk_lash/he.h.m7:heHE.MiTisFthoras.text
ltx/en_uk_lash/oc.m7.d1:ocMA.OdeS9C1Tr.incipit	As we honour not a…
ltx/en_uk_lash/oc.m7.d1:ocMA.OdeS9C1Tr.melody	@ltx/en_uk_lash/he.h.m7:heHE.MiTisFthoras.name
ltx/en_uk_lash/oc.m7.d1:ocMA.OdeS9C1Tr.mode	@ltx/en_uk_lash/miscellanea:misc.Mode7
ltx/en_uk_lash/oc.m7.d1:ocMA.OdeS9C1Tr.ode	@ltx/en_uk_lash/miscellanea:misc.Ode9
ltx/en_uk_lash/oc.m7.d1:ocMA.OdeS9C1Tr.text	As we honour not a Trinity of godheads but of hypostases, not a Unity of persons but of Godhead, we cut off those who divide it, while we confound those who dare to confound this Trinity which we magnify.
ltx/en_uk_lash/oc.m7.d1:ocMA.OdeS9C21.greekmelody	@ltx/en_uk_lash/he.h.m7:heHE.MitirTheouKaiParthenos.greekname
ltx/en_uk_lash/oc.m7.d1:ocMA.OdeS9C21.incipit	Light from light, radiance of…
ltx/en_uk_lash/oc.m7.d1:ocMA.OdeS9C21.melody	@ltx/en_uk_lash/he.h.m7:heHE.MitirTheouKaiParthenos.name
ltx/en_uk_lash/oc.m7.d1:ocMA.OdeS9C21.mode	@ltx/en_uk_lash/miscellanea:misc.Mode7
ltx/en_uk_lash/oc.m7.d1:ocMA.OdeS9C21.ode	@ltx/en_uk_lash/miscellanea:misc.Ode9
ltx/en_uk_lash/oc.m7.d1:ocMA.OdeS9C21.text	Light from light, radiance of the Father''s glory, shining out timelessly, Christ shone for the life of mortals that were in darkness and dispelled the pursuing darkness. Without ceasing we the faithful magnify him.
ltx/en_uk_lash/oc.m7.d1:ocMA.OdeS9C22.incipit	As they contemplate the sufferings…
ltx/en_uk_lash/oc.m7.d1:ocMA.OdeS9C22.melody	@ltx/en_uk_lash/he.h.m7:heHE.MitirTheouKaiParthenos.name
ltx/en_uk_lash/oc.m7.d1:ocMA.OdeS9C22.mode	@ltx/en_uk_lash/miscellanea:misc.Mode7
ltx/en_uk_lash/oc.m7.d1:ocMA.OdeS9C22.ode	@ltx/en_uk_lash/miscellanea:misc.Ode9
ltx/en_uk_lash/oc.m7.d1:ocMA.OdeS9C22.text	As they contemplate the sufferings of the flesh and the strength of the Godhead in Christ let those who maintain one compound nature be ashamed; for he died as man, but rose again as Creator of the universe.
ltx/en_uk_lash/oc.m7.d1:ocMA.OdeS9C2T.incipit	''Apart from you I know…
ltx/en_uk_lash/oc.m7.d1:ocMA.OdeS9C2T.melody	@ltx/en_uk_lash/he.h.m7:heHE.MitirTheouKaiParthenos.name
ltx/en_uk_lash/oc.m7.d1:ocMA.OdeS9C2T.mode	@ltx/en_uk_lash/miscellanea:misc.Mode7
ltx/en_uk_lash/oc.m7.d1:ocMA.OdeS9C2T.ode	@ltx/en_uk_lash/miscellanea:misc.Ode9
ltx/en_uk_lash/oc.m7.d1:ocMA.OdeS9C2T.text	''Apart from you I know no other God'', your Church cries out to you, ''who chose me as your own bride from unbelieving nations.'' Then give salvation to believers, O Word, at the prayers of her who bore you, for you are compassionate.
ltx/en_uk_lash/oc.m7.d1:ocMA.OdeS9C31.greekmelody	@ltx/en_uk_lash/he.h.m7:heHE.MitirTheouKaiParthenos.greekname
ltx/en_uk_lash/oc.m7.d1:ocMA.OdeS9C31.incipit	Ever-virgin maiden, you were declared…
ltx/en_uk_lash/oc.m7.d1:ocMA.OdeS9C31.melody	@ltx/en_uk_lash/he.h.m7:heHE.MitirTheouKaiParthenos.name
ltx/en_uk_lash/oc.m7.d1:ocMA.OdeS9C31.mode	@ltx/en_uk_lash/miscellanea:misc.Mode7
ltx/en_uk_lash/oc.m7.d1:ocMA.OdeS9C31.ode	@ltx/en_uk_lash/miscellanea:misc.Ode9
ltx/en_uk_lash/oc.m7.d1:ocMA.OdeS9C31.text	Ever-virgin maiden, you were declared to be for us cause of eternal joy and gladness, for your carried in your womb the Redeemer, who redeems those who in truth and in the divine Spirit honour him as God.
ltx/en_uk_lash/oc.m7.d1:ocMA.OdeS9C32.incipit	David, your forefather, in a…
ltx/en_uk_lash/oc.m7.d1:ocMA.OdeS9C32.melody	@ltx/en_uk_lash/he.h.m7:heHE.MitirTheouKaiParthenos.name
ltx/en_uk_lash/oc.m7.d1:ocMA.OdeS9C32.mode	@ltx/en_uk_lash/miscellanea:misc.Mode7
ltx/en_uk_lash/oc.m7.d1:ocMA.OdeS9C32.ode	@ltx/en_uk_lash/miscellanea:misc.Ode9
ltx/en_uk_lash/oc.m7.d1:ocMA.OdeS9C32.text	David, your forefather, in a psalm names you ark of divine sanctification, O All-pure, who contained beyond nature the One who is seated in the Father''s bosom. Without ceasing we the faithful magnify him.
ltx/en_uk_lash/oc.m7.d1:ocMA.OdeS9C33.incipit	You are truly higher than…
ltx/en_uk_lash/oc.m7.d1:ocMA.OdeS9C33.melody	@ltx/en_uk_lash/he.h.m7:heHE.MitirTheouKaiParthenos.name
ltx/en_uk_lash/oc.m7.d1:ocMA.OdeS9C33.mode	@ltx/en_uk_lash/miscellanea:misc.Mode7
ltx/en_uk_lash/oc.m7.d1:ocMA.OdeS9C33.ode	@ltx/en_uk_lash/miscellanea:misc.Ode9
ltx/en_uk_lash/oc.m7.d1:ocMA.OdeS9C33.text	You are truly higher than all creation, O Maiden; for for us you gave birth in bodily form to the Creator of all things; therefore, as Mother of the only Master, you royally carry off the victory against all.
ltx/en_uk_lash/oc.m7.d1:ocMA.Oikos.incipit	All that is beneath the…
ltx/en_uk_lash/oc.m7.d1:ocMA.Oikos.mode	@ltx/en_uk_lash/miscellanea:misc.Mode7
ltx/en_uk_lash/oc.m7.d1:ocMA.Oikos.text	All that is beneath the earth, Hades and death, trembled today before one of the Trinity; the earth quaked, the gate-keepers of Hades, when they saw you, quailed; all creation, rejoicing with the prophets, sings you a song of victory, our Redeemer and God, who destroyed the power of death. Let us shout with joy and cry out to Adam and to Adam''s race, ''Come out, you faithful, to the Resurrection!''
ltx/en_uk_lash/oc.m7.d1:ocMO.Kathisma11.greekmelody	@ltx/en_uk_lash/he.a.m7:heAU.ODiEmeAnaschomenos.greekname
ltx/en_uk_lash/oc.m7.d1:ocMO.Kathisma11.incipit	Have mercy, holy Trinity, on…
ltx/en_uk_lash/oc.m7.d1:ocMO.Kathisma11.melody	@ltx/en_uk_lash/he.a.m7:heAU.ODiEmeAnaschomenos.notmetered
ltx/en_uk_lash/oc.m7.d1:ocMO.Kathisma11.mode	@ltx/en_uk_lash/miscellanea:misc.Mode7
ltx/en_uk_lash/oc.m7.d1:ocMO.Kathisma11.text	Have mercy, holy Trinity, on your servants who have sinned, and receive them, O Compassionate, as they repent to you, and grant them pardon.
ltx/en_uk_lash/oc.m7.d1:ocMO.Kathisma12.incipit	Do good, all-pure Mother of…
ltx/en_uk_lash/oc.m7.d1:ocMO.Kathisma12.melody	@ltx/en_uk_lash/he.a.m7:heAU.ODiEmeAnaschomenos.notmetered
ltx/en_uk_lash/oc.m7.d1:ocMO.Kathisma12.mode	@ltx/en_uk_lash/miscellanea:misc.Mode7
ltx/en_uk_lash/oc.m7.d1:ocMO.Kathisma12.text	Do good, all-pure Mother of God, to our souls that have been ruined by sins; and ransom from faults those who sing your praise, O Bride of God.
ltx/en_uk_lash/oc.m7.d1:ocMO.Kathisma21.greekmelody	@ltx/en_uk_lash/he.a.m7:heAU.PyrosFoteinoteron.greekname
ltx/en_uk_lash/oc.m7.d1:ocMO.Kathisma21.incipit	Consubstantial Trinity, three-personned Unity, have…
ltx/en_uk_lash/oc.m7.d1:ocMO.Kathisma21.melody	@ltx/en_uk_lash/he.a.m7:heAU.PyrosFoteinoteron.notmetered
ltx/en_uk_lash/oc.m7.d1:ocMO.Kathisma21.mode	@ltx/en_uk_lash/miscellanea:misc.Mode7
ltx/en_uk_lash/oc.m7.d1:ocMO.Kathisma21.text	Consubstantial Trinity, three-personned Unity, have mercy on those you fashioned, burning up, O Immortal, the vices of the those who fall and enlightening the hearts of those who sing the praise of your compassion. Our God, glory to you.
ltx/en_uk_lash/oc.m7.d1:ocMO.Kathisma22.incipit	@ltx/en_uk_lash/he.a.m7:heAU.PyrosFoteinoteron.incipit
ltx/en_uk_lash/oc.m7.d1:ocMO.Kathisma22.melody	@ltx/en_uk_lash/he.a.m7:heAU.PyrosFoteinoteron.melody
ltx/en_uk_lash/oc.m7.d1:ocMO.Kathisma22.mode	@ltx/en_uk_lash/miscellanea:misc.Mode7
ltx/en_uk_lash/oc.m7.d1:ocMO.Kathisma22.text	@ltx/en_uk_lash/he.a.m7:heAU.PyrosFoteinoteron.text
ltx/en_uk_lash/oc.m7.d1:ocMO.Ode11.greekmelody	@ltx/en_uk_lash/he.h.m7:heHE.NefseiSouProsGeodi.greekname
ltx/en_uk_lash/oc.m7.d1:ocMO.Ode11.incipit	Open the spiritual mouth…
ltx/en_uk_lash/oc.m7.d1:ocMO.Ode11.melody	@ltx/en_uk_lash/he.h.m7:heHE.NefseiSouProsGeodi.name
ltx/en_uk_lash/oc.m7.d1:ocMO.Ode11.mode	@ltx/en_uk_lash/miscellanea:misc.Mode7
ltx/en_uk_lash/oc.m7.d1:ocMO.Ode11.ode	@ltx/en_uk_lash/miscellanea:misc.Ode1
ltx/en_uk_lash/oc.m7.d1:ocMO.Ode11.text	Open the spiritual mouth of my heart and my lips of matter to praise you, one Godhead of triple light, and to sing you a song of thanksgiving, O Giver of light.
ltx/en_uk_lash/oc.m7.d1:ocMO.Ode12.incipit	That you might show your…
ltx/en_uk_lash/oc.m7.d1:ocMO.Ode12.melody	@ltx/en_uk_lash/he.h.m7:heHE.NefseiSouProsGeodi.name
ltx/en_uk_lash/oc.m7.d1:ocMO.Ode12.mode	@ltx/en_uk_lash/miscellanea:misc.Mode7
ltx/en_uk_lash/oc.m7.d1:ocMO.Ode12.ode	@ltx/en_uk_lash/miscellanea:misc.Ode1
ltx/en_uk_lash/oc.m7.d1:ocMO.Ode12.text	That you might show your surpassing goodness, O Trinity of infinite power, you fashioned humankind, only image of clay of your sovereign lordship, O Creator.
ltx/en_uk_lash/oc.m7.d1:ocMO.Ode13.incipit	The Mind without beginning, that…
ltx/en_uk_lash/oc.m7.d1:ocMO.Ode13.melody	@ltx/en_uk_lash/he.h.m7:heHE.NefseiSouProsGeodi.name
ltx/en_uk_lash/oc.m7.d1:ocMO.Ode13.mode	@ltx/en_uk_lash/miscellanea:misc.Mode7
ltx/en_uk_lash/oc.m7.d1:ocMO.Ode13.ode	@ltx/en_uk_lash/miscellanea:misc.Ode1
ltx/en_uk_lash/oc.m7.d1:ocMO.Ode13.text	The Mind without beginning, that begot the Word co-eternally and made the Spirit likewise without beginning shine forth, has counted us worthy to worship one God by essence, of one form, triple in persons.
ltx/en_uk_lash/oc.m7.d1:ocMO.Ode1T.incipit	You appeared in the bush…
ltx/en_uk_lash/oc.m7.d1:ocMO.Ode1T.melody	@ltx/en_uk_lash/he.h.m7:heHE.NefseiSouProsGeodi.name
ltx/en_uk_lash/oc.m7.d1:ocMO.Ode1T.mode	@ltx/en_uk_lash/miscellanea:misc.Mode7
ltx/en_uk_lash/oc.m7.d1:ocMO.Ode1T.ode	@ltx/en_uk_lash/miscellanea:misc.Ode1
ltx/en_uk_lash/oc.m7.d1:ocMO.Ode1T.text	You appeared in the bush to Moses, O Word of God, as a purifying fire that did not burn up the whole, prefiguring your incarnation from the Virgin, through which you transformed mortals.
ltx/en_uk_lash/oc.m7.d1:ocMO.Ode31.greekmelody	@ltx/en_uk_lash/he.h.m7:heHE.OKatArchasTousOuranous.greekname
ltx/en_uk_lash/oc.m7.d1:ocMO.Ode31.incipit	As we praise you, O…
ltx/en_uk_lash/oc.m7.d1:ocMO.Ode31.melody	@ltx/en_uk_lash/he.h.m7:heHE.OKatArchasTousOuranous.name
ltx/en_uk_lash/oc.m7.d1:ocMO.Ode31.mode	@ltx/en_uk_lash/miscellanea:misc.Mode7
ltx/en_uk_lash/oc.m7.d1:ocMO.Ode31.ode	@ltx/en_uk_lash/miscellanea:misc.Ode3
ltx/en_uk_lash/oc.m7.d1:ocMO.Ode31.text	As we praise you, O God of infinite power, as Master single and of triple light and all-creating, we ask redemption from sins and temptations. Do not then despise those who with faith glorify your loving-kindness.
ltx/en_uk_lash/oc.m7.d1:ocMO.Ode32.incipit	A branch you appeared from…
ltx/en_uk_lash/oc.m7.d1:ocMO.Ode32.melody	@ltx/en_uk_lash/he.h.m7:heHE.OKatArchasTousOuranous.name
ltx/en_uk_lash/oc.m7.d1:ocMO.Ode32.mode	@ltx/en_uk_lash/miscellanea:misc.Mode7
ltx/en_uk_lash/oc.m7.d1:ocMO.Ode32.ode	@ltx/en_uk_lash/miscellanea:misc.Ode3
ltx/en_uk_lash/oc.m7.d1:ocMO.Ode32.text	A branch you appeared from the Father, as from a root without beginning, God the Word and equal in strength with the Spirit of like nature and divine; and therefore we the faithful glorify one Lordship, triple in persons.
ltx/en_uk_lash/oc.m7.d1:ocMO.Ode33.incipit	All we the faithful glorify…
ltx/en_uk_lash/oc.m7.d1:ocMO.Ode33.melody	@ltx/en_uk_lash/he.h.m7:heHE.OKatArchasTousOuranous.name
ltx/en_uk_lash/oc.m7.d1:ocMO.Ode33.mode	@ltx/en_uk_lash/miscellanea:misc.Mode7
ltx/en_uk_lash/oc.m7.d1:ocMO.Ode33.ode	@ltx/en_uk_lash/miscellanea:misc.Ode3
ltx/en_uk_lash/oc.m7.d1:ocMO.Ode33.text	All we the faithful glorify you, the nature in three persons, equal in glory, like in nature, undivided and yet separated, Trinity that rule as one; and as we worship you we ask pardon of offences.
ltx/en_uk_lash/oc.m7.d1:ocMO.Ode3T.incipit	Without change made like to…
ltx/en_uk_lash/oc.m7.d1:ocMO.Ode3T.melody	@ltx/en_uk_lash/he.h.m7:heHE.OKatArchasTousOuranous.name
ltx/en_uk_lash/oc.m7.d1:ocMO.Ode3T.mode	@ltx/en_uk_lash/miscellanea:misc.Mode7
ltx/en_uk_lash/oc.m7.d1:ocMO.Ode3T.ode	@ltx/en_uk_lash/miscellanea:misc.Ode3
ltx/en_uk_lash/oc.m7.d1:ocMO.Ode3T.text	Without change made like to mortals in all things, O Word of God, you came forth clearly from a pure Maiden, and to all you revealed the Godhead of triple light and single in the essence of identical hypostases.
ltx/en_uk_lash/oc.m7.d1:ocMO.Ode41.greekmelody	@ltx/en_uk_lash/he.h.m7:heHE.OPatrikousKolpous.greekname
ltx/en_uk_lash/oc.m7.d1:ocMO.Ode41.incipit	O divine Unity of triple…
ltx/en_uk_lash/oc.m7.d1:ocMO.Ode41.melody	@ltx/en_uk_lash/he.h.m7:heHE.OPatrikousKolpous.name
ltx/en_uk_lash/oc.m7.d1:ocMO.Ode41.mode	@ltx/en_uk_lash/miscellanea:misc.Mode7
ltx/en_uk_lash/oc.m7.d1:ocMO.Ode41.ode	@ltx/en_uk_lash/miscellanea:misc.Ode4
ltx/en_uk_lash/oc.m7.d1:ocMO.Ode41.text	O divine Unity of triple light, maintaining and saving all things, now watch over those who sing your praise, save them from afflictions and passions and every distress.
ltx/en_uk_lash/oc.m7.d1:ocMO.Ode42.incipit	At a loss for words…
ltx/en_uk_lash/oc.m7.d1:ocMO.Ode42.melody	@ltx/en_uk_lash/he.h.m7:heHE.OPatrikousKolpous.name
ltx/en_uk_lash/oc.m7.d1:ocMO.Ode42.mode	@ltx/en_uk_lash/miscellanea:misc.Mode7
ltx/en_uk_lash/oc.m7.d1:ocMO.Ode42.ode	@ltx/en_uk_lash/miscellanea:misc.Ode4
ltx/en_uk_lash/oc.m7.d1:ocMO.Ode42.text	At a loss for words that signify your incomprehensible Godhead of triple light, we sing your praise, Lord, Lover of humankind, and we glorify your power.
ltx/en_uk_lash/oc.m7.d1:ocMO.Ode43.incipit	On earth as in heaven…
ltx/en_uk_lash/oc.m7.d1:ocMO.Ode43.melody	@ltx/en_uk_lash/he.h.m7:heHE.OPatrikousKolpous.name
ltx/en_uk_lash/oc.m7.d1:ocMO.Ode43.mode	@ltx/en_uk_lash/miscellanea:misc.Mode7
ltx/en_uk_lash/oc.m7.d1:ocMO.Ode43.ode	@ltx/en_uk_lash/miscellanea:misc.Ode4
ltx/en_uk_lash/oc.m7.d1:ocMO.Ode43.text	On earth as in heaven with the choirs of Bodiless Powers without separating we separate you, O Unity and Trinity, and with love we glorify you as sovereign over all things that exist.
ltx/en_uk_lash/oc.m7.d1:ocMO.Ode4T.incipit	Without abandoning your Father''s glory…
ltx/en_uk_lash/oc.m7.d1:ocMO.Ode4T.melody	@ltx/en_uk_lash/he.h.m7:heHE.OPatrikousKolpous.name
ltx/en_uk_lash/oc.m7.d1:ocMO.Ode4T.mode	@ltx/en_uk_lash/miscellanea:misc.Mode7
ltx/en_uk_lash/oc.m7.d1:ocMO.Ode4T.ode	@ltx/en_uk_lash/miscellanea:misc.Ode4
ltx/en_uk_lash/oc.m7.d1:ocMO.Ode4T.text	Without abandoning your Father''s glory, you, the One beyond being, came down willingly to our lowest estate and were incarnate, and you raised up all to divine glory as you are compassionate.
ltx/en_uk_lash/oc.m7.d1:ocMO.Ode51.greekmelody	@ltx/en_uk_lash/he.h.m7:heHE.OiOrthrizontesLoge.greekname
ltx/en_uk_lash/oc.m7.d1:ocMO.Ode51.incipit	O nature source of light…
ltx/en_uk_lash/oc.m7.d1:ocMO.Ode51.melody	@ltx/en_uk_lash/he.h.m7:heHE.OiOrthrizontesLoge.name
ltx/en_uk_lash/oc.m7.d1:ocMO.Ode51.mode	@ltx/en_uk_lash/miscellanea:misc.Mode7
ltx/en_uk_lash/oc.m7.d1:ocMO.Ode51.ode	@ltx/en_uk_lash/miscellanea:misc.Ode5
ltx/en_uk_lash/oc.m7.d1:ocMO.Ode51.text	O nature source of light, Trinity in persons and Unity in will and glory and honour, strengthen us in love of you.
ltx/en_uk_lash/oc.m7.d1:ocMO.Ode52.incipit	As we glorify Mind, Word…
ltx/en_uk_lash/oc.m7.d1:ocMO.Ode52.melody	@ltx/en_uk_lash/he.h.m7:heHE.OiOrthrizontesLoge.name
ltx/en_uk_lash/oc.m7.d1:ocMO.Ode52.mode	@ltx/en_uk_lash/miscellanea:misc.Mode7
ltx/en_uk_lash/oc.m7.d1:ocMO.Ode52.ode	@ltx/en_uk_lash/miscellanea:misc.Ode5
ltx/en_uk_lash/oc.m7.d1:ocMO.Ode52.text	As we glorify Mind, Word and Spirit, the one Divinity and nature with triple sun, we ask to be delivered from temptations and afflictions of every kind.
ltx/en_uk_lash/oc.m7.d1:ocMO.Ode5T.incipit	O Word of God, you…
ltx/en_uk_lash/oc.m7.d1:ocMO.Ode5T.melody	@ltx/en_uk_lash/he.h.m7:heHE.OiOrthrizontesLoge.name
ltx/en_uk_lash/oc.m7.d1:ocMO.Ode5T.mode	@ltx/en_uk_lash/miscellanea:misc.Mode7
ltx/en_uk_lash/oc.m7.d1:ocMO.Ode5T.ode	@ltx/en_uk_lash/miscellanea:misc.Ode5
ltx/en_uk_lash/oc.m7.d1:ocMO.Ode5T.text	O Word of God, you received the form of human nature from a holy Virgin and you taught us to sing the praise of a Trinity in Unity, identical in form and majesty.
ltx/en_uk_lash/oc.m7.d1:ocMO.Ode61.greekmelody	@ltx/en_uk_lash/he.h.m7:heHE.NaftionToSalo.greekname
ltx/en_uk_lash/oc.m7.d1:ocMO.Ode61.incipit	We glorify the Deity that…
ltx/en_uk_lash/oc.m7.d1:ocMO.Ode61.melody	@ltx/en_uk_lash/he.h.m7:heHE.NaftionToSalo.name
ltx/en_uk_lash/oc.m7.d1:ocMO.Ode61.mode	@ltx/en_uk_lash/miscellanea:misc.Mode7
ltx/en_uk_lash/oc.m7.d1:ocMO.Ode61.ode	@ltx/en_uk_lash/miscellanea:misc.Ode6
ltx/en_uk_lash/oc.m7.d1:ocMO.Ode61.text	We glorify the Deity that rules as one with might of equal glory, existing in three persons identically with one another, having the difference only of each subsistent property.
ltx/en_uk_lash/oc.m7.d1:ocMO.Ode62.incipit	The spiritual Ranks of the…
ltx/en_uk_lash/oc.m7.d1:ocMO.Ode62.melody	@ltx/en_uk_lash/he.h.m7:heHE.NaftionToSalo.name
ltx/en_uk_lash/oc.m7.d1:ocMO.Ode62.mode	@ltx/en_uk_lash/miscellanea:misc.Mode7
ltx/en_uk_lash/oc.m7.d1:ocMO.Ode62.ode	@ltx/en_uk_lash/miscellanea:misc.Ode6
ltx/en_uk_lash/oc.m7.d1:ocMO.Ode62.text	The spiritual Ranks of the angelic orders praise you, sole Sovereignty with triple Sun. With them we too with lips of clay sing out your praise as only Maker of all things and with faith we glorify you.
ltx/en_uk_lash/oc.m7.d1:ocMO.Ode6T.incipit	The Word, born from the…
ltx/en_uk_lash/oc.m7.d1:ocMO.Ode6T.melody	@ltx/en_uk_lash/he.h.m7:heHE.NaftionToSalo.name
ltx/en_uk_lash/oc.m7.d1:ocMO.Ode6T.mode	@ltx/en_uk_lash/miscellanea:misc.Mode7
ltx/en_uk_lash/oc.m7.d1:ocMO.Ode6T.ode	@ltx/en_uk_lash/miscellanea:misc.Ode6
ltx/en_uk_lash/oc.m7.d1:ocMO.Ode6T.text	The Word, born from the Sun, the Father by an ineffable word as another Sun before the ages, dawned in these last times from the Virgin and taught that God who is beyond understanding is single in three persons.
ltx/en_uk_lash/oc.m7.d1:ocMO.Ode71.greekmelody	@ltx/en_uk_lash/he.h.m7:heHE.OiEnKaminoTouPyros.greekname
ltx/en_uk_lash/oc.m7.d1:ocMO.Ode71.incipit	Obedient to the sayings of…
ltx/en_uk_lash/oc.m7.d1:ocMO.Ode71.melody	@ltx/en_uk_lash/he.h.m7:heHE.OiEnKaminoTouPyros.name
ltx/en_uk_lash/oc.m7.d1:ocMO.Ode71.mode	@ltx/en_uk_lash/miscellanea:misc.Mode7
ltx/en_uk_lash/oc.m7.d1:ocMO.Ode71.ode	@ltx/en_uk_lash/miscellanea:misc.Ode7
ltx/en_uk_lash/oc.m7.d1:ocMO.Ode71.text	Obedient to the sayings of the godly Prophets, we glorify you the one and only God of all things in three persons, as we cry out, Blessed are you, O Lord, the God of our Fathers.
ltx/en_uk_lash/oc.m7.d1:ocMO.Ode72.incipit	Along with immaterial Hosts we…
ltx/en_uk_lash/oc.m7.d1:ocMO.Ode72.melody	@ltx/en_uk_lash/he.h.m7:heHE.OiEnKaminoTouPyros.name
ltx/en_uk_lash/oc.m7.d1:ocMO.Ode72.mode	@ltx/en_uk_lash/miscellanea:misc.Mode7
ltx/en_uk_lash/oc.m7.d1:ocMO.Ode72.ode	@ltx/en_uk_lash/miscellanea:misc.Ode7
ltx/en_uk_lash/oc.m7.d1:ocMO.Ode72.text	Along with immaterial Hosts we sing your praise with lips of dust, O holy Trinity in unity of essence, as we cry aloud, Blessed are you, O Lord, the God of our Fathers.
ltx/en_uk_lash/oc.m7.d1:ocMO.Ode7T.incipit	That he that fashioned Adam…
ltx/en_uk_lash/oc.m7.d1:ocMO.Ode7T.melody	@ltx/en_uk_lash/he.h.m7:heHE.OiEnKaminoTouPyros.name
ltx/en_uk_lash/oc.m7.d1:ocMO.Ode7T.mode	@ltx/en_uk_lash/miscellanea:misc.Mode7
ltx/en_uk_lash/oc.m7.d1:ocMO.Ode7T.ode	@ltx/en_uk_lash/miscellanea:misc.Ode7
ltx/en_uk_lash/oc.m7.d1:ocMO.Ode7T.text	That he that fashioned Adam might refashion him again, O all-pure, he became clearly man from you, making humankind divine, that thus cries out, Blessed, O all-pure, is the fruit of your womb.
ltx/en_uk_lash/oc.m7.d1:ocMO.Ode81.greekmelody	@ltx/en_uk_lash/he.h.m7:heHE.AflektosPyri.greekname
ltx/en_uk_lash/oc.m7.d1:ocMO.Ode81.incipit	Triple and single Lordship without…
ltx/en_uk_lash/oc.m7.d1:ocMO.Ode81.melody	@ltx/en_uk_lash/he.h.m7:heHE.AflektosPyri.name
ltx/en_uk_lash/oc.m7.d1:ocMO.Ode81.mode	@ltx/en_uk_lash/miscellanea:misc.Mode7
ltx/en_uk_lash/oc.m7.d1:ocMO.Ode81.ode	@ltx/en_uk_lash/miscellanea:misc.Ode8
ltx/en_uk_lash/oc.m7.d1:ocMO.Ode81.text	Triple and single Lordship without beginning, you hold sway over the universe, you direct heaven and earth. Therefore guard me, ever drawn by your love, to sing to you, ''All you works of the Lord, praise the Lord, and highly exalt him to all the ages''.
ltx/en_uk_lash/oc.m7.d1:ocMO.Ode82.incipit	Grant that the hearts of…
ltx/en_uk_lash/oc.m7.d1:ocMO.Ode82.melody	@ltx/en_uk_lash/he.h.m7:heHE.AflektosPyri.name
ltx/en_uk_lash/oc.m7.d1:ocMO.Ode82.mode	@ltx/en_uk_lash/miscellanea:misc.Mode7
ltx/en_uk_lash/oc.m7.d1:ocMO.Ode82.ode	@ltx/en_uk_lash/miscellanea:misc.Ode8
ltx/en_uk_lash/oc.m7.d1:ocMO.Ode82.text	Grant that the hearts of those who sing your praise may be flooded with the light-giving beams of the Sun with triple light; and now, O Trinity and Unity, grant that all they may ever behold your beauty, as far as is possible, who with fitting faith sing the praise of your greatness to all the ages.
ltx/en_uk_lash/oc.m7.d1:ocMO.Ode83.incipit	Make me a temple of…
ltx/en_uk_lash/oc.m7.d1:ocMO.Ode83.melody	@ltx/en_uk_lash/he.h.m7:heHE.AflektosPyri.name
ltx/en_uk_lash/oc.m7.d1:ocMO.Ode83.mode	@ltx/en_uk_lash/miscellanea:misc.Mode7
ltx/en_uk_lash/oc.m7.d1:ocMO.Ode83.ode	@ltx/en_uk_lash/miscellanea:misc.Ode8
ltx/en_uk_lash/oc.m7.d1:ocMO.Ode83.text	Make me a temple of your radiance with triple light, of communion and participation, O Lover of humankind, source of good; show me, Master, sole Ruler, my God and Lord of glory, to be unapproachable by invisible foes and passions of the flesh, that I may sing your praise to all the ages.
ltx/en_uk_lash/oc.m7.d1:ocMO.Ode8T.incipit	A divine light dawned from…
ltx/en_uk_lash/oc.m7.d1:ocMO.Ode8T.melody	@ltx/en_uk_lash/he.h.m7:heHE.AflektosPyri.name
ltx/en_uk_lash/oc.m7.d1:ocMO.Ode8T.mode	@ltx/en_uk_lash/miscellanea:misc.Mode7
ltx/en_uk_lash/oc.m7.d1:ocMO.Ode8T.ode	@ltx/en_uk_lash/miscellanea:misc.Ode8
ltx/en_uk_lash/oc.m7.d1:ocMO.Ode8T.text	A divine light dawned from your womb, Virgin-mother all-pure, and flooded the whole world with the light with triple sun; and revealed the earth to be as another Heaven that sings, ''All you works of the Lord, praise the Lord, and highly exalt him to all the ages''.
ltx/en_uk_lash/oc.m7.d1:ocMO.Ode91.greekmelody	@ltx/en_uk_lash/he.h.m7:heHE.MitirTheouKaiParthenos.greekname
ltx/en_uk_lash/oc.m7.d1:ocMO.Ode91.incipit	We creatures of clay are…
ltx/en_uk_lash/oc.m7.d1:ocMO.Ode91.melody	@ltx/en_uk_lash/he.h.m7:heHE.MitirTheouKaiParthenos.name
ltx/en_uk_lash/oc.m7.d1:ocMO.Ode91.mode	@ltx/en_uk_lash/miscellanea:misc.Mode7
ltx/en_uk_lash/oc.m7.d1:ocMO.Ode91.ode	@ltx/en_uk_lash/miscellanea:misc.Ode9
ltx/en_uk_lash/oc.m7.d1:ocMO.Ode91.text	We creatures of clay are not able fittingly to exalt and praise you, whom the Seraphim praise unceasingly in the highest; but as Master of all things and as God who greatly love humankind we dare to magnify you.
ltx/en_uk_lash/oc.m7.d1:ocMO.Ode92.incipit	Single, undivided Trinity, be pleased…
ltx/en_uk_lash/oc.m7.d1:ocMO.Ode92.melody	@ltx/en_uk_lash/he.h.m7:heHE.MitirTheouKaiParthenos.name
ltx/en_uk_lash/oc.m7.d1:ocMO.Ode92.mode	@ltx/en_uk_lash/miscellanea:misc.Mode7
ltx/en_uk_lash/oc.m7.d1:ocMO.Ode92.ode	@ltx/en_uk_lash/miscellanea:misc.Ode9
ltx/en_uk_lash/oc.m7.d1:ocMO.Ode92.text	Single, undivided Trinity, be pleased to deliver from bodily pain and from passion of soul those who sing your praise and to keep them unharmed from all the trials of life.
ltx/en_uk_lash/oc.m7.d1:ocMO.Ode93.incipit	Godhead of triple light and…
ltx/en_uk_lash/oc.m7.d1:ocMO.Ode93.melody	@ltx/en_uk_lash/he.h.m7:heHE.MitirTheouKaiParthenos.name
ltx/en_uk_lash/oc.m7.d1:ocMO.Ode93.mode	@ltx/en_uk_lash/miscellanea:misc.Mode7
ltx/en_uk_lash/oc.m7.d1:ocMO.Ode93.ode	@ltx/en_uk_lash/miscellanea:misc.Ode9
ltx/en_uk_lash/oc.m7.d1:ocMO.Ode93.text	Godhead of triple light and equal might, putting before your might the unchanging beauty of your natural loving-kindness, give to your servants release from faults and redemption from temptations and passions.
ltx/en_uk_lash/oc.m7.d1:ocMO.Ode9T.incipit	Taking from your most pure…
ltx/en_uk_lash/oc.m7.d1:ocMO.Ode9T.melody	@ltx/en_uk_lash/he.h.m7:heHE.MitirTheouKaiParthenos.name
ltx/en_uk_lash/oc.m7.d1:ocMO.Ode9T.mode	@ltx/en_uk_lash/miscellanea:misc.Mode7
ltx/en_uk_lash/oc.m7.d1:ocMO.Ode9T.ode	@ltx/en_uk_lash/miscellanea:misc.Ode9
ltx/en_uk_lash/oc.m7.d1:ocMO.Ode9T.text	Taking from your most pure womb, O Mother of God, mind and soul and the matter of his flesh, God the Word appeared as truly a man and clearly showed humankind to be a partaker in his godhead.
ltx/en_uk_lash/oc.m7.d1:ocMO.acrostic.notice	of which the Acrostic is:
ltx/en_uk_lash/oc.m7.d1:ocMO.acrostic.text	I praise you, O Trinity, nature that rules as one.
ltx/en_uk_lash/oc.m7.d1:ocMO.poet	@ltx/en_uk_lash/poets:po.MitrofanousSmirnis
ltx/en_uk_lash/oc.m7.d1:ocMO.title	Canon to the Trinity,
ltx/en_uk_lash/oc.m7.d1:ocSV.AposDogmatic.incipit	From you, all-holy Virgin Mother…
ltx/en_uk_lash/oc.m7.d1:ocSV.AposDogmatic.melody	
ltx/en_uk_lash/oc.m7.d1:ocSV.AposDogmatic.mode	@ltx/en_uk_lash/miscellanea:misc.Mode7
ltx/en_uk_lash/oc.m7.d1:ocSV.AposDogmatic.text	From you, all-holy Virgin Mother of God, was born Christ our God, who is truly God before the ages and lately man; as God existing eternally, as man he has come to be for our sake. For in himself he preserves the property of each nature, causing the one to shine forth by wonders, confirming the other by sufferings. Therefore one and the same he both dies as man and rises again as God. Implore him, O honoured one who knew not wedlock, that our souls may be saved.
ltx/en_uk_lash/oc.m7.d1:ocSV.Aposticha1.incipit	O Virgin, you became the…
ltx/en_uk_lash/oc.m7.d1:ocSV.Aposticha1.melody	@ltx/en_uk_lash/he.a.m7:heAU.KatafronisantesPanton.notmetered
ltx/en_uk_lash/oc.m7.d1:ocSV.Aposticha1.mode	@ltx/en_uk_lash/miscellanea:misc.Mode7
ltx/en_uk_lash/oc.m7.d1:ocSV.Aposticha1.text	O Virgin, you became the Dayspring of the spiritual Sun, that came upon the sunset of our nature; but as you have boldness, all-praised Mother of God, beseech him to free our souls from numberless offences.
ltx/en_uk_lash/oc.m7.d1:ocSV.Aposticha2.incipit	Rod out Jesse''s root, O…
ltx/en_uk_lash/oc.m7.d1:ocSV.Aposticha2.melody	
ltx/en_uk_lash/oc.m7.d1:ocSV.Aposticha2.mode	@ltx/en_uk_lash/miscellanea:misc.Mode7
ltx/en_uk_lash/oc.m7.d1:ocSV.Aposticha2.text	Rod out Jesse''s root, O Virgin, you manifestly gave bud to the one who uprooted wholly the plants of deception; but as you have boldness, O all-praised, implore him without ceasing to root out the passions of my heart, and to plant in it the fear of him and save me.
ltx/en_uk_lash/oc.m7.d1:ocSV.Aposticha3.incipit	Gate of God, All-holy, deliver…
ltx/en_uk_lash/oc.m7.d1:ocSV.Aposticha3.melody	
ltx/en_uk_lash/oc.m7.d1:ocSV.Aposticha3.mode	@ltx/en_uk_lash/miscellanea:misc.Mode7
ltx/en_uk_lash/oc.m7.d1:ocSV.Aposticha3.text	Gate of God, All-holy, deliver me from the gates of Hades and show me too the way of repentance, through which I may find the gate that leads to life. Guide of those who have gone astray, watch over the race of faithful people and save our souls.
ltx/en_uk_lash/oc.m7.d1:ocSV.Dogmatic.incipit	Truly fearful and ineffable is…
ltx/en_uk_lash/oc.m7.d1:ocSV.Dogmatic.melody	
ltx/en_uk_lash/oc.m7.d1:ocSV.Dogmatic.mode	@ltx/en_uk_lash/miscellanea:misc.Mode7
ltx/en_uk_lash/oc.m7.d1:ocSV.Dogmatic.text	Truly fearful and ineffable is the mystery that has been wrought in you, O Undefiled; for you gave birth to the Word, cause of all things, beyond cause and word, who became embodied by the holy Spirit, taking his flesh from you, while his own nature remained unchanged. For when both had come together self-subsistently in a single hypostasis, he came forth double in nature, wholly God and wholly man, displaying the wholeness in both with active properties. For having suffered the passion in the flesh on the Cross, he himself remained impassible in his godhead; having died as a mortal he came to life again as God on the third day, after destroying the might of death and delivering humanity from corruption. O Mother of God, ask him as the Redeemer and Saviour of our race to send down to us the great mercy of his compassion.
ltx/en_uk_lash/oc.m7.d1:ocVE.ApolTheotokionVM.incipit	As the treasure-house of our…
ltx/en_uk_lash/oc.m7.d1:ocVE.ApolTheotokionVM.melody	
ltx/en_uk_lash/oc.m7.d1:ocVE.ApolTheotokionVM.mode	@ltx/en_uk_lash/miscellanea:misc.Mode7
ltx/en_uk_lash/oc.m7.d1:ocVE.ApolTheotokionVM.text	As the treasure-house of our Resurrection, All-praised Lady, bring up from the pit and from the deep of offences those who have put their trust in you; for you saved those who were subject to sin by giving birth to Salvation. You were Virgin before bearing child, Virgin in bearing child and after bearing child you are still Virgin.
ltx/en_uk_lash/oc.m7.d1:ocVE.Apolytikion.incipit	You abolished death by your…
ltx/en_uk_lash/oc.m7.d1:ocVE.Apolytikion.melody	
ltx/en_uk_lash/oc.m7.d1:ocVE.Apolytikion.mode	@ltx/en_uk_lash/miscellanea:misc.Mode7
ltx/en_uk_lash/oc.m7.d1:ocVE.Apolytikion.text	You abolished death by your Cross, you opened Paradise to the Thief, you transformed the Myrrhbearers'' lament and ordered your Apostles to proclaim: that you had risen, O Christ God, granting the world your great mercy.
ltx/en_uk_lash/oc.m7.d1:ocVE.AposTheotokion.incipit	As all we born of…
ltx/en_uk_lash/oc.m7.d1:ocVE.AposTheotokion.melody	
ltx/en_uk_lash/oc.m7.d1:ocVE.AposTheotokion.mode	@ltx/en_uk_lash/miscellanea:misc.Mode7
ltx/en_uk_lash/oc.m7.d1:ocVE.AposTheotokion.text	As all we born of earth flee to your protection, Sovereign Lady, we cry out to you: Mother of God, our hope, deliver us from unnumbered faults and save our souls.
ltx/en_uk_lash/oc.m7.d1:ocVE.Aposticha1.greekmelody	@ltx/en_uk_lash/he.a.m7:heAU.OukEtiKolyometha.greekname
ltx/en_uk_lash/oc.m7.d1:ocVE.Aposticha1.incipit	You rose from the tomb…
ltx/en_uk_lash/oc.m7.d1:ocVE.Aposticha1.melody	@ltx/en_uk_lash/he.a.m7:heAU.OukEtiKolyometha.notmetered
ltx/en_uk_lash/oc.m7.d1:ocVE.Aposticha1.mode	@ltx/en_uk_lash/miscellanea:misc.Mode7
ltx/en_uk_lash/oc.m7.d1:ocVE.Aposticha1.text	You rose from the tomb, Saviour of the world, and with your flesh you raised mankind. Lord, glory to you!
ltx/en_uk_lash/oc.m7.d1:ocVE.Aposticha2.incipit	Come, let us worship the…
ltx/en_uk_lash/oc.m7.d1:ocVE.Aposticha2.melody	
ltx/en_uk_lash/oc.m7.d1:ocVE.Aposticha2.mode	@ltx/en_uk_lash/miscellanea:misc.Mode7
ltx/en_uk_lash/oc.m7.d1:ocVE.Aposticha2.text	Come, let us worship the one who rose from the dead and enlightened all things; for he has freed us from the tyranny of Hell through his Rising on the third day so granting us life and his great mercy.
ltx/en_uk_lash/oc.m7.d1:ocVE.Aposticha3.incipit	O Christ, by descending below…
ltx/en_uk_lash/oc.m7.d1:ocVE.Aposticha3.melody	
ltx/en_uk_lash/oc.m7.d1:ocVE.Aposticha3.mode	@ltx/en_uk_lash/miscellanea:misc.Mode7
ltx/en_uk_lash/oc.m7.d1:ocVE.Aposticha3.text	O Christ, by descending below Hell you despoiled death, and by rising on the third day you raised us with you as we glorified your all-powerful Rising. Lord, glory to you!
ltx/en_uk_lash/oc.m7.d1:ocVE.Aposticha4.incipit	Fearful you appeared, Lord, as…
ltx/en_uk_lash/oc.m7.d1:ocVE.Aposticha4.melody	
ltx/en_uk_lash/oc.m7.d1:ocVE.Aposticha4.mode	@ltx/en_uk_lash/miscellanea:misc.Mode7
ltx/en_uk_lash/oc.m7.d1:ocVE.Aposticha4.text	Fearful you appeared, Lord, as you lay in the tomb; but rising on the third day in power you raised with you Adam, who cried: Glory to your Resurrection, only lover of mankind.
ltx/en_uk_lash/oc.m7.d1:ocVE.MM.LIHC1.text	@ltx/en_uk_lash/properties:media.key
ltx/en_uk_lash/oc.m7.d1:ocVE.MM.LIHC2.text	@ltx/en_uk_lash/properties:media.key
ltx/en_uk_lash/oc.m7.d1:ocVE.MM.Stichologia.text	@ltx/en_uk_lash/properties:media.key
ltx/en_uk_lash/oc.m7.d1:ocVE.SticTheotokion.incipit	You were known as a…
ltx/en_uk_lash/oc.m7.d1:ocVE.SticTheotokion.melody	
ltx/en_uk_lash/oc.m7.d1:ocVE.SticTheotokion.mode	@ltx/en_uk_lash/miscellanea:misc.Mode7
ltx/en_uk_lash/oc.m7.d1:ocVE.SticTheotokion.text	You were known as a Mother beyond nature, O Mother of God; you remained a Virgin beyond reason and understanding; no tongue can expound the marvel of your child-bearing; for while your conceiving, Pure One, was wondrous, the manner of your bearing child cannot be comprehended, for wherever God wills the order of nature is overthrown. Therefore as we all acknowledge you to be Mother of God we implore you insistently: Intercede that our souls may be saved.
ltx/en_uk_lash/oc.m7.d1:ocVE.Stichera1.incipit	Come, let us rejoice in…
ltx/en_uk_lash/oc.m7.d1:ocVE.Stichera1.melody	
ltx/en_uk_lash/oc.m7.d1:ocVE.Stichera1.mode	@ltx/en_uk_lash/miscellanea:misc.Mode7
ltx/en_uk_lash/oc.m7.d1:ocVE.Stichera1.text	Come, let us rejoice in the Lord who has smashed the might of death and enlightened the human race, as we cry with the Bodiless Powers: Our Creator and Saviour, glory to you!
ltx/en_uk_lash/oc.m7.d1:ocVE.Stichera2.incipit	For us, O Saviour, you…
ltx/en_uk_lash/oc.m7.d1:ocVE.Stichera2.melody	
ltx/en_uk_lash/oc.m7.d1:ocVE.Stichera2.mode	@ltx/en_uk_lash/miscellanea:misc.Mode7
ltx/en_uk_lash/oc.m7.d1:ocVE.Stichera2.text	For us, O Saviour, you endured the Cross and burial; but as God by your death you put death to death; and so we worship your Resurrection on the third day. Lord, glory to you!
ltx/en_uk_lash/oc.m7.d1:ocVE.Stichera3.incipit	The Apostles marvelled when they…
ltx/en_uk_lash/oc.m7.d1:ocVE.Stichera3.melody	
ltx/en_uk_lash/oc.m7.d1:ocVE.Stichera3.mode	@ltx/en_uk_lash/miscellanea:misc.Mode7
ltx/en_uk_lash/oc.m7.d1:ocVE.Stichera3.text	The Apostles marvelled when they saw the Creator''s Rising and cried aloud the angelic hymn of praise: This is the glory of the Church, this is the wealth of the Kingdom. O Lord, who suffered for us, glory to you!
ltx/en_uk_lash/oc.m7.d1:ocVE.Stichera4.incipit	Though you were seized by…
ltx/en_uk_lash/oc.m7.d1:ocVE.Stichera4.melody	
ltx/en_uk_lash/oc.m7.d1:ocVE.Stichera4.mode	@ltx/en_uk_lash/miscellanea:misc.Mode7
ltx/en_uk_lash/oc.m7.d1:ocVE.Stichera4.text	Though you were seized by lawless men, O Christ, yet you are my God, and I am not ashamed; your back was scourged, I do not deny you; You were nailed to a Cross, and I do not hide. I make my boast in your Rising; for your death is my life. All-powerful Lord who love mankind, glory to you!
ltx/en_uk_lash/oc.m7.d1:ocVE.Stichera5.incipit	Fulfilling David''s prophecy Christ revealed…
ltx/en_uk_lash/oc.m7.d1:ocVE.Stichera5.melody	
ltx/en_uk_lash/oc.m7.d1:ocVE.Stichera5.mode	@ltx/en_uk_lash/miscellanea:misc.Mode7
ltx/en_uk_lash/oc.m7.d1:ocVE.Stichera5.text	Fulfilling David''s prophecy Christ revealed his own greatness in Sion to his Disciples, showing that he was praised and ever glorified with the Father and the Holy Spirit; before without flesh as Word. later for us incarnate and put to death as man, and risen with authority as he loves mankind.
ltx/en_uk_lash/oc.m7.d1:ocVE.Stichera6.incipit	You descended into Hell as…
ltx/en_uk_lash/oc.m7.d1:ocVE.Stichera6.melody	
ltx/en_uk_lash/oc.m7.d1:ocVE.Stichera6.mode	@ltx/en_uk_lash/miscellanea:misc.Mode7
ltx/en_uk_lash/oc.m7.d1:ocVE.Stichera6.text	You descended into Hell as you willed, O Christ, you despoiled death as God and master; and you rose on the third day, raising with yourself from the bonds of Hell and from corruption Adam as he cried and said: Glory to your Resurrection, only lover of mankind.
ltx/en_uk_lash/oc.m7.d1:ocVE.Stichera7.incipit	You were laid in a…
ltx/en_uk_lash/oc.m7.d1:ocVE.Stichera7.melody	
ltx/en_uk_lash/oc.m7.d1:ocVE.Stichera7.mode	@ltx/en_uk_lash/miscellanea:misc.Mode7
ltx/en_uk_lash/oc.m7.d1:ocVE.Stichera7.text	You were laid in a tomb, O Lord, as one who slept and you rose on the third day as one powerful in strength, raising Adam with yourself from the corruption of death, as all-powerful.
