ltx/en_uk_lash/lectionaries:lecAP.ActsApostles.uc	
ltx/en_uk_lash/lectionaries:lecAP.Another_epistle	
ltx/en_uk_lash/lectionaries:lecAP.Apostolos.uc	
ltx/en_uk_lash/lectionaries:lecAP.EndActs.uc	
ltx/en_uk_lash/lectionaries:lecAP.EpistlesPaul.uc	
ltx/en_uk_lash/lectionaries:lecAP.EpistlesVarious.uc	
ltx/en_uk_lash/lectionaries:lecAP.HolyWeek.uc	
ltx/en_uk_lash/lectionaries:lecAP.Menaion.uc	
ltx/en_uk_lash/lectionaries:lecAP.Period.uc	
ltx/en_uk_lash/lectionaries:lecAP.R01	
ltx/en_uk_lash/lectionaries:lecAP.R02	
ltx/en_uk_lash/lectionaries:lecAP.R03	
ltx/en_uk_lash/lectionaries:lecAP.R04	
ltx/en_uk_lash/lectionaries:lecAP.R05	
ltx/en_uk_lash/lectionaries:lecAP.Various.uc	
ltx/en_uk_lash/lectionaries:lecAP.forAngels	
ltx/en_uk_lash/lectionaries:lecAP.forApostles	
ltx/en_uk_lash/lectionaries:lecAP.forCross	
ltx/en_uk_lash/lectionaries:lecAP.forDeceased	
ltx/en_uk_lash/lectionaries:lecAP.forForerunner	
ltx/en_uk_lash/lectionaries:lecAP.forSundays	
ltx/en_uk_lash/lectionaries:lecAP.forTheotokos	
ltx/en_uk_lash/lectionaries:lecAP.forWeekdays	
ltx/en_uk_lash/lectionaries:lecAP.mc.R014	
ltx/en_uk_lash/lectionaries:lecAP.mc.R021	
ltx/en_uk_lash/lectionaries:lecAP.mc.R028	
ltx/en_uk_lash/lectionaries:lecAP.mc.R050	
ltx/en_uk_lash/lectionaries:lecAP.mc.R056	
ltx/en_uk_lash/lectionaries:lecAP.mc.R057	
ltx/en_uk_lash/lectionaries:lecAP.mc.R071a	
ltx/en_uk_lash/lectionaries:lecAP.mc.R071b	
ltx/en_uk_lash/lectionaries:lecAP.mc.R120	
ltx/en_uk_lash/lectionaries:lecAP.me.m07.dHF.R01	
ltx/en_uk_lash/lectionaries:lecAP.me.m10.dHF.R01	
ltx/en_uk_lash/lectionaries:lecAP.me.m11.d16.R01	
ltx/en_uk_lash/lectionaries:lecAP.me.m12.dFF.R01	
ltx/en_uk_lash/lectionaries:lecAP.me.m12.dSunBE.R01	
ltx/en_uk_lash/lectionaries:lecAP.me.m12.dSunBE.R02	
ltx/en_uk_lash/lectionaries:lecAP.or	
ltx/en_uk_lash/lectionaries:lecAP.title1.text	
ltx/en_uk_lash/lectionaries:lecAP.title2.text	
ltx/en_uk_lash/lectionaries:lecAP.title3.text	
ltx/en_uk_lash/lectionaries:lecAP.title4.text	
ltx/en_uk_lash/lectionaries:lecAP.title5.text	
ltx/en_uk_lash/lectionaries:lecEV.Another	
ltx/en_uk_lash/lectionaries:lecEV.Another.uc	
ltx/en_uk_lash/lectionaries:lecEV.EothinaReadings	
ltx/en_uk_lash/lectionaries:lecEV.EothinaReadings.uc	
ltx/en_uk_lash/lectionaries:lecEV.Evangelion	
ltx/en_uk_lash/lectionaries:lecEV.Evangelion.uc	
ltx/en_uk_lash/lectionaries:lecEV.ForefestalGospel	
ltx/en_uk_lash/lectionaries:lecEV.ForefestalGospel.uc	
ltx/en_uk_lash/lectionaries:lecEV.GospelsHolyWeek.uc	
ltx/en_uk_lash/lectionaries:lecEV.GospelsHours1.uc	
ltx/en_uk_lash/lectionaries:lecEV.GospelsHours2.uc	
ltx/en_uk_lash/lectionaries:lecEV.GospelsJohn1.uc	
ltx/en_uk_lash/lectionaries:lecEV.GospelsJohn2.uc	
ltx/en_uk_lash/lectionaries:lecEV.GospelsLentWeek1.uc	
ltx/en_uk_lash/lectionaries:lecEV.GospelsLentWeek2.uc	
ltx/en_uk_lash/lectionaries:lecEV.GospelsLuke1.uc	
ltx/en_uk_lash/lectionaries:lecEV.GospelsLuke2.uc	
ltx/en_uk_lash/lectionaries:lecEV.GospelsMark1.uc	
ltx/en_uk_lash/lectionaries:lecEV.GospelsMark2.uc	
ltx/en_uk_lash/lectionaries:lecEV.GospelsMatthew1.uc	
ltx/en_uk_lash/lectionaries:lecEV.GospelsMatthew2.uc	
ltx/en_uk_lash/lectionaries:lecEV.GospelsMenaion.uc	
ltx/en_uk_lash/lectionaries:lecEV.GospelsPassion1.uc	
ltx/en_uk_lash/lectionaries:lecEV.GospelsPassion2.uc	
ltx/en_uk_lash/lectionaries:lecEV.GospelsPassion3.uc	
ltx/en_uk_lash/lectionaries:lecEV.GospelsSaints.uc	
ltx/en_uk_lash/lectionaries:lecEV.GospelsVarious.uc	
ltx/en_uk_lash/lectionaries:lecEV.PostfestalGospel	
ltx/en_uk_lash/lectionaries:lecEV.PostfestalGospel.uc	
ltx/en_uk_lash/lectionaries:lecEV.atWashingFeet	
ltx/en_uk_lash/lectionaries:lecEV.forAngels	
ltx/en_uk_lash/lectionaries:lecEV.forApostles	
ltx/en_uk_lash/lectionaries:lecEV.forDevoutMartyrs	
ltx/en_uk_lash/lectionaries:lecEV.forDevoutMen	
ltx/en_uk_lash/lectionaries:lecEV.forHierarchs	
ltx/en_uk_lash/lectionaries:lecEV.forHieromartyrs	
ltx/en_uk_lash/lectionaries:lecEV.forMartyrs	
ltx/en_uk_lash/lectionaries:lecEV.forOneApostle	
ltx/en_uk_lash/lectionaries:lecEV.forOneHierarch	
ltx/en_uk_lash/lectionaries:lecEV.forOneMartyr	
ltx/en_uk_lash/lectionaries:lecEV.forProphets	
ltx/en_uk_lash/lectionaries:lecEV.forWomenDevout	
ltx/en_uk_lash/lectionaries:lecEV.forWomenDevoutMartyrs	
ltx/en_uk_lash/lectionaries:lecEV.forWomenMartyrs	
ltx/en_uk_lash/lectionaries:lecEV.me.m07.dHF.R01	
ltx/en_uk_lash/lectionaries:lecEV.me.m10.dHF.R01	
ltx/en_uk_lash/lectionaries:lecEV.me.m12.dFF.R01	
ltx/en_uk_lash/lectionaries:lecEV.me.m12.dSunBE.R01	
ltx/en_uk_lash/lectionaries:lecEV.ofLuke.uc	
ltx/en_uk_lash/lectionaries:lecEV.ofMatthew.uc	
ltx/en_uk_lash/lectionaries:lecEV.title1.text	
ltx/en_uk_lash/lectionaries:lecEV.title2.text	
ltx/en_uk_lash/lectionaries:lecLE.AllSaints	
ltx/en_uk_lash/lectionaries:lecLE.AllSaints.uc	
ltx/en_uk_lash/lectionaries:lecLE.Day1	
ltx/en_uk_lash/lectionaries:lecLE.Day1.uc	
ltx/en_uk_lash/lectionaries:lecLE.Day2	
ltx/en_uk_lash/lectionaries:lecLE.Day2.uc	
ltx/en_uk_lash/lectionaries:lecLE.Day3	
ltx/en_uk_lash/lectionaries:lecLE.Day3.uc	
ltx/en_uk_lash/lectionaries:lecLE.Day4	
ltx/en_uk_lash/lectionaries:lecLE.Day4.uc	
ltx/en_uk_lash/lectionaries:lecLE.Day5	
ltx/en_uk_lash/lectionaries:lecLE.Day5.uc	
ltx/en_uk_lash/lectionaries:lecLE.Day6	
ltx/en_uk_lash/lectionaries:lecLE.Day6.uc	
ltx/en_uk_lash/lectionaries:lecLE.Day7	
ltx/en_uk_lash/lectionaries:lecLE.Day7.uc	
ltx/en_uk_lash/lectionaries:lecLE.Eothinon	
ltx/en_uk_lash/lectionaries:lecLE.Eothinon.uc	
ltx/en_uk_lash/lectionaries:lecLE.ForefeastCross	
ltx/en_uk_lash/lectionaries:lecLE.ForefeastCross.uc	
ltx/en_uk_lash/lectionaries:lecLE.HolyFriday	
ltx/en_uk_lash/lectionaries:lecLE.HolyFriday.uc	
ltx/en_uk_lash/lectionaries:lecLE.HolyMonday	
ltx/en_uk_lash/lectionaries:lecLE.HolyMonday.uc	
ltx/en_uk_lash/lectionaries:lecLE.HolySaturday	
ltx/en_uk_lash/lectionaries:lecLE.HolySaturday.uc	
ltx/en_uk_lash/lectionaries:lecLE.HolySpirit	
ltx/en_uk_lash/lectionaries:lecLE.HolySpirit.uc	
ltx/en_uk_lash/lectionaries:lecLE.HolyThursday	
ltx/en_uk_lash/lectionaries:lecLE.HolyThursday.uc	
ltx/en_uk_lash/lectionaries:lecLE.HolyTuesday	
ltx/en_uk_lash/lectionaries:lecLE.HolyTuesday.uc	
ltx/en_uk_lash/lectionaries:lecLE.HolyWednesday	
ltx/en_uk_lash/lectionaries:lecLE.HolyWednesday.uc	
ltx/en_uk_lash/lectionaries:lecLE.HolyWeek	
ltx/en_uk_lash/lectionaries:lecLE.HolyWeek.uc	
ltx/en_uk_lash/lectionaries:lecLE.Hour1	
ltx/en_uk_lash/lectionaries:lecLE.Hour1.uc	
ltx/en_uk_lash/lectionaries:lecLE.Hour3	
ltx/en_uk_lash/lectionaries:lecLE.Hour3.uc	
ltx/en_uk_lash/lectionaries:lecLE.Hour6	
ltx/en_uk_lash/lectionaries:lecLE.Hour6.uc	
ltx/en_uk_lash/lectionaries:lecLE.Hour9	
ltx/en_uk_lash/lectionaries:lecLE.Hour9.uc	
ltx/en_uk_lash/lectionaries:lecLE.Liturgy	
ltx/en_uk_lash/lectionaries:lecLE.Liturgy.uc	
ltx/en_uk_lash/lectionaries:lecLE.Matins	
ltx/en_uk_lash/lectionaries:lecLE.Matins.uc	
ltx/en_uk_lash/lectionaries:lecLE.PalmSunday	
ltx/en_uk_lash/lectionaries:lecLE.PalmSunday.uc	
ltx/en_uk_lash/lectionaries:lecLE.PaschaSunday	
ltx/en_uk_lash/lectionaries:lecLE.PaschaSunday.uc	
ltx/en_uk_lash/lectionaries:lecLE.PostfeastEpiphany	
ltx/en_uk_lash/lectionaries:lecLE.PostfeastEpiphany.uc	
ltx/en_uk_lash/lectionaries:lecLE.SaturdayAfterChristmas	
ltx/en_uk_lash/lectionaries:lecLE.SaturdayAfterChristmas.uc	
ltx/en_uk_lash/lectionaries:lecLE.SaturdayAfterCross	
ltx/en_uk_lash/lectionaries:lecLE.SaturdayAfterCross.uc	
ltx/en_uk_lash/lectionaries:lecLE.SaturdayAfterEpiphany	
ltx/en_uk_lash/lectionaries:lecLE.SaturdayAfterEpiphany.uc	
ltx/en_uk_lash/lectionaries:lecLE.SaturdayBeforeChristmas	
ltx/en_uk_lash/lectionaries:lecLE.SaturdayBeforeChristmas.uc	
ltx/en_uk_lash/lectionaries:lecLE.SaturdayBeforeCross	
ltx/en_uk_lash/lectionaries:lecLE.SaturdayBeforeCross.uc	
ltx/en_uk_lash/lectionaries:lecLE.SaturdayBeforeEpiphany	
ltx/en_uk_lash/lectionaries:lecLE.SaturdayBeforeEpiphany.uc	
ltx/en_uk_lash/lectionaries:lecLE.ServiceOfGreatHours	
ltx/en_uk_lash/lectionaries:lecLE.ServiceOfGreatHours.uc	
ltx/en_uk_lash/lectionaries:lecLE.SundayAfterCross	
ltx/en_uk_lash/lectionaries:lecLE.SundayAfterCross.uc	
ltx/en_uk_lash/lectionaries:lecLE.SundayAfterEpiphany	
ltx/en_uk_lash/lectionaries:lecLE.SundayAfterEpiphany.uc	
ltx/en_uk_lash/lectionaries:lecLE.SundayAntipascha	
ltx/en_uk_lash/lectionaries:lecLE.SundayAntipascha.uc	
ltx/en_uk_lash/lectionaries:lecLE.SundayBeforeCross	
ltx/en_uk_lash/lectionaries:lecLE.SundayBeforeCross.uc	
ltx/en_uk_lash/lectionaries:lecLE.SundayBeforeEpiphany	
ltx/en_uk_lash/lectionaries:lecLE.SundayBeforeEpiphany.uc	
ltx/en_uk_lash/lectionaries:lecLE.Triodion1	
ltx/en_uk_lash/lectionaries:lecLE.Triodion1.uc	
ltx/en_uk_lash/lectionaries:lecLE.Triodion2	
ltx/en_uk_lash/lectionaries:lecLE.Triodion2.uc	
ltx/en_uk_lash/lectionaries:lecLE.Triodion3	
ltx/en_uk_lash/lectionaries:lecLE.Triodion3.uc	
ltx/en_uk_lash/lectionaries:lecLE.Triodion4	
ltx/en_uk_lash/lectionaries:lecLE.Triodion4.uc	
ltx/en_uk_lash/lectionaries:lecLE.Vespers	
ltx/en_uk_lash/lectionaries:lecLE.Vespers.uc	
ltx/en_uk_lash/lectionaries:lecLE.atLiturgy	
ltx/en_uk_lash/lectionaries:lecLE.atLiturgy.uc	
ltx/en_uk_lash/lectionaries:lecLE.atMatins	
ltx/en_uk_lash/lectionaries:lecLE.atMatins.uc	
ltx/en_uk_lash/lectionaries:lecLE.atVespers	
ltx/en_uk_lash/lectionaries:lecLE.atVespers.uc	
ltx/en_uk_lash/lectionaries:lecLE.atVespersOrLiturgy	
ltx/en_uk_lash/lectionaries:lecLE.atVespersOrLiturgy.uc	
ltx/en_uk_lash/lectionaries:lecLE.closeP	
ltx/en_uk_lash/lectionaries:lecLE.forAnyPetition.uc	
ltx/en_uk_lash/lectionaries:lecLE.forAutomobile.uc	
ltx/en_uk_lash/lectionaries:lecLE.forBaptism	
ltx/en_uk_lash/lectionaries:lecLE.forBaptism.uc	
ltx/en_uk_lash/lectionaries:lecLE.forBuildingFoundation.uc	
ltx/en_uk_lash/lectionaries:lecLE.forConfessionMen.uc	
ltx/en_uk_lash/lectionaries:lecLE.forConfessionWomen.uc	
ltx/en_uk_lash/lectionaries:lecLE.forConsecration	
ltx/en_uk_lash/lectionaries:lecLE.forConsecration.uc	
ltx/en_uk_lash/lectionaries:lecLE.forDeceased	
ltx/en_uk_lash/lectionaries:lecLE.forDeceased.uc	
ltx/en_uk_lash/lectionaries:lecLE.forDeceasedInfants.uc	
ltx/en_uk_lash/lectionaries:lecLE.forDooropening	
ltx/en_uk_lash/lectionaries:lecLE.forDooropening.uc	
ltx/en_uk_lash/lectionaries:lecLE.forDrought.uc	
ltx/en_uk_lash/lectionaries:lecLE.forEarthquake.uc	
ltx/en_uk_lash/lectionaries:lecLE.forFire.uc	
ltx/en_uk_lash/lectionaries:lecLE.forForeignInvasion.uc	
ltx/en_uk_lash/lectionaries:lecLE.forFuneral	
ltx/en_uk_lash/lectionaries:lecLE.forFuneral.uc	
ltx/en_uk_lash/lectionaries:lecLE.forGrounbreaking.uc	
ltx/en_uk_lash/lectionaries:lecLE.forHabitMonk.uc	
ltx/en_uk_lash/lectionaries:lecLE.forHabitNun.uc	
ltx/en_uk_lash/lectionaries:lecLE.forPrivateEndeavor.uc	
ltx/en_uk_lash/lectionaries:lecLE.forPublicOffice.uc	
ltx/en_uk_lash/lectionaries:lecLE.forSchoolYear.uc	
ltx/en_uk_lash/lectionaries:lecLE.forShip.uc	
ltx/en_uk_lash/lectionaries:lecLE.forSick.uc	
ltx/en_uk_lash/lectionaries:lecLE.forSickWoman.uc	
ltx/en_uk_lash/lectionaries:lecLE.forSmallWater	
ltx/en_uk_lash/lectionaries:lecLE.forSmallWater.uc	
ltx/en_uk_lash/lectionaries:lecLE.forUnction	
ltx/en_uk_lash/lectionaries:lecLE.forUnction.uc	
ltx/en_uk_lash/lectionaries:lecLE.forWedding	
ltx/en_uk_lash/lectionaries:lecLE.forWedding.uc	
ltx/en_uk_lash/lectionaries:lecLE.fromDay1	
ltx/en_uk_lash/lectionaries:lecLE.fromDay1.uc	
ltx/en_uk_lash/lectionaries:lecLE.fromDay2	
ltx/en_uk_lash/lectionaries:lecLE.fromDay2.uc	
ltx/en_uk_lash/lectionaries:lecLE.fromDay3	
ltx/en_uk_lash/lectionaries:lecLE.fromDay3.uc	
ltx/en_uk_lash/lectionaries:lecLE.fromDay4	
ltx/en_uk_lash/lectionaries:lecLE.fromDay4.uc	
ltx/en_uk_lash/lectionaries:lecLE.fromDay5	
ltx/en_uk_lash/lectionaries:lecLE.fromDay5.uc	
ltx/en_uk_lash/lectionaries:lecLE.fromDay6	
ltx/en_uk_lash/lectionaries:lecLE.fromDay6.uc	
ltx/en_uk_lash/lectionaries:lecLE.fromDay7	
ltx/en_uk_lash/lectionaries:lecLE.fromDay7.uc	
ltx/en_uk_lash/lectionaries:lecLE.ofAkathist	
ltx/en_uk_lash/lectionaries:lecLE.ofAkathist.uc	
ltx/en_uk_lash/lectionaries:lecLE.ofAscension	
ltx/en_uk_lash/lectionaries:lecLE.ofAscension.uc	
ltx/en_uk_lash/lectionaries:lecLE.ofBlindman	
ltx/en_uk_lash/lectionaries:lecLE.ofBlindman.uc	
ltx/en_uk_lash/lectionaries:lecLE.ofCrossVeneration	
ltx/en_uk_lash/lectionaries:lecLE.ofCrossVeneration.uc	
ltx/en_uk_lash/lectionaries:lecLE.ofHolyFathers	
ltx/en_uk_lash/lectionaries:lecLE.ofHolyFathers.uc	
ltx/en_uk_lash/lectionaries:lecLE.ofHour	
ltx/en_uk_lash/lectionaries:lecLE.ofHour.uc	
ltx/en_uk_lash/lectionaries:lecLE.ofLazarus	
ltx/en_uk_lash/lectionaries:lecLE.ofLazarus.uc	
ltx/en_uk_lash/lectionaries:lecLE.ofLent	
ltx/en_uk_lash/lectionaries:lecLE.ofLent.uc	
ltx/en_uk_lash/lectionaries:lecLE.ofMidPentecost	
ltx/en_uk_lash/lectionaries:lecLE.ofMidPentecost.uc	
ltx/en_uk_lash/lectionaries:lecLE.ofMyrrhbearers	
ltx/en_uk_lash/lectionaries:lecLE.ofMyrrhbearers.uc	
ltx/en_uk_lash/lectionaries:lecLE.ofOrthodoxy	
ltx/en_uk_lash/lectionaries:lecLE.ofOrthodoxy.uc	
ltx/en_uk_lash/lectionaries:lecLE.ofParalytic	
ltx/en_uk_lash/lectionaries:lecLE.ofParalytic.uc	
ltx/en_uk_lash/lectionaries:lecLE.ofPentecost	
ltx/en_uk_lash/lectionaries:lecLE.ofPentecost.uc	
ltx/en_uk_lash/lectionaries:lecLE.ofRenewalWeek	
ltx/en_uk_lash/lectionaries:lecLE.ofRenewalWeek.uc	
ltx/en_uk_lash/lectionaries:lecLE.ofSamaritan	
ltx/en_uk_lash/lectionaries:lecLE.ofSamaritan.uc	
ltx/en_uk_lash/lectionaries:lecLE.ofThomas	
ltx/en_uk_lash/lectionaries:lecLE.ofThomas.uc	
ltx/en_uk_lash/lectionaries:lecLE.ofTriodion3	
ltx/en_uk_lash/lectionaries:lecLE.ofTriodion3.uc	
ltx/en_uk_lash/lectionaries:lecLE.ofTriodion4	
ltx/en_uk_lash/lectionaries:lecLE.ofTriodion4.uc	
ltx/en_uk_lash/lectionaries:lecLE.ofWeek	
ltx/en_uk_lash/lectionaries:lecLE.ofWeek.uc	
ltx/en_uk_lash/lectionaries:lecLE.ofthe	
ltx/en_uk_lash/lectionaries:lecLE.ofthe.uc	
ltx/en_uk_lash/lectionaries:lecLE.onDay1	
ltx/en_uk_lash/lectionaries:lecLE.onDay1.uc	
ltx/en_uk_lash/lectionaries:lecLE.onDay2	
ltx/en_uk_lash/lectionaries:lecLE.onDay2.uc	
ltx/en_uk_lash/lectionaries:lecLE.onDay3	
ltx/en_uk_lash/lectionaries:lecLE.onDay3.uc	
ltx/en_uk_lash/lectionaries:lecLE.onDay4	
ltx/en_uk_lash/lectionaries:lecLE.onDay4.uc	
ltx/en_uk_lash/lectionaries:lecLE.onDay5	
ltx/en_uk_lash/lectionaries:lecLE.onDay5.uc	
ltx/en_uk_lash/lectionaries:lecLE.onDay6	
ltx/en_uk_lash/lectionaries:lecLE.onDay6.uc	
ltx/en_uk_lash/lectionaries:lecLE.onDay7	
ltx/en_uk_lash/lectionaries:lecLE.onDay7.uc	
ltx/en_uk_lash/lectionaries:lecLE.openP	
ltx/en_uk_lash/lectionaries:lecLE.ordinal01a	
ltx/en_uk_lash/lectionaries:lecLE.ordinal01a.uc	
ltx/en_uk_lash/lectionaries:lecLE.ordinal01b	
ltx/en_uk_lash/lectionaries:lecLE.ordinal01b.uc	
ltx/en_uk_lash/lectionaries:lecLE.ordinal02a	
ltx/en_uk_lash/lectionaries:lecLE.ordinal02a.uc	
ltx/en_uk_lash/lectionaries:lecLE.ordinal02b	
ltx/en_uk_lash/lectionaries:lecLE.ordinal02b.uc	
ltx/en_uk_lash/lectionaries:lecLE.ordinal03a	
ltx/en_uk_lash/lectionaries:lecLE.ordinal03a.uc	
ltx/en_uk_lash/lectionaries:lecLE.ordinal03b	
ltx/en_uk_lash/lectionaries:lecLE.ordinal03b.uc	
ltx/en_uk_lash/lectionaries:lecLE.ordinal04a	
ltx/en_uk_lash/lectionaries:lecLE.ordinal04a.uc	
ltx/en_uk_lash/lectionaries:lecLE.ordinal04b	
ltx/en_uk_lash/lectionaries:lecLE.ordinal04b.uc	
ltx/en_uk_lash/lectionaries:lecLE.ordinal05a	
ltx/en_uk_lash/lectionaries:lecLE.ordinal05a.uc	
ltx/en_uk_lash/lectionaries:lecLE.ordinal05b	
ltx/en_uk_lash/lectionaries:lecLE.ordinal05b.uc	
ltx/en_uk_lash/lectionaries:lecLE.ordinal06a	
ltx/en_uk_lash/lectionaries:lecLE.ordinal06a.uc	
ltx/en_uk_lash/lectionaries:lecLE.ordinal06b	
ltx/en_uk_lash/lectionaries:lecLE.ordinal06b.uc	
ltx/en_uk_lash/lectionaries:lecLE.ordinal07a	
ltx/en_uk_lash/lectionaries:lecLE.ordinal07a.uc	
ltx/en_uk_lash/lectionaries:lecLE.ordinal07b	
ltx/en_uk_lash/lectionaries:lecLE.ordinal07b.uc	
ltx/en_uk_lash/lectionaries:lecLE.ordinal08a	
ltx/en_uk_lash/lectionaries:lecLE.ordinal08a.uc	
ltx/en_uk_lash/lectionaries:lecLE.ordinal08b	
ltx/en_uk_lash/lectionaries:lecLE.ordinal08b.uc	
ltx/en_uk_lash/lectionaries:lecLE.ordinal09a	
ltx/en_uk_lash/lectionaries:lecLE.ordinal09a.uc	
ltx/en_uk_lash/lectionaries:lecLE.ordinal09b	
ltx/en_uk_lash/lectionaries:lecLE.ordinal09b.uc	
ltx/en_uk_lash/lectionaries:lecLE.ordinal10a	
ltx/en_uk_lash/lectionaries:lecLE.ordinal10a.uc	
ltx/en_uk_lash/lectionaries:lecLE.ordinal10b	
ltx/en_uk_lash/lectionaries:lecLE.ordinal10b.uc	
ltx/en_uk_lash/lectionaries:lecLE.ordinal11a	
ltx/en_uk_lash/lectionaries:lecLE.ordinal11a.uc	
ltx/en_uk_lash/lectionaries:lecLE.ordinal11b	
ltx/en_uk_lash/lectionaries:lecLE.ordinal11b.uc	
ltx/en_uk_lash/lectionaries:lecLE.ordinal12a	
ltx/en_uk_lash/lectionaries:lecLE.ordinal12a.uc	
ltx/en_uk_lash/lectionaries:lecLE.ordinal12b	
ltx/en_uk_lash/lectionaries:lecLE.ordinal12b.uc	
ltx/en_uk_lash/lectionaries:lecLE.ordinal13a	
ltx/en_uk_lash/lectionaries:lecLE.ordinal13a.uc	
ltx/en_uk_lash/lectionaries:lecLE.ordinal13b	
ltx/en_uk_lash/lectionaries:lecLE.ordinal13b.uc	
ltx/en_uk_lash/lectionaries:lecLE.ordinal14a	
ltx/en_uk_lash/lectionaries:lecLE.ordinal14a.uc	
ltx/en_uk_lash/lectionaries:lecLE.ordinal14b	
ltx/en_uk_lash/lectionaries:lecLE.ordinal14b.uc	
ltx/en_uk_lash/lectionaries:lecLE.ordinal15a	
ltx/en_uk_lash/lectionaries:lecLE.ordinal15a.uc	
ltx/en_uk_lash/lectionaries:lecLE.ordinal15b	
ltx/en_uk_lash/lectionaries:lecLE.ordinal15b.uc	
ltx/en_uk_lash/lectionaries:lecLE.ordinal16a	
ltx/en_uk_lash/lectionaries:lecLE.ordinal16a.uc	
ltx/en_uk_lash/lectionaries:lecLE.ordinal16b	
ltx/en_uk_lash/lectionaries:lecLE.ordinal16b.uc	
ltx/en_uk_lash/lectionaries:lecLE.ordinal17a	
ltx/en_uk_lash/lectionaries:lecLE.ordinal17a.uc	
ltx/en_uk_lash/lectionaries:lecLE.ordinal17b	
ltx/en_uk_lash/lectionaries:lecLE.ordinal17b.uc	
ltx/en_uk_lash/lectionaries:lecLE.ordinal18a	
ltx/en_uk_lash/lectionaries:lecLE.ordinal18a.uc	
ltx/en_uk_lash/lectionaries:lecLE.ordinal18b	
ltx/en_uk_lash/lectionaries:lecLE.ordinal18b.uc	
ltx/en_uk_lash/lectionaries:lecLE.ordinal19a	
ltx/en_uk_lash/lectionaries:lecLE.ordinal19a.uc	
ltx/en_uk_lash/lectionaries:lecLE.ordinal19b	
ltx/en_uk_lash/lectionaries:lecLE.ordinal19b.uc	
ltx/en_uk_lash/lectionaries:lecLE.ordinal20a	
ltx/en_uk_lash/lectionaries:lecLE.ordinal20a.uc	
ltx/en_uk_lash/lectionaries:lecLE.ordinal20b	
ltx/en_uk_lash/lectionaries:lecLE.ordinal20b.uc	
ltx/en_uk_lash/lectionaries:lecLE.ordinal21a	
ltx/en_uk_lash/lectionaries:lecLE.ordinal21a.uc	
ltx/en_uk_lash/lectionaries:lecLE.ordinal21b	
ltx/en_uk_lash/lectionaries:lecLE.ordinal21b.uc	
ltx/en_uk_lash/lectionaries:lecLE.ordinal22a	
ltx/en_uk_lash/lectionaries:lecLE.ordinal22a.uc	
ltx/en_uk_lash/lectionaries:lecLE.ordinal22b	
ltx/en_uk_lash/lectionaries:lecLE.ordinal22b.uc	
ltx/en_uk_lash/lectionaries:lecLE.ordinal23a	
ltx/en_uk_lash/lectionaries:lecLE.ordinal23a.uc	
ltx/en_uk_lash/lectionaries:lecLE.ordinal23b	
ltx/en_uk_lash/lectionaries:lecLE.ordinal23b.uc	
ltx/en_uk_lash/lectionaries:lecLE.ordinal24a	
ltx/en_uk_lash/lectionaries:lecLE.ordinal24a.uc	
ltx/en_uk_lash/lectionaries:lecLE.ordinal24b	
ltx/en_uk_lash/lectionaries:lecLE.ordinal24b.uc	
ltx/en_uk_lash/lectionaries:lecLE.ordinal25a	
ltx/en_uk_lash/lectionaries:lecLE.ordinal25a.uc	
ltx/en_uk_lash/lectionaries:lecLE.ordinal25b	
ltx/en_uk_lash/lectionaries:lecLE.ordinal25b.uc	
ltx/en_uk_lash/lectionaries:lecLE.ordinal26a	
ltx/en_uk_lash/lectionaries:lecLE.ordinal26a.uc	
ltx/en_uk_lash/lectionaries:lecLE.ordinal26b	
ltx/en_uk_lash/lectionaries:lecLE.ordinal26b.uc	
ltx/en_uk_lash/lectionaries:lecLE.ordinal27a	
ltx/en_uk_lash/lectionaries:lecLE.ordinal27a.uc	
ltx/en_uk_lash/lectionaries:lecLE.ordinal27b	
ltx/en_uk_lash/lectionaries:lecLE.ordinal27b.uc	
ltx/en_uk_lash/lectionaries:lecLE.ordinal28a	
ltx/en_uk_lash/lectionaries:lecLE.ordinal28a.uc	
ltx/en_uk_lash/lectionaries:lecLE.ordinal28b	
ltx/en_uk_lash/lectionaries:lecLE.ordinal28b.uc	
ltx/en_uk_lash/lectionaries:lecLE.ordinal29a	
ltx/en_uk_lash/lectionaries:lecLE.ordinal29a.uc	
ltx/en_uk_lash/lectionaries:lecLE.ordinal29b	
ltx/en_uk_lash/lectionaries:lecLE.ordinal29b.uc	
ltx/en_uk_lash/lectionaries:lecLE.ordinal30a	
ltx/en_uk_lash/lectionaries:lecLE.ordinal30a.uc	
ltx/en_uk_lash/lectionaries:lecLE.ordinal30b	
ltx/en_uk_lash/lectionaries:lecLE.ordinal30b.uc	
ltx/en_uk_lash/lectionaries:lecLE.ordinal31a	
ltx/en_uk_lash/lectionaries:lecLE.ordinal31a.uc	
ltx/en_uk_lash/lectionaries:lecLE.ordinal31b	
ltx/en_uk_lash/lectionaries:lecLE.ordinal31b.uc	
ltx/en_uk_lash/lectionaries:lecLE.ordinal32a	
ltx/en_uk_lash/lectionaries:lecLE.ordinal32a.uc	
ltx/en_uk_lash/lectionaries:lecLE.ordinal32b	
ltx/en_uk_lash/lectionaries:lecLE.ordinal32b.uc	
ltx/en_uk_lash/lectionaries:lecLE.ordinal33a	
ltx/en_uk_lash/lectionaries:lecLE.ordinal33a.uc	
ltx/en_uk_lash/lectionaries:lecLE.ordinal33b	
ltx/en_uk_lash/lectionaries:lecLE.ordinal33b.uc	
ltx/en_uk_lash/lectionaries:lecLE.ordinal34a	
ltx/en_uk_lash/lectionaries:lecLE.ordinal34a.uc	
ltx/en_uk_lash/lectionaries:lecLE.ordinal34b	
ltx/en_uk_lash/lectionaries:lecLE.ordinal34b.uc	
ltx/en_uk_lash/lectionaries:lecLE.ordinal35a	
ltx/en_uk_lash/lectionaries:lecLE.ordinal35a.uc	
ltx/en_uk_lash/lectionaries:lecLE.ordinal35b	
ltx/en_uk_lash/lectionaries:lecLE.ordinal35b.uc	
ltx/en_uk_lash/lectionaries:lecLE.separator	
ltx/en_uk_lash/lectionaries:lecPS.rubric_kathisma	
ltx/en_uk_lash/lectionaries:lecPS.rubric_kathisma11	
ltx/en_uk_lash/lectionaries:lecPS.rubric_lent_week5_option1	
ltx/en_uk_lash/lectionaries:lecPS.rubric_lent_week5_option2	
ltx/en_uk_lash/lectionaries:lecPS.rubric_lent_week5_option3	
ltx/en_uk_lash/lectionaries:lecPS.rubric_lent_week5_option4	
ltx/en_uk_lash/lectionaries:lecPS.rubric_litany	
ltx/en_uk_lash/lectionaries:lecPS.rubric_nokathisma	
ltx/en_uk_lash/lectionaries:lecPS.rubric_nolitany	
ltx/en_uk_lash/lectionaries:lecPS.rubric_presanctified	
ltx/en_uk_lash/lectionaries:lecPS.rubric_sos	
ltx/en_uk_lash/lectionaries:lecPS.rubric_unspecified_kathisma	
