ltx/en_uk_lash/le.pr.me.r83a:leprVE.reading.book_abbr	@ltx/en_uk_lash/bible:Joshua.abbr
ltx/en_uk_lash/le.pr.me.r83a:leprVE.reading.book_string	@ltx/en_uk_lash/bible:Joshua.text
ltx/en_uk_lash/le.pr.me.r83a:leprVE.reading.chapverse	[5, 13-15]
ltx/en_uk_lash/le.pr.me.r83a:leprVE.reading.text	It came to pass, when Jesus was in Jericho, that he looked up with his eyes and saw a man standing in front of him, and his drawn sword was in his hand. And Jesus approached him and said: ''Are you one of ours? Or are you one of the enemy''s?'' But he said to him: ''I am Chief Captain of the power of the Lord, and now I have come here''. And Jesus fell on his face to the ground and said: ''Master, what orders have you for your servant?'' And the Chief Captain of the Lord said to Jesus: ''Untie the sandals from your feet; for the place where you are standing is holy''; and Jesus did so.
ltx/en_uk_lash/le.pr.me.r83a:leprVE.reading.title	
ltx/en_uk_lash/le.pr.me.r83a:leprVE.reading.version	@ltx/en_uk_lash/properties:version.designation
