ltx/en_uk_lash/pe.d113:peDA.commemoration.full	Sunday of the 318 God-bearing Fathers of Nicaea
ltx/en_uk_lash/pe.d113:peDA.commemoration.short	Sunday of the 318 God-bearing Fathers of Nicaea
ltx/en_uk_lash/pe.d113:peDA.dismissal	@ltx/en_uk_lash/dismissals:dis00.andascension
ltx/en_uk_lash/pe.d113:peDA.insert1	and of the 318 God-bearing Fathers who met at the First Ecumenical Council at Nicaea,
ltx/en_uk_lash/pe.d113:peDA.insert2	whose memory we celebrate,
ltx/en_uk_lash/pe.d113:peDA.note	
ltx/en_uk_lash/pe.d113:peHO.commemorations	
ltx/en_uk_lash/pe.d113:peHO.daytitle	
ltx/en_uk_lash/pe.d113:peHO.description1	
ltx/en_uk_lash/pe.d113:peHO.description2	
ltx/en_uk_lash/pe.d113:peHO.note1	
ltx/en_uk_lash/pe.d113:peHO.note2	
ltx/en_uk_lash/pe.d113:peLI.AfterCommunion.incipit	@ltx/en_uk_lash/pe.d110:peVE.Apolytikion1.incipit
ltx/en_uk_lash/pe.d113:peLI.AfterCommunion.mode	@ltx/en_uk_lash/miscellanea:misc.Mode4
ltx/en_uk_lash/pe.d113:peLI.AfterCommunion.text	@ltx/en_uk_lash/pe.d110:peVE.Apolytikion1.text
ltx/en_uk_lash/pe.d113:peLI.Megalynarion.text	
ltx/en_uk_lash/pe.d113:peMA.C1.acrostic.notice1	
ltx/en_uk_lash/pe.d113:peMA.C1.acrostic.notice2	
ltx/en_uk_lash/pe.d113:peMA.C1.acrostic.text	
ltx/en_uk_lash/pe.d113:peMA.C1.acrostic.title	
ltx/en_uk_lash/pe.d113:peMA.C1.poet	
ltx/en_uk_lash/pe.d113:peMA.C1.title	@ltx/en_uk_lash/titles:ti.CanonFathers
ltx/en_uk_lash/pe.d113:peMA.C1.verse	@ltx/en_uk_lash/prayers:pr.verse_SaintsM.text
ltx/en_uk_lash/pe.d113:peMA.Exaposteilarion1.incipit	@ltx/en_uk_lash/eo.e10:eo.Exaposteilarion.incipit
ltx/en_uk_lash/pe.d113:peMA.Exaposteilarion1.melody	@ltx/en_uk_lash/he.a.m2:heAU.ToisMathitaisSynelthomen.notmetered
ltx/en_uk_lash/pe.d113:peMA.Exaposteilarion1.mode	@ltx/en_uk_lash/miscellanea:misc.Mode2
ltx/en_uk_lash/pe.d113:peMA.Exaposteilarion1.text	@ltx/en_uk_lash/eo.e10:eo.Exaposteilarion.text
ltx/en_uk_lash/pe.d113:peMA.Exaposteilarion2.incipit	@ltx/en_uk_lash/me.m07.dHF:meMA.Exaposteilarion1.incipit
ltx/en_uk_lash/pe.d113:peMA.Exaposteilarion2.melody	@ltx/en_uk_lash/he.a.m2:heAU.GynaikesAkoutisthite.notmetered
ltx/en_uk_lash/pe.d113:peMA.Exaposteilarion2.mode	@ltx/en_uk_lash/miscellanea:misc.Mode2
ltx/en_uk_lash/pe.d113:peMA.Exaposteilarion2.text	@ltx/en_uk_lash/me.m07.dHF:meMA.Exaposteilarion1.text
ltx/en_uk_lash/pe.d113:peMA.Exaposteilarion3.incipit	@ltx/en_uk_lash/pe.d110:peMA.Exaposteilarion1.incipit
ltx/en_uk_lash/pe.d113:peMA.Exaposteilarion3.melody	@ltx/en_uk_lash/miscellanea:misc.AutomelonNotMetered
ltx/en_uk_lash/pe.d113:peMA.Exaposteilarion3.mode	@ltx/en_uk_lash/miscellanea:misc.Mode2
ltx/en_uk_lash/pe.d113:peMA.Exaposteilarion3.text	@ltx/en_uk_lash/pe.d110:peMA.Exaposteilarion1.text
ltx/en_uk_lash/pe.d113:peMA.Kathisma11.incipit	@ltx/en_uk_lash/oc.m6.d1:ocMA.Kathisma11.incipit
ltx/en_uk_lash/pe.d113:peMA.Kathisma11.melody	
ltx/en_uk_lash/pe.d113:peMA.Kathisma11.mode	@ltx/en_uk_lash/miscellanea:misc.Mode6
ltx/en_uk_lash/pe.d113:peMA.Kathisma11.text	@ltx/en_uk_lash/oc.m6.d1:ocMA.Kathisma11.text
ltx/en_uk_lash/pe.d113:peMA.Kathisma12.incipit	@ltx/en_uk_lash/oc.m6.d1:ocMA.Kathisma12.incipit
ltx/en_uk_lash/pe.d113:peMA.Kathisma12.melody	
ltx/en_uk_lash/pe.d113:peMA.Kathisma12.mode	@ltx/en_uk_lash/miscellanea:misc.Mode6
ltx/en_uk_lash/pe.d113:peMA.Kathisma12.text	@ltx/en_uk_lash/oc.m6.d1:ocMA.Kathisma12.text
ltx/en_uk_lash/pe.d113:peMA.Kathisma13.incipit	@ltx/en_uk_lash/oc.m6.d1:ocVE.ApolTheotokionVM.incipit
ltx/en_uk_lash/pe.d113:peMA.Kathisma13.melody	
ltx/en_uk_lash/pe.d113:peMA.Kathisma13.mode	@ltx/en_uk_lash/miscellanea:misc.Mode6
ltx/en_uk_lash/pe.d113:peMA.Kathisma13.text	@ltx/en_uk_lash/oc.m6.d1:ocVE.ApolTheotokionVM.text
ltx/en_uk_lash/pe.d113:peMA.Kathisma21.incipit	@ltx/en_uk_lash/oc.m6.d1:ocMA.Kathisma21.incipit
ltx/en_uk_lash/pe.d113:peMA.Kathisma21.melody	
ltx/en_uk_lash/pe.d113:peMA.Kathisma21.mode	@ltx/en_uk_lash/miscellanea:misc.Mode6
ltx/en_uk_lash/pe.d113:peMA.Kathisma21.text	@ltx/en_uk_lash/oc.m6.d1:ocMA.Kathisma21.text
ltx/en_uk_lash/pe.d113:peMA.Kathisma22.incipit	…
ltx/en_uk_lash/pe.d113:peMA.Kathisma22.melody	
ltx/en_uk_lash/pe.d113:peMA.Kathisma22.mode	@ltx/en_uk_lash/miscellanea:misc.Mode6
ltx/en_uk_lash/pe.d113:peMA.Kathisma22.text	
ltx/en_uk_lash/pe.d113:peMA.Kathisma23.incipit	@ltx/en_uk_lash/oc.m6.d1:ocMA.Kathisma23.incipit
ltx/en_uk_lash/pe.d113:peMA.Kathisma23.melody	
ltx/en_uk_lash/pe.d113:peMA.Kathisma23.mode	@ltx/en_uk_lash/miscellanea:misc.Mode6
ltx/en_uk_lash/pe.d113:peMA.Kathisma23.text	@ltx/en_uk_lash/oc.m6.d1:ocMA.Kathisma23.text
ltx/en_uk_lash/pe.d113:peMA.Kontakion1.incipit	@ltx/en_uk_lash/me.m07.dHF:meMA.Kontakion1.incipit
ltx/en_uk_lash/pe.d113:peMA.Kontakion1.melody	@ltx/en_uk_lash/miscellanea:misc.AutomelonNotMetered
ltx/en_uk_lash/pe.d113:peMA.Kontakion1.mode	@ltx/en_uk_lash/miscellanea:misc.Mode8
ltx/en_uk_lash/pe.d113:peMA.Kontakion1.text	@ltx/en_uk_lash/me.m07.dHF:meMA.Kontakion1.text
ltx/en_uk_lash/pe.d113:peMA.Lauds6.greekmelody	@ltx/en_uk_lash/he.a.m6:heAU.OlinApothemenoi.greekname
ltx/en_uk_lash/pe.d113:peMA.Lauds6.incipit	@ltx/en_uk_lash/me.m07.dHF:meMA.Lauds1.incipit
ltx/en_uk_lash/pe.d113:peMA.Lauds6.melody	@ltx/en_uk_lash/he.a.m6:heAU.OlinApothemenoi.notmetered
ltx/en_uk_lash/pe.d113:peMA.Lauds6.mode	@ltx/en_uk_lash/miscellanea:misc.Mode6
ltx/en_uk_lash/pe.d113:peMA.Lauds6.text	@ltx/en_uk_lash/me.m07.dHF:meMA.Lauds1.text
ltx/en_uk_lash/pe.d113:peMA.Lauds7.incipit	@ltx/en_uk_lash/me.m07.dHF:meMA.Lauds2.incipit
ltx/en_uk_lash/pe.d113:peMA.Lauds7.melody	@ltx/en_uk_lash/he.a.m6:heAU.OlinApothemenoi.notmetered
ltx/en_uk_lash/pe.d113:peMA.Lauds7.mode	@ltx/en_uk_lash/miscellanea:misc.Mode6
ltx/en_uk_lash/pe.d113:peMA.Lauds7.text	@ltx/en_uk_lash/me.m07.dHF:meMA.Lauds2.text
ltx/en_uk_lash/pe.d113:peMA.Lauds8.incipit	@ltx/en_uk_lash/me.m07.dHF:meMA.Lauds3.incipit
ltx/en_uk_lash/pe.d113:peMA.Lauds8.melody	@ltx/en_uk_lash/he.a.m6:heAU.OlinApothemenoi.notmetered
ltx/en_uk_lash/pe.d113:peMA.Lauds8.mode	@ltx/en_uk_lash/miscellanea:misc.Mode6
ltx/en_uk_lash/pe.d113:peMA.Lauds8.text	@ltx/en_uk_lash/me.m07.dHF:meMA.Lauds3.text
ltx/en_uk_lash/pe.d113:peMA.LaudsGlory.incipit	@ltx/en_uk_lash/me.m10.dHF:meMA.LaudsGlory.incipit
ltx/en_uk_lash/pe.d113:peMA.LaudsGlory.melody	@ltx/en_uk_lash/miscellanea:misc.Idiomelon
ltx/en_uk_lash/pe.d113:peMA.LaudsGlory.mode	@ltx/en_uk_lash/miscellanea:misc.Mode8
ltx/en_uk_lash/pe.d113:peMA.LaudsGlory.text	@ltx/en_uk_lash/me.m10.dHF:meMA.LaudsGlory.text
ltx/en_uk_lash/pe.d113:peMA.Ode1C11.greekmelody	@ltx/en_uk_lash/he.h.m6:heHE.OsEnIpeiroPezefsas.greekname
ltx/en_uk_lash/pe.d113:peMA.Ode1C11.incipit	I praise the all-holy Council…
ltx/en_uk_lash/pe.d113:peMA.Ode1C11.melody	@ltx/en_uk_lash/he.h.m6:heHE.OsEnIpeiroPezefsas.name
ltx/en_uk_lash/pe.d113:peMA.Ode1C11.mode	@ltx/en_uk_lash/miscellanea:misc.Mode6
ltx/en_uk_lash/pe.d113:peMA.Ode1C11.ode	@ltx/en_uk_lash/miscellanea:misc.Ode1
ltx/en_uk_lash/pe.d113:peMA.Ode1C11.text	I praise the all-holy Council of the holy Fathers as I cry out: O Christ, I implore you, guard closely in me its all-holy revelation.
ltx/en_uk_lash/pe.d113:peMA.Ode1C12.incipit	Shining like lightning the godbearing…
ltx/en_uk_lash/pe.d113:peMA.Ode1C12.melody	@ltx/en_uk_lash/he.h.m6:heHE.OsEnIpeiroPezefsas.name
ltx/en_uk_lash/pe.d113:peMA.Ode1C12.mode	@ltx/en_uk_lash/miscellanea:misc.Mode6
ltx/en_uk_lash/pe.d113:peMA.Ode1C12.ode	@ltx/en_uk_lash/miscellanea:misc.Ode1
ltx/en_uk_lash/pe.d113:peMA.Ode1C12.text	Shining like lightning the godbearing Fathers, having come together today, confessed you clearly, O Christ, as alike without beginning and consubstantial with the Father.
ltx/en_uk_lash/pe.d113:peMA.Ode1C13.incipit	Illustrious are the groomsmen of…
ltx/en_uk_lash/pe.d113:peMA.Ode1C13.melody	@ltx/en_uk_lash/he.h.m6:heHE.OsEnIpeiroPezefsas.name
ltx/en_uk_lash/pe.d113:peMA.Ode1C13.mode	@ltx/en_uk_lash/miscellanea:misc.Mode6
ltx/en_uk_lash/pe.d113:peMA.Ode1C13.ode	@ltx/en_uk_lash/miscellanea:misc.Ode1
ltx/en_uk_lash/pe.d113:peMA.Ode1C13.text	Illustrious are the groomsmen of your bride the Church, O Master, who wisely laid down the definition of the faith and adorned her as with fair adornment of gold.
ltx/en_uk_lash/pe.d113:peMA.Ode1C1T.incipit	Near her own Son and…
ltx/en_uk_lash/pe.d113:peMA.Ode1C1T.melody	@ltx/en_uk_lash/he.h.m6:heHE.OsEnIpeiroPezefsas.name
ltx/en_uk_lash/pe.d113:peMA.Ode1C1T.mode	@ltx/en_uk_lash/miscellanea:misc.Mode6
ltx/en_uk_lash/pe.d113:peMA.Ode1C1T.ode	@ltx/en_uk_lash/miscellanea:misc.Ode1
ltx/en_uk_lash/pe.d113:peMA.Ode1C1T.text	Near her own Son and God the holy Queen stands clothed in many colours with divine glory, interceding for the salvation of our souls.
ltx/en_uk_lash/pe.d113:peMA.Ode3C11.greekmelody	@ltx/en_uk_lash/he.h.m6:heHE.OukEstinAgios.greekname
ltx/en_uk_lash/pe.d113:peMA.Ode3C11.incipit	Grafting impiously flux and change…
ltx/en_uk_lash/pe.d113:peMA.Ode3C11.melody	@ltx/en_uk_lash/he.h.m6:heHE.OukEstinAgios.name
ltx/en_uk_lash/pe.d113:peMA.Ode3C11.mode	@ltx/en_uk_lash/miscellanea:misc.Mode6
ltx/en_uk_lash/pe.d113:peMA.Ode3C11.ode	@ltx/en_uk_lash/miscellanea:misc.Ode3
ltx/en_uk_lash/pe.d113:peMA.Ode3C11.text	Grafting impiously flux and change and separation onto the divine begetting, the wicked and demented Arius is cut off by the separating sword of the Fathers.
ltx/en_uk_lash/pe.d113:peMA.Ode3C12.incipit	The holy heralds of God…
ltx/en_uk_lash/pe.d113:peMA.Ode3C12.melody	@ltx/en_uk_lash/he.h.m6:heHE.OukEstinAgios.name
ltx/en_uk_lash/pe.d113:peMA.Ode3C12.mode	@ltx/en_uk_lash/miscellanea:misc.Mode6
ltx/en_uk_lash/pe.d113:peMA.Ode3C12.ode	@ltx/en_uk_lash/miscellanea:misc.Ode3
ltx/en_uk_lash/pe.d113:peMA.Ode3C12.text	The holy heralds of God, all marching to battle like godly Abraham of old, mightily destroyed your raving foes, O Good one, by your sovereign power.
ltx/en_uk_lash/pe.d113:peMA.Ode3C13.incipit	Holily the first, applauded gathering…
ltx/en_uk_lash/pe.d113:peMA.Ode3C13.melody	@ltx/en_uk_lash/he.h.m6:heHE.OukEstinAgios.name
ltx/en_uk_lash/pe.d113:peMA.Ode3C13.mode	@ltx/en_uk_lash/miscellanea:misc.Mode6
ltx/en_uk_lash/pe.d113:peMA.Ode3C13.ode	@ltx/en_uk_lash/miscellanea:misc.Ode3
ltx/en_uk_lash/pe.d113:peMA.Ode3C13.text	Holily the first, applauded gathering of your Priests, O Saviour, proclaimed that you were begotten consubstantial with the Father who is without beginning and maker of all.
ltx/en_uk_lash/pe.d113:peMA.Ode3C1T.incipit	Equal no word, no tongue…
ltx/en_uk_lash/pe.d113:peMA.Ode3C1T.melody	@ltx/en_uk_lash/he.h.m6:heHE.OukEstinAgios.name
ltx/en_uk_lash/pe.d113:peMA.Ode3C1T.mode	@ltx/en_uk_lash/miscellanea:misc.Mode6
ltx/en_uk_lash/pe.d113:peMA.Ode3C1T.ode	@ltx/en_uk_lash/miscellanea:misc.Ode3
ltx/en_uk_lash/pe.d113:peMA.Ode3C1T.text	Equal no word, no tongue of mortals to praise you worthily, O Virgin; for from you, All-pure, Christ the giver of life was well pleased to become incarnate without seed.
ltx/en_uk_lash/pe.d113:peMA.Ode3Kathisma1.greekmelody	@ltx/en_uk_lash/he.a.m4:heAU.TachyProkatalave.greekname
ltx/en_uk_lash/pe.d113:peMA.Ode3Kathisma1.incipit	@ltx/en_uk_lash/me.m07.dHF:meMA.Ode3Kathisma1.incipit
ltx/en_uk_lash/pe.d113:peMA.Ode3Kathisma1.melody	@ltx/en_uk_lash/he.a.m4:heAU.TachyProkatalave.notmetered
ltx/en_uk_lash/pe.d113:peMA.Ode3Kathisma1.mode	@ltx/en_uk_lash/miscellanea:misc.Mode4
ltx/en_uk_lash/pe.d113:peMA.Ode3Kathisma1.text	@ltx/en_uk_lash/me.m07.dHF:meMA.Ode3Kathisma1.text
ltx/en_uk_lash/pe.d113:peMA.Ode3Kathisma2.greekmelody	@ltx/en_uk_lash/he.a.m4:heAU.OYpsotheisEnToStavro.greekname
ltx/en_uk_lash/pe.d113:peMA.Ode3Kathisma2.incipit	You were shown to the…
ltx/en_uk_lash/pe.d113:peMA.Ode3Kathisma2.melody	@ltx/en_uk_lash/he.a.m4:heAU.OYpsotheisEnToStavro.notmetered
ltx/en_uk_lash/pe.d113:peMA.Ode3Kathisma2.mode	@ltx/en_uk_lash/miscellanea:misc.Mode4
ltx/en_uk_lash/pe.d113:peMA.Ode3Kathisma2.text	You were shown to the world to be truly brightly shining beacons of Christ''s truth upon earth, blessed Fathers, melting the heresies of evil-speaking chatterers, quenching the burning confusions of blasphemers; therefore as Hierarchs of Christ intercede that we may be saved.
ltx/en_uk_lash/pe.d113:peMA.Ode3Kathisma3.greekmelody	@ltx/en_uk_lash/he.a.m4:heAU.OYpsotheisEnToStavro.greekname
ltx/en_uk_lash/pe.d113:peMA.Ode3Kathisma3.incipit	The shining city of the…
ltx/en_uk_lash/pe.d113:peMA.Ode3Kathisma3.melody	@ltx/en_uk_lash/he.a.m4:heAU.OYpsotheisEnToStavro.notmetered
ltx/en_uk_lash/pe.d113:peMA.Ode3Kathisma3.mode	@ltx/en_uk_lash/miscellanea:misc.Mode4
ltx/en_uk_lash/pe.d113:peMA.Ode3Kathisma3.text	The shining city of the Nicaeans today summoned to herself from all the earth three hundred and eighteen High Priests against Arius who spoke blasphemy and diminished one of the Trinity, who is Son and Word of God; by overthrowing him they strengthened the faith.
ltx/en_uk_lash/pe.d113:peMA.Ode4C11.greekmelody	@ltx/en_uk_lash/he.h.m6:heHE.ChristosMouDynamis.greekname
ltx/en_uk_lash/pe.d113:peMA.Ode4C11.incipit	From the Church the ill-famed…
ltx/en_uk_lash/pe.d113:peMA.Ode4C11.melody	@ltx/en_uk_lash/he.h.m6:heHE.ChristosMouDynamis.name
ltx/en_uk_lash/pe.d113:peMA.Ode4C11.mode	@ltx/en_uk_lash/miscellanea:misc.Mode6
ltx/en_uk_lash/pe.d113:peMA.Ode4C11.ode	@ltx/en_uk_lash/miscellanea:misc.Ode4
ltx/en_uk_lash/pe.d113:peMA.Ode4C11.text	From the Church the ill-famed Arius, who corrupted the orthodox Faith with his senseless mind, has been exiled as a rotten limb by the votes of the Fathers.
ltx/en_uk_lash/pe.d113:peMA.Ode4C12.incipit	In your behalf, O Master…
ltx/en_uk_lash/pe.d113:peMA.Ode4C12.melody	@ltx/en_uk_lash/he.h.m6:heHE.ChristosMouDynamis.name
ltx/en_uk_lash/pe.d113:peMA.Ode4C12.mode	@ltx/en_uk_lash/miscellanea:misc.Mode6
ltx/en_uk_lash/pe.d113:peMA.Ode4C12.ode	@ltx/en_uk_lash/miscellanea:misc.Ode4
ltx/en_uk_lash/pe.d113:peMA.Ode4C12.text	In your behalf, O Master, the choir of Fathers struggled and grievously wounded your enemies; and they glorified you as sharing the same nature as the Father and the Spirit.
ltx/en_uk_lash/pe.d113:peMA.Ode4C13.incipit	Really God and man, you…
ltx/en_uk_lash/pe.d113:peMA.Ode4C13.melody	@ltx/en_uk_lash/he.h.m6:heHE.ChristosMouDynamis.name
ltx/en_uk_lash/pe.d113:peMA.Ode4C13.mode	@ltx/en_uk_lash/miscellanea:misc.Mode6
ltx/en_uk_lash/pe.d113:peMA.Ode4C13.ode	@ltx/en_uk_lash/miscellanea:misc.Ode4
ltx/en_uk_lash/pe.d113:peMA.Ode4C13.text	Really God and man, you have become the Mediator between God and men; therefore, O Christ, the Inspired Fathers, acknowledging you the Son to be one, proclaimed you to exist in two natures.
ltx/en_uk_lash/pe.d113:peMA.Ode4C1T.incipit	Sampling a plant showed me…
ltx/en_uk_lash/pe.d113:peMA.Ode4C1T.melody	@ltx/en_uk_lash/he.h.m6:heHE.ChristosMouDynamis.name
ltx/en_uk_lash/pe.d113:peMA.Ode4C1T.mode	@ltx/en_uk_lash/miscellanea:misc.Mode6
ltx/en_uk_lash/pe.d113:peMA.Ode4C1T.ode	@ltx/en_uk_lash/miscellanea:misc.Ode4
ltx/en_uk_lash/pe.d113:peMA.Ode4C1T.text	Sampling a plant showed me to be a corpse; for the tree of life which appeared from you, All-pure one, raised me and established me as heir to the delight of Paradise.
ltx/en_uk_lash/pe.d113:peMA.Ode5C11.greekmelody	@ltx/en_uk_lash/he.h.m6:heHE.ToTheioFengeiSou.greekname
ltx/en_uk_lash/pe.d113:peMA.Ode5C11.incipit	Truly beautiful are the feet…
ltx/en_uk_lash/pe.d113:peMA.Ode5C11.melody	@ltx/en_uk_lash/he.h.m6:heHE.ToTheioFengeiSou.name
ltx/en_uk_lash/pe.d113:peMA.Ode5C11.mode	@ltx/en_uk_lash/miscellanea:misc.Mode6
ltx/en_uk_lash/pe.d113:peMA.Ode5C11.ode	@ltx/en_uk_lash/miscellanea:misc.Ode5
ltx/en_uk_lash/pe.d113:peMA.Ode5C11.text	Truly beautiful are the feet of those who preach you the peace which surpasses every mind, of all Angels and of mortals, O Christ, and by abundance of peace unites the world.
ltx/en_uk_lash/pe.d113:peMA.Ode5C12.incipit	As Wisdom and power of…
ltx/en_uk_lash/pe.d113:peMA.Ode5C12.melody	@ltx/en_uk_lash/he.h.m6:heHE.ToTheioFengeiSou.name
ltx/en_uk_lash/pe.d113:peMA.Ode5C12.mode	@ltx/en_uk_lash/miscellanea:misc.Mode6
ltx/en_uk_lash/pe.d113:peMA.Ode5C12.ode	@ltx/en_uk_lash/miscellanea:misc.Ode5
ltx/en_uk_lash/pe.d113:peMA.Ode5C12.text	As Wisdom and power of the Father, as hypostatic Word, they proclaimed you, O Christ, the godlike Teachers who had come together, sealed with the law of the all-holy priesthood.
ltx/en_uk_lash/pe.d113:peMA.Ode5C13.incipit	Streams of pure waters of…
ltx/en_uk_lash/pe.d113:peMA.Ode5C13.melody	@ltx/en_uk_lash/he.h.m6:heHE.ToTheioFengeiSou.name
ltx/en_uk_lash/pe.d113:peMA.Ode5C13.mode	@ltx/en_uk_lash/miscellanea:misc.Mode6
ltx/en_uk_lash/pe.d113:peMA.Ode5C13.ode	@ltx/en_uk_lash/miscellanea:misc.Ode5
ltx/en_uk_lash/pe.d113:peMA.Ode5C13.text	Streams of pure waters of Christ''s teaching you gave the Church to drink, and now you take delight by the waters of rest, rejoicing eternally.
ltx/en_uk_lash/pe.d113:peMA.Ode5C1T.incipit	Since we know you, O…
ltx/en_uk_lash/pe.d113:peMA.Ode5C1T.melody	@ltx/en_uk_lash/he.h.m6:heHE.ToTheioFengeiSou.name
ltx/en_uk_lash/pe.d113:peMA.Ode5C1T.mode	@ltx/en_uk_lash/miscellanea:misc.Mode6
ltx/en_uk_lash/pe.d113:peMA.Ode5C1T.ode	@ltx/en_uk_lash/miscellanea:misc.Ode5
ltx/en_uk_lash/pe.d113:peMA.Ode5C1T.text	Since we know you, O all pure, to be the shining lamp which has shed on all Christ the Sun of righteousness, we call upon your ever-present protection, only pure Mother of God.
ltx/en_uk_lash/pe.d113:peMA.Ode6C11.greekmelody	@ltx/en_uk_lash/he.h.m6:heHE.TouViouTinThalassan.greekname
ltx/en_uk_lash/pe.d113:peMA.Ode6C11.incipit	Escape the mystery of providence…
ltx/en_uk_lash/pe.d113:peMA.Ode6C11.melody	@ltx/en_uk_lash/he.h.m6:heHE.TouViouTinThalassan.name
ltx/en_uk_lash/pe.d113:peMA.Ode6C11.mode	@ltx/en_uk_lash/miscellanea:misc.Mode6
ltx/en_uk_lash/pe.d113:peMA.Ode6C11.ode	@ltx/en_uk_lash/miscellanea:misc.Ode6
ltx/en_uk_lash/pe.d113:peMA.Ode6C11.text	Escape the mystery of providence he could not, the sower of tares, who was called by the surname Lunacy; for having rivalled Judas, like him the wholly evil one was split asunder.
ltx/en_uk_lash/pe.d113:peMA.Ode6C12.incipit	Master, the revered, godly assembly…
ltx/en_uk_lash/pe.d113:peMA.Ode6C12.melody	@ltx/en_uk_lash/he.h.m6:heHE.TouViouTinThalassan.name
ltx/en_uk_lash/pe.d113:peMA.Ode6C12.mode	@ltx/en_uk_lash/miscellanea:misc.Mode6
ltx/en_uk_lash/pe.d113:peMA.Ode6C12.ode	@ltx/en_uk_lash/miscellanea:misc.Ode6
ltx/en_uk_lash/pe.d113:peMA.Ode6C12.text	Master, the revered, godly assembly of the Fathers proclaimed you as the only-begotten brightness shining from the Father''s essence, and as the Son begotten before all things.
ltx/en_uk_lash/pe.d113:peMA.Ode6C13.incipit	Burst open was the belly…
ltx/en_uk_lash/pe.d113:peMA.Ode6C13.melody	@ltx/en_uk_lash/he.h.m6:heHE.TouViouTinThalassan.name
ltx/en_uk_lash/pe.d113:peMA.Ode6C13.mode	@ltx/en_uk_lash/miscellanea:misc.Mode6
ltx/en_uk_lash/pe.d113:peMA.Ode6C13.ode	@ltx/en_uk_lash/miscellanea:misc.Ode6
ltx/en_uk_lash/pe.d113:peMA.Ode6C13.text	Burst open was the belly, the source which poured out the foul and undrinkable water of impious heresies, by the ploughshare of the intercession of the inspired Priests.
ltx/en_uk_lash/pe.d113:peMA.Ode6C1T.incipit	Lampstand, ark, table and jar…
ltx/en_uk_lash/pe.d113:peMA.Ode6C1T.melody	@ltx/en_uk_lash/he.h.m6:heHE.TouViouTinThalassan.name
ltx/en_uk_lash/pe.d113:peMA.Ode6C1T.mode	@ltx/en_uk_lash/miscellanea:misc.Mode6
ltx/en_uk_lash/pe.d113:peMA.Ode6C1T.ode	@ltx/en_uk_lash/miscellanea:misc.Ode6
ltx/en_uk_lash/pe.d113:peMA.Ode6C1T.text	Lampstand, ark, table and jar, so Moses, greatest of the prophets, wrote of you of old, in symbols signifying the incarnation from you of the Most High, O Virgin Mother.
ltx/en_uk_lash/pe.d113:peMA.Ode7C11.greekmelody	@ltx/en_uk_lash/he.h.m6:heHE.DrosovolonMenTinKaminon.greekname
ltx/en_uk_lash/pe.d113:peMA.Ode7C11.incipit	You defeated Arius, whose surname…
ltx/en_uk_lash/pe.d113:peMA.Ode7C11.melody	@ltx/en_uk_lash/he.h.m6:heHE.DrosovolonMenTinKaminon.name
ltx/en_uk_lash/pe.d113:peMA.Ode7C11.mode	@ltx/en_uk_lash/miscellanea:misc.Mode6
ltx/en_uk_lash/pe.d113:peMA.Ode7C11.ode	@ltx/en_uk_lash/miscellanea:misc.Ode7
ltx/en_uk_lash/pe.d113:peMA.Ode7C11.text	You defeated Arius, whose surname is Frenzy, who raved and spoke the grossest impieties of God; for he refused to cry out to the Son: Blessed are you, the God of our fathers.
ltx/en_uk_lash/pe.d113:peMA.Ode7C12.incipit	O inspired ones, imitating the…
ltx/en_uk_lash/pe.d113:peMA.Ode7C12.melody	@ltx/en_uk_lash/he.h.m6:heHE.DrosovolonMenTinKaminon.name
ltx/en_uk_lash/pe.d113:peMA.Ode7C12.mode	@ltx/en_uk_lash/miscellanea:misc.Mode6
ltx/en_uk_lash/pe.d113:peMA.Ode7C12.ode	@ltx/en_uk_lash/miscellanea:misc.Ode7
ltx/en_uk_lash/pe.d113:peMA.Ode7C12.text	O inspired ones, imitating the son of thunder, with your fiery mouths you teach all to cry to the Word without beginning like the Father and equal in majesty: Blessed are you, the God of our fathers.
ltx/en_uk_lash/pe.d113:peMA.Ode7C13.incipit	Flying as though on wings…
ltx/en_uk_lash/pe.d113:peMA.Ode7C13.melody	@ltx/en_uk_lash/he.h.m6:heHE.DrosovolonMenTinKaminon.name
ltx/en_uk_lash/pe.d113:peMA.Ode7C13.mode	@ltx/en_uk_lash/miscellanea:misc.Mode6
ltx/en_uk_lash/pe.d113:peMA.Ode7C13.ode	@ltx/en_uk_lash/miscellanea:misc.Ode7
ltx/en_uk_lash/pe.d113:peMA.Ode7C13.text	Flying as though on wings you came, blessed of God, to help the Word; for the Holy Spirit gathered you from the ends of the world to cry out: Blessed are you, the God of our fathers.
ltx/en_uk_lash/pe.d113:peMA.Ode7C1T.incipit	Prefiguring your giving birth, the…
ltx/en_uk_lash/pe.d113:peMA.Ode7C1T.melody	@ltx/en_uk_lash/he.h.m6:heHE.DrosovolonMenTinKaminon.name
ltx/en_uk_lash/pe.d113:peMA.Ode7C1T.mode	@ltx/en_uk_lash/miscellanea:misc.Mode6
ltx/en_uk_lash/pe.d113:peMA.Ode7C1T.ode	@ltx/en_uk_lash/miscellanea:misc.Ode7
ltx/en_uk_lash/pe.d113:peMA.Ode7C1T.text	Prefiguring your giving birth, the furnace did not burn the three youths; for the divine fire without burning you dwelt in you, and enlightened all to cry: Blessed are you who bore God in the flesh.
ltx/en_uk_lash/pe.d113:peMA.Ode8C11.greekmelody	@ltx/en_uk_lash/he.h.m6:heHE.EkFlogosToisOsiois.greekname
ltx/en_uk_lash/pe.d113:peMA.Ode8C11.incipit	Aflame with the rays of…
ltx/en_uk_lash/pe.d113:peMA.Ode8C11.melody	@ltx/en_uk_lash/he.h.m6:heHE.EkFlogosToisOsiois.name
ltx/en_uk_lash/pe.d113:peMA.Ode8C11.mode	@ltx/en_uk_lash/miscellanea:misc.Mode6
ltx/en_uk_lash/pe.d113:peMA.Ode8C11.ode	@ltx/en_uk_lash/miscellanea:misc.Ode8
ltx/en_uk_lash/pe.d113:peMA.Ode8C11.text	Aflame with the rays of your Godhead your goodly Shepherds confessed you to be creator of all things and Lord, whom we highly exalt to all the ages.
ltx/en_uk_lash/pe.d113:peMA.Ode8C12.incipit	Assembled with godly mind, the…
ltx/en_uk_lash/pe.d113:peMA.Ode8C12.melody	@ltx/en_uk_lash/he.h.m6:heHE.EkFlogosToisOsiois.name
ltx/en_uk_lash/pe.d113:peMA.Ode8C12.mode	@ltx/en_uk_lash/miscellanea:misc.Mode6
ltx/en_uk_lash/pe.d113:peMA.Ode8C12.ode	@ltx/en_uk_lash/miscellanea:misc.Ode8
ltx/en_uk_lash/pe.d113:peMA.Ode8C12.text	Assembled with godly mind, the all-honoured choir of Shepherds now acknowledging the uncreated Trinity as God, teaches all to cry out: We highly exalt you to all the ages.
ltx/en_uk_lash/pe.d113:peMA.Ode8C13.incipit	Shepherds most admirable, the Hierarchs…
ltx/en_uk_lash/pe.d113:peMA.Ode8C13.melody	@ltx/en_uk_lash/he.h.m6:heHE.EkFlogosToisOsiois.name
ltx/en_uk_lash/pe.d113:peMA.Ode8C13.mode	@ltx/en_uk_lash/miscellanea:misc.Mode6
ltx/en_uk_lash/pe.d113:peMA.Ode8C13.ode	@ltx/en_uk_lash/miscellanea:misc.Ode8
ltx/en_uk_lash/pe.d113:peMA.Ode8C13.text	Shepherds most admirable, the Hierarchs enlighten Christ''s Church, each in his different place making her shine and highly exalting her to all the ages.
ltx/en_uk_lash/pe.d113:peMA.Ode8C1T.incipit	The Prophets in images all…
ltx/en_uk_lash/pe.d113:peMA.Ode8C1T.melody	@ltx/en_uk_lash/he.h.m6:heHE.EkFlogosToisOsiois.name
ltx/en_uk_lash/pe.d113:peMA.Ode8C1T.mode	@ltx/en_uk_lash/miscellanea:misc.Mode6
ltx/en_uk_lash/pe.d113:peMA.Ode8C1T.ode	@ltx/en_uk_lash/miscellanea:misc.Ode8
ltx/en_uk_lash/pe.d113:peMA.Ode8C1T.text	The Prophets in images all mystically foresaw you bearing the Word; for having taken flesh from you, he came forth dual in natures, whom we highly exalt to all the ages.
ltx/en_uk_lash/pe.d113:peMA.Ode9C11.greekmelody	@ltx/en_uk_lash/he.h.m6:heHE.TheonAnthropois.greekname
ltx/en_uk_lash/pe.d113:peMA.Ode9C11.incipit	The Word before the ages…
ltx/en_uk_lash/pe.d113:peMA.Ode9C11.melody	@ltx/en_uk_lash/he.h.m6:heHE.TheonAnthropois.name
ltx/en_uk_lash/pe.d113:peMA.Ode9C11.mode	@ltx/en_uk_lash/miscellanea:misc.Mode6
ltx/en_uk_lash/pe.d113:peMA.Ode9C11.ode	@ltx/en_uk_lash/miscellanea:misc.Ode9
ltx/en_uk_lash/pe.d113:peMA.Ode9C11.text	The Word before the ages, like the Father without beginning and equal in majesty, having found you to be allies, assembled you, arming you with the mighty power of the Spirit; whom now, All-hallowed ones, with the heavenly hosts you ever glorify.
ltx/en_uk_lash/pe.d113:peMA.Ode9C12.incipit	O sacred ministers, as physicians…
ltx/en_uk_lash/pe.d113:peMA.Ode9C12.melody	@ltx/en_uk_lash/he.h.m6:heHE.TheonAnthropois.name
ltx/en_uk_lash/pe.d113:peMA.Ode9C12.mode	@ltx/en_uk_lash/miscellanea:misc.Mode6
ltx/en_uk_lash/pe.d113:peMA.Ode9C12.ode	@ltx/en_uk_lash/miscellanea:misc.Ode9
ltx/en_uk_lash/pe.d113:peMA.Ode9C12.text	O sacred ministers, as physicians of souls and bodies you halted the spread of the foul heresy of Arius, sacredly promulgating for all the Symbol of the faith; as we now hold fast to it we ever glorify your memory.
ltx/en_uk_lash/pe.d113:peMA.Ode9C13.incipit	Rescue my soul, O Christ…
ltx/en_uk_lash/pe.d113:peMA.Ode9C13.melody	@ltx/en_uk_lash/he.h.m6:heHE.TheonAnthropois.name
ltx/en_uk_lash/pe.d113:peMA.Ode9C13.mode	@ltx/en_uk_lash/miscellanea:misc.Mode6
ltx/en_uk_lash/pe.d113:peMA.Ode9C13.ode	@ltx/en_uk_lash/miscellanea:misc.Ode9
ltx/en_uk_lash/pe.d113:peMA.Ode9C13.text	Rescue my soul, O Christ, as you are light immaculate, from the mist of the passions, at the prayers of your Ministers, O Master, who have now proclaimed you to be without beginning, uncreated, creator of all things and God without beginning together with the Father.
ltx/en_uk_lash/pe.d113:peMA.Ode9C1T.incipit	Since life, clad in flesh…
ltx/en_uk_lash/pe.d113:peMA.Ode9C1T.melody	@ltx/en_uk_lash/he.h.m6:heHE.TheonAnthropois.name
ltx/en_uk_lash/pe.d113:peMA.Ode9C1T.mode	@ltx/en_uk_lash/miscellanea:misc.Mode6
ltx/en_uk_lash/pe.d113:peMA.Ode9C1T.ode	@ltx/en_uk_lash/miscellanea:misc.Ode9
ltx/en_uk_lash/pe.d113:peMA.Ode9C1T.text	Since life, clad in flesh, has shone forth for all from you, O Sovereign Lady, Mother of God, and clearly abolished the gloom of death, resurrection has been granted to the dead through your ineffable and inexpressible child-bearing.
ltx/en_uk_lash/pe.d113:peMA.Oikos1.text	@ltx/en_uk_lash/me.m07.dHF:meMA.Oikos1.text
ltx/en_uk_lash/pe.d113:peSY.commemoration.couplet1.title	@ltx/en_uk_lash/titles:ti.Verses
ltx/en_uk_lash/pe.d113:peSY.commemoration.couplet1.verse1	
ltx/en_uk_lash/pe.d113:peSY.commemoration.couplet1.verse2	
ltx/en_uk_lash/pe.d113:peSY.commemoration.couplet2.title	
ltx/en_uk_lash/pe.d113:peSY.commemoration.couplet2.verse1	
ltx/en_uk_lash/pe.d113:peSY.commemoration.couplet2.verse2	
ltx/en_uk_lash/pe.d113:peSY.commemoration.narration.p01	[paragraph 01]
ltx/en_uk_lash/pe.d113:peSY.commemoration.narration.p02	[paragraph 02]
ltx/en_uk_lash/pe.d113:peSY.commemoration.narration.p03	[paragraph 03]
ltx/en_uk_lash/pe.d113:peSY.commemoration.narration.p04	[paragraph 04]
ltx/en_uk_lash/pe.d113:peSY.commemoration.narration.p05	[paragraph 05]
ltx/en_uk_lash/pe.d113:peSY.commemoration.narration.p06	[paragraph 06]
ltx/en_uk_lash/pe.d113:peSY.commemoration.narration.p07	[paragraph 07]
ltx/en_uk_lash/pe.d113:peSY.commemoration.text	
ltx/en_uk_lash/pe.d113:peSY.lastline	
ltx/en_uk_lash/pe.d113:peVE.Apolytikion1.incipit	@ltx/en_uk_lash/oc.m6.d1:ocVE.Apolytikion.incipit
ltx/en_uk_lash/pe.d113:peVE.Apolytikion1.melody	
ltx/en_uk_lash/pe.d113:peVE.Apolytikion1.mode	@ltx/en_uk_lash/miscellanea:misc.Mode6
ltx/en_uk_lash/pe.d113:peVE.Apolytikion1.text	@ltx/en_uk_lash/oc.m6.d1:ocVE.Apolytikion.text
ltx/en_uk_lash/pe.d113:peVE.Apolytikion2.incipit	@ltx/en_uk_lash/me.m07.dHF:meVE.Apolytikion1.incipit
ltx/en_uk_lash/pe.d113:peVE.Apolytikion2.melody	
ltx/en_uk_lash/pe.d113:peVE.Apolytikion2.mode	@ltx/en_uk_lash/miscellanea:misc.Mode8
ltx/en_uk_lash/pe.d113:peVE.Apolytikion2.text	@ltx/en_uk_lash/me.m07.dHF:meVE.Apolytikion1.text
ltx/en_uk_lash/pe.d113:peVE.Apolytikion3.incipit	@ltx/en_uk_lash/pe.d110:peVE.Apolytikion1.incipit
ltx/en_uk_lash/pe.d113:peVE.Apolytikion3.melody	
ltx/en_uk_lash/pe.d113:peVE.Apolytikion3.mode	@ltx/en_uk_lash/miscellanea:misc.Mode4
ltx/en_uk_lash/pe.d113:peVE.Apolytikion3.text	@ltx/en_uk_lash/pe.d110:peVE.Apolytikion1.text
ltx/en_uk_lash/pe.d113:peVE.AposBoth.incipit	@ltx/en_uk_lash/pe.d110:peVE.LityGlory.incipit
ltx/en_uk_lash/pe.d113:peVE.AposBoth.melody	@ltx/en_uk_lash/miscellanea:misc.Idiomelon
ltx/en_uk_lash/pe.d113:peVE.AposBoth.mode	@ltx/en_uk_lash/miscellanea:misc.Mode4
ltx/en_uk_lash/pe.d113:peVE.AposBoth.text	@ltx/en_uk_lash/pe.d110:peVE.LityGlory.text
ltx/en_uk_lash/pe.d113:peVE.AposGlory.incipit	@ltx/en_uk_lash/me.m10.dHF:meVE.AposGlory.incipit
ltx/en_uk_lash/pe.d113:peVE.AposGlory.melody	@ltx/en_uk_lash/miscellanea:misc.Idiomelon
ltx/en_uk_lash/pe.d113:peVE.AposGlory.mode	@ltx/en_uk_lash/miscellanea:misc.Mode4
ltx/en_uk_lash/pe.d113:peVE.AposGlory.text	@ltx/en_uk_lash/me.m10.dHF:meVE.AposGlory.text
ltx/en_uk_lash/pe.d113:peVE.LityBoth.incipit	@ltx/en_uk_lash/pe.d110:peVE.Stichera05.incipit
ltx/en_uk_lash/pe.d113:peVE.LityBoth.melody	@ltx/en_uk_lash/miscellanea:misc.Idiomelon
ltx/en_uk_lash/pe.d113:peVE.LityBoth.mode	@ltx/en_uk_lash/miscellanea:misc.Mode6
ltx/en_uk_lash/pe.d113:peVE.LityBoth.text	@ltx/en_uk_lash/pe.d110:peVE.Stichera05.text
ltx/en_uk_lash/pe.d113:peVE.LityGlory.incipit	@ltx/en_uk_lash/me.m07.dHF:meVE.AposGlory.incipit
ltx/en_uk_lash/pe.d113:peVE.LityGlory.melody	@ltx/en_uk_lash/miscellanea:misc.Idiomelon
ltx/en_uk_lash/pe.d113:peVE.LityGlory.mode	@ltx/en_uk_lash/miscellanea:misc.Mode3
ltx/en_uk_lash/pe.d113:peVE.LityGlory.text	@ltx/en_uk_lash/me.m07.dHF:meVE.AposGlory.text
ltx/en_uk_lash/pe.d113:peVE.MM.Stichera789as567.text	
ltx/en_uk_lash/pe.d113:peVE.SticGlory.incipit	@ltx/en_uk_lash/me.m10.dHF:meVE.SticGlory.incipit
ltx/en_uk_lash/pe.d113:peVE.SticGlory.melody	@ltx/en_uk_lash/miscellanea:misc.Idiomelon
ltx/en_uk_lash/pe.d113:peVE.SticGlory.mode	@ltx/en_uk_lash/miscellanea:misc.Mode6
ltx/en_uk_lash/pe.d113:peVE.SticGlory.text	@ltx/en_uk_lash/me.m10.dHF:meVE.SticGlory.text
ltx/en_uk_lash/pe.d113:peVE.Stichera04.incipit	@ltx/en_uk_lash/pe.d110:peVE.Stichera01.incipit
ltx/en_uk_lash/pe.d113:peVE.Stichera04.melody	@ltx/en_uk_lash/miscellanea:misc.Idiomelon
ltx/en_uk_lash/pe.d113:peVE.Stichera04.mode	@ltx/en_uk_lash/miscellanea:misc.Mode6
ltx/en_uk_lash/pe.d113:peVE.Stichera04.text	@ltx/en_uk_lash/pe.d110:peVE.Stichera01.text
ltx/en_uk_lash/pe.d113:peVE.Stichera05.incipit	@ltx/en_uk_lash/pe.d110:peVE.Stichera02.incipit
ltx/en_uk_lash/pe.d113:peVE.Stichera05.melody	@ltx/en_uk_lash/miscellanea:misc.Idiomelon
ltx/en_uk_lash/pe.d113:peVE.Stichera05.mode	@ltx/en_uk_lash/miscellanea:misc.Mode6
ltx/en_uk_lash/pe.d113:peVE.Stichera05.text	@ltx/en_uk_lash/pe.d110:peVE.Stichera02.text
ltx/en_uk_lash/pe.d113:peVE.Stichera06.incipit	@ltx/en_uk_lash/pe.d110:peVE.Stichera03.incipit
ltx/en_uk_lash/pe.d113:peVE.Stichera06.melody	@ltx/en_uk_lash/miscellanea:misc.Idiomelon
ltx/en_uk_lash/pe.d113:peVE.Stichera06.mode	@ltx/en_uk_lash/miscellanea:misc.Mode6
ltx/en_uk_lash/pe.d113:peVE.Stichera06.text	@ltx/en_uk_lash/pe.d110:peVE.Stichera03.text
ltx/en_uk_lash/pe.d113:peVE.Stichera07.greekmelody	@ltx/en_uk_lash/he.a.m6:heAU.IApegnosmeni.greekname
ltx/en_uk_lash/pe.d113:peVE.Stichera07.incipit	You were born from the…
ltx/en_uk_lash/pe.d113:peVE.Stichera07.melody	@ltx/en_uk_lash/he.a.m6:heAU.IApegnosmeni.notmetered
ltx/en_uk_lash/pe.d113:peVE.Stichera07.mode	@ltx/en_uk_lash/miscellanea:misc.Mode6
ltx/en_uk_lash/pe.d113:peVE.Stichera07.text	You were born from the womb before the morning star, without a mother from the Father before the ages, though Arius dares to call you a creature, and does not glorify you as God, insanely joining you, the Creator, with the creatures, and laying up for himself as treasure the fuel of the eternal fire. But the Council in Nicea loudly proclaimed you, Lord, to be Son of God, equal in rank with the Father and the Spirit.
ltx/en_uk_lash/pe.d113:peVE.Stichera08.incipit	Who divided your garment, O…
ltx/en_uk_lash/pe.d113:peVE.Stichera08.melody	@ltx/en_uk_lash/he.a.m6:heAU.IApegnosmeni.notmetered
ltx/en_uk_lash/pe.d113:peVE.Stichera08.mode	@ltx/en_uk_lash/miscellanea:misc.Mode6
ltx/en_uk_lash/pe.d113:peVE.Stichera08.text	Who divided your garment, O Saviour? ''Arius,'' you said, who cuts into divisions the Authority equal in honour of the Trinity. He it was who denied that you were one of the Trinity. He it was who taught Nestorios not to say ''Mother of God''. But the Council in Nicea loudly proclaimed you, Lord, to be Son of God, equal in rank with the Father and the Spirit.
ltx/en_uk_lash/pe.d113:peVE.Stichera09.incipit	Arius fell into the precipice…
ltx/en_uk_lash/pe.d113:peVE.Stichera09.melody	@ltx/en_uk_lash/he.a.m6:heAU.IApegnosmeni.notmetered
ltx/en_uk_lash/pe.d113:peVE.Stichera09.mode	@ltx/en_uk_lash/miscellanea:misc.Mode6
ltx/en_uk_lash/pe.d113:peVE.Stichera09.text	Arius fell into the precipice of sin, having shut his eyes so as not to see the light, and he was ripped asunder by a divine hook so that with his entrails he forcibly emptied out all his essence and his soul, and was named another Judas, both for his ideas and the manner of his death. But the Council in Nicea loudly proclaimed you, Lord, to be Son of God, equal in rank with the Father and the Spirit.
ltx/en_uk_lash/pe.d113:peVE.Stichera10.incipit	Arius the insane cut the…
ltx/en_uk_lash/pe.d113:peVE.Stichera10.melody	@ltx/en_uk_lash/he.a.m6:heAU.IApegnosmeni.notmetered
ltx/en_uk_lash/pe.d113:peVE.Stichera10.mode	@ltx/en_uk_lash/miscellanea:misc.Mode6
ltx/en_uk_lash/pe.d113:peVE.Stichera10.text	Arius the insane cut the Monarchy of the All-holy Trinity into three dissimilar and unrelated Essences; therefore the Godbearing Fathers eagerly came together, burning with zeal, like Elias the Thesbite, and cut off with the sword of the Spirit the blasphemer with his teachings of shame, as the Spirit decreed.
