ltx/en_uk_lash/me.m01.d17:meDA.commemoration.first	
ltx/en_uk_lash/me.m01.d17:meDA.commemoration.first_name	
ltx/en_uk_lash/me.m01.d17:meDA.commemoration.first_short	
ltx/en_uk_lash/me.m01.d17:meDA.commemoration.first_title	
ltx/en_uk_lash/me.m01.d17:meDA.commemoration.full	
ltx/en_uk_lash/me.m01.d17:meDA.commemoration.second_name	
ltx/en_uk_lash/me.m01.d17:meDA.commemoration.second_title	
ltx/en_uk_lash/me.m01.d17:meDA.date	
ltx/en_uk_lash/me.m01.d17:meDA.insert1	
ltx/en_uk_lash/me.m01.d17:meDA.insert2	
ltx/en_uk_lash/me.m01.d17:meDA.note	
ltx/en_uk_lash/me.m01.d17:meHO.commemorations	
ltx/en_uk_lash/me.m01.d17:meHO.note1	@ltx/en_uk_lash/rubrical:ru.HolidayWineOil
ltx/en_uk_lash/me.m01.d17:meHO.note2	
ltx/en_uk_lash/me.m01.d17:meHO.number	
ltx/en_uk_lash/me.m01.d17:meHO.rank	
ltx/en_uk_lash/me.m01.d17:meLE.commemoration1	
ltx/en_uk_lash/me.m01.d17:meLE.commemoration2	
ltx/en_uk_lash/me.m01.d17:meLI.Kontakion1.greekmelody	@ltx/en_uk_lash/me.m01.d17:meMA.Kontakion1.greekmelody
ltx/en_uk_lash/me.m01.d17:meLI.Kontakion1.incipit	@ltx/en_uk_lash/me.m01.d17:meMA.Kontakion1.incipit
ltx/en_uk_lash/me.m01.d17:meLI.Kontakion1.melody	@ltx/en_uk_lash/me.m01.d17:meMA.Kontakion1.melody
ltx/en_uk_lash/me.m01.d17:meLI.Kontakion1.mode	@ltx/en_uk_lash/me.m01.d17:meMA.Kontakion1.mode
ltx/en_uk_lash/me.m01.d17:meLI.Kontakion1.text	@ltx/en_uk_lash/me.m01.d17:meMA.Kontakion1.text
ltx/en_uk_lash/me.m01.d17:meLI.MM.CommunionHymn.text	
ltx/en_uk_lash/me.m01.d17:meLI.Megalynarion.text	
ltx/en_uk_lash/me.m01.d17:meMA.C1.acrostic.notice1	
ltx/en_uk_lash/me.m01.d17:meMA.C1.acrostic.text	
ltx/en_uk_lash/me.m01.d17:meMA.C1.acrostic.title	
ltx/en_uk_lash/me.m01.d17:meMA.C1.title	@ltx/en_uk_lash/titles:ti.CanonDevoutM
ltx/en_uk_lash/me.m01.d17:meMA.C1.verse	@ltx/en_uk_lash/prayers:pr.verse_DevoutMan.text
ltx/en_uk_lash/me.m01.d17:meMA.ExapTheotokion.incipit	…
ltx/en_uk_lash/me.m01.d17:meMA.ExapTheotokion.melody	@ltx/en_uk_lash/he.a.m3:heAU.EnPnevmatiToIero.notmetered
ltx/en_uk_lash/me.m01.d17:meMA.ExapTheotokion.mode	@ltx/en_uk_lash/miscellanea:misc.Mode3
ltx/en_uk_lash/me.m01.d17:meMA.ExapTheotokion.text	
ltx/en_uk_lash/me.m01.d17:meMA.Exaposteilarion1.greekmelody	@ltx/en_uk_lash/he.a.m2:heAU.GynaikesAkoutisthite.greekname
ltx/en_uk_lash/me.m01.d17:meMA.Exaposteilarion1.incipit	…
ltx/en_uk_lash/me.m01.d17:meMA.Exaposteilarion1.melody	@ltx/en_uk_lash/he.a.m2:heAU.GynaikesAkoutisthite.notmetered
ltx/en_uk_lash/me.m01.d17:meMA.Exaposteilarion1.mode	@ltx/en_uk_lash/miscellanea:misc.Mode2
ltx/en_uk_lash/me.m01.d17:meMA.Exaposteilarion1.text	
ltx/en_uk_lash/me.m01.d17:meMA.Exaposteilarion2.greekmelody	@ltx/en_uk_lash/he.a.m3:heAU.EnPnevmatiToIero.greekname
ltx/en_uk_lash/me.m01.d17:meMA.Exaposteilarion2.incipit	…
ltx/en_uk_lash/me.m01.d17:meMA.Exaposteilarion2.melody	@ltx/en_uk_lash/he.a.m3:heAU.EnPnevmatiToIero.notmetered
ltx/en_uk_lash/me.m01.d17:meMA.Exaposteilarion2.mode	@ltx/en_uk_lash/miscellanea:misc.Mode3
ltx/en_uk_lash/me.m01.d17:meMA.Exaposteilarion2.text	
ltx/en_uk_lash/me.m01.d17:meMA.Exaposteilarion3.greekmelody	@ltx/en_uk_lash/he.a.m3:heAU.EnPnevmatiToIero.greekname
ltx/en_uk_lash/me.m01.d17:meMA.Exaposteilarion3.incipit	…
ltx/en_uk_lash/me.m01.d17:meMA.Exaposteilarion3.melody	@ltx/en_uk_lash/he.a.m3:heAU.EnPnevmatiToIero.notmetered
ltx/en_uk_lash/me.m01.d17:meMA.Exaposteilarion3.mode	@ltx/en_uk_lash/miscellanea:misc.Mode3
ltx/en_uk_lash/me.m01.d17:meMA.Exaposteilarion3.text	
ltx/en_uk_lash/me.m01.d17:meMA.Kathisma11.greekmelody	@ltx/en_uk_lash/he.a.m8:heAU.TinSofianKaiLogon.greekname
ltx/en_uk_lash/me.m01.d17:meMA.Kathisma11.incipit	…
ltx/en_uk_lash/me.m01.d17:meMA.Kathisma11.melody	@ltx/en_uk_lash/he.a.m8:heAU.TinSofianKaiLogon.notmetered
ltx/en_uk_lash/me.m01.d17:meMA.Kathisma11.mode	@ltx/en_uk_lash/miscellanea:misc.Mode8
ltx/en_uk_lash/me.m01.d17:meMA.Kathisma11.text	
ltx/en_uk_lash/me.m01.d17:meMA.Kathisma1T.incipit	@ltx/en_uk_lash/he.a.m8:heAU.TinSofianKaiLogon.incipit
ltx/en_uk_lash/me.m01.d17:meMA.Kathisma1T.melody	
ltx/en_uk_lash/me.m01.d17:meMA.Kathisma1T.mode	@ltx/en_uk_lash/miscellanea:misc.Mode8
ltx/en_uk_lash/me.m01.d17:meMA.Kathisma1T.text	@ltx/en_uk_lash/he.a.m8:heAU.TinSofianKaiLogon.text
ltx/en_uk_lash/me.m01.d17:meMA.Kathisma21.greekmelody	@ltx/en_uk_lash/he.a.m5:heAU.TonSynanarchonLogon.greekname
ltx/en_uk_lash/me.m01.d17:meMA.Kathisma21.incipit	…
ltx/en_uk_lash/me.m01.d17:meMA.Kathisma21.melody	@ltx/en_uk_lash/he.a.m5:heAU.TonSynanarchonLogon.notmetered
ltx/en_uk_lash/me.m01.d17:meMA.Kathisma21.mode	@ltx/en_uk_lash/miscellanea:misc.Mode5
ltx/en_uk_lash/me.m01.d17:meMA.Kathisma21.text	
ltx/en_uk_lash/me.m01.d17:meMA.Kathisma2T.incipit	…
ltx/en_uk_lash/me.m01.d17:meMA.Kathisma2T.melody	
ltx/en_uk_lash/me.m01.d17:meMA.Kathisma2T.mode	@ltx/en_uk_lash/miscellanea:misc.Mode5
ltx/en_uk_lash/me.m01.d17:meMA.Kathisma2T.text	
ltx/en_uk_lash/me.m01.d17:meMA.Kathisma31.greekmelody	@ltx/en_uk_lash/he.a.m8:heAU.TinSofianKaiLogon.greekname
ltx/en_uk_lash/me.m01.d17:meMA.Kathisma31.incipit	…
ltx/en_uk_lash/me.m01.d17:meMA.Kathisma31.melody	@ltx/en_uk_lash/he.a.m8:heAU.TinSofianKaiLogon.notmetered
ltx/en_uk_lash/me.m01.d17:meMA.Kathisma31.mode	@ltx/en_uk_lash/miscellanea:misc.Mode8
ltx/en_uk_lash/me.m01.d17:meMA.Kathisma31.text	
ltx/en_uk_lash/me.m01.d17:meMA.Kathisma32.greekmelody	@ltx/en_uk_lash/he.a.m4:heAU.EpefanisSimeron.greekname
ltx/en_uk_lash/me.m01.d17:meMA.Kathisma32.incipit	…
ltx/en_uk_lash/me.m01.d17:meMA.Kathisma32.melody	@ltx/en_uk_lash/he.a.m4:heAU.EpefanisSimeron.notmetered
ltx/en_uk_lash/me.m01.d17:meMA.Kathisma32.mode	@ltx/en_uk_lash/miscellanea:misc.Mode4
ltx/en_uk_lash/me.m01.d17:meMA.Kathisma32.text	
ltx/en_uk_lash/me.m01.d17:meMA.Kathisma3T.incipit	…
ltx/en_uk_lash/me.m01.d17:meMA.Kathisma3T.melody	@ltx/en_uk_lash/he.a.m4:heAU.EpefanisSimeron.notmetered
ltx/en_uk_lash/me.m01.d17:meMA.Kathisma3T.mode	@ltx/en_uk_lash/miscellanea:misc.Mode4
ltx/en_uk_lash/me.m01.d17:meMA.Kathisma3T.text	
ltx/en_uk_lash/me.m01.d17:meMA.Kontakion1.greekmelody	@ltx/en_uk_lash/he.a.m2:heAU.TaAnoZiton.greekname
ltx/en_uk_lash/me.m01.d17:meMA.Kontakion1.incipit	…
ltx/en_uk_lash/me.m01.d17:meMA.Kontakion1.melody	@ltx/en_uk_lash/he.a.m2:heAU.TaAnoZiton.notmetered
ltx/en_uk_lash/me.m01.d17:meMA.Kontakion1.mode	@ltx/en_uk_lash/miscellanea:misc.Mode2
ltx/en_uk_lash/me.m01.d17:meMA.Kontakion1.text	
ltx/en_uk_lash/me.m01.d17:meMA.Lauds1.greekmelody	@ltx/en_uk_lash/he.a.m8:heAU.OTouParadoxou.greekname
ltx/en_uk_lash/me.m01.d17:meMA.Lauds1.incipit	…
ltx/en_uk_lash/me.m01.d17:meMA.Lauds1.melody	@ltx/en_uk_lash/he.a.m8:heAU.OTouParadoxou.notmetered
ltx/en_uk_lash/me.m01.d17:meMA.Lauds1.mode	@ltx/en_uk_lash/miscellanea:misc.Mode8
ltx/en_uk_lash/me.m01.d17:meMA.Lauds1.text	
ltx/en_uk_lash/me.m01.d17:meMA.Lauds2.incipit	…
ltx/en_uk_lash/me.m01.d17:meMA.Lauds2.melody	@ltx/en_uk_lash/he.a.m8:heAU.OTouParadoxou.notmetered
ltx/en_uk_lash/me.m01.d17:meMA.Lauds2.mode	@ltx/en_uk_lash/miscellanea:misc.Mode8
ltx/en_uk_lash/me.m01.d17:meMA.Lauds2.text	
ltx/en_uk_lash/me.m01.d17:meMA.Lauds3.incipit	…
ltx/en_uk_lash/me.m01.d17:meMA.Lauds3.melody	@ltx/en_uk_lash/he.a.m8:heAU.OTouParadoxou.notmetered
ltx/en_uk_lash/me.m01.d17:meMA.Lauds3.mode	@ltx/en_uk_lash/miscellanea:misc.Mode8
ltx/en_uk_lash/me.m01.d17:meMA.Lauds3.text	
ltx/en_uk_lash/me.m01.d17:meMA.Lauds4.greekmelody	@ltx/en_uk_lash/he.a.m8:heAU.OTouParadoxou.greekname
ltx/en_uk_lash/me.m01.d17:meMA.Lauds4.incipit	…
ltx/en_uk_lash/me.m01.d17:meMA.Lauds4.melody	@ltx/en_uk_lash/he.a.m8:heAU.OTouParadoxou.notmetered
ltx/en_uk_lash/me.m01.d17:meMA.Lauds4.mode	@ltx/en_uk_lash/miscellanea:misc.Mode8
ltx/en_uk_lash/me.m01.d17:meMA.Lauds4.text	
ltx/en_uk_lash/me.m01.d17:meMA.LaudsGlory.incipit	…
ltx/en_uk_lash/me.m01.d17:meMA.LaudsGlory.melody	
ltx/en_uk_lash/me.m01.d17:meMA.LaudsGlory.mode	@ltx/en_uk_lash/miscellanea:misc.Mode8
ltx/en_uk_lash/me.m01.d17:meMA.LaudsGlory.poet	@ltx/en_uk_lash/poets:po.Anatoliou
ltx/en_uk_lash/me.m01.d17:meMA.LaudsGlory.text	
ltx/en_uk_lash/me.m01.d17:meMA.LaudsTheotokion.incipit	@ltx/en_uk_lash/oc.m8.d5:ocMA.AposTheotokion.incipit
ltx/en_uk_lash/me.m01.d17:meMA.LaudsTheotokion.melody	
ltx/en_uk_lash/me.m01.d17:meMA.LaudsTheotokion.mode	@ltx/en_uk_lash/miscellanea:misc.Mode8
ltx/en_uk_lash/me.m01.d17:meMA.LaudsTheotokion.text	@ltx/en_uk_lash/oc.m8.d5:ocMA.AposTheotokion.text
ltx/en_uk_lash/me.m01.d17:meMA.MM.Lauds1234as5678.text	@ltx/en_uk_lash/properties:media.key
ltx/en_uk_lash/me.m01.d17:meMA.Ode1C11.greekmelody	@ltx/en_uk_lash/he.h.m8:heHE.ArmatilatinFarao.greekname
ltx/en_uk_lash/me.m01.d17:meMA.Ode1C11.incipit	…
ltx/en_uk_lash/me.m01.d17:meMA.Ode1C11.melody	@ltx/en_uk_lash/he.h.m8:heHE.ArmatilatinFarao.name
ltx/en_uk_lash/me.m01.d17:meMA.Ode1C11.mode	@ltx/en_uk_lash/miscellanea:misc.Mode8
ltx/en_uk_lash/me.m01.d17:meMA.Ode1C11.ode	@ltx/en_uk_lash/miscellanea:misc.Ode1
ltx/en_uk_lash/me.m01.d17:meMA.Ode1C11.text	
ltx/en_uk_lash/me.m01.d17:meMA.Ode1C12.incipit	…
ltx/en_uk_lash/me.m01.d17:meMA.Ode1C12.melody	@ltx/en_uk_lash/he.h.m8:heHE.ArmatilatinFarao.name
ltx/en_uk_lash/me.m01.d17:meMA.Ode1C12.mode	@ltx/en_uk_lash/miscellanea:misc.Mode8
ltx/en_uk_lash/me.m01.d17:meMA.Ode1C12.ode	@ltx/en_uk_lash/miscellanea:misc.Ode1
ltx/en_uk_lash/me.m01.d17:meMA.Ode1C12.text	
ltx/en_uk_lash/me.m01.d17:meMA.Ode1C13.incipit	…
ltx/en_uk_lash/me.m01.d17:meMA.Ode1C13.melody	@ltx/en_uk_lash/he.h.m8:heHE.ArmatilatinFarao.name
ltx/en_uk_lash/me.m01.d17:meMA.Ode1C13.mode	@ltx/en_uk_lash/miscellanea:misc.Mode8
ltx/en_uk_lash/me.m01.d17:meMA.Ode1C13.ode	@ltx/en_uk_lash/miscellanea:misc.Ode1
ltx/en_uk_lash/me.m01.d17:meMA.Ode1C13.text	
ltx/en_uk_lash/me.m01.d17:meMA.Ode1C1T.incipit	…
ltx/en_uk_lash/me.m01.d17:meMA.Ode1C1T.melody	@ltx/en_uk_lash/he.h.m8:heHE.ArmatilatinFarao.name
ltx/en_uk_lash/me.m01.d17:meMA.Ode1C1T.mode	@ltx/en_uk_lash/miscellanea:misc.Mode8
ltx/en_uk_lash/me.m01.d17:meMA.Ode1C1T.ode	@ltx/en_uk_lash/miscellanea:misc.Ode1
ltx/en_uk_lash/me.m01.d17:meMA.Ode1C1T.text	
ltx/en_uk_lash/me.m01.d17:meMA.Ode3C11.greekmelody	@ltx/en_uk_lash/he.h.m8:heHE.OStereosasKatArchas.greekname
ltx/en_uk_lash/me.m01.d17:meMA.Ode3C11.incipit	…
ltx/en_uk_lash/me.m01.d17:meMA.Ode3C11.melody	@ltx/en_uk_lash/he.h.m8:heHE.OStereosasKatArchas.name
ltx/en_uk_lash/me.m01.d17:meMA.Ode3C11.mode	@ltx/en_uk_lash/miscellanea:misc.Mode8
ltx/en_uk_lash/me.m01.d17:meMA.Ode3C11.ode	@ltx/en_uk_lash/miscellanea:misc.Ode3
ltx/en_uk_lash/me.m01.d17:meMA.Ode3C11.text	
ltx/en_uk_lash/me.m01.d17:meMA.Ode3C12.incipit	…
ltx/en_uk_lash/me.m01.d17:meMA.Ode3C12.melody	@ltx/en_uk_lash/he.h.m8:heHE.OStereosasKatArchas.name
ltx/en_uk_lash/me.m01.d17:meMA.Ode3C12.mode	@ltx/en_uk_lash/miscellanea:misc.Mode8
ltx/en_uk_lash/me.m01.d17:meMA.Ode3C12.ode	@ltx/en_uk_lash/miscellanea:misc.Ode3
ltx/en_uk_lash/me.m01.d17:meMA.Ode3C12.text	
ltx/en_uk_lash/me.m01.d17:meMA.Ode3C13.incipit	…
ltx/en_uk_lash/me.m01.d17:meMA.Ode3C13.melody	@ltx/en_uk_lash/he.h.m8:heHE.OStereosasKatArchas.name
ltx/en_uk_lash/me.m01.d17:meMA.Ode3C13.mode	@ltx/en_uk_lash/miscellanea:misc.Mode8
ltx/en_uk_lash/me.m01.d17:meMA.Ode3C13.ode	@ltx/en_uk_lash/miscellanea:misc.Ode3
ltx/en_uk_lash/me.m01.d17:meMA.Ode3C13.text	
ltx/en_uk_lash/me.m01.d17:meMA.Ode3C1T.incipit	…
ltx/en_uk_lash/me.m01.d17:meMA.Ode3C1T.melody	@ltx/en_uk_lash/he.h.m8:heHE.OStereosasKatArchas.name
ltx/en_uk_lash/me.m01.d17:meMA.Ode3C1T.mode	@ltx/en_uk_lash/miscellanea:misc.Mode8
ltx/en_uk_lash/me.m01.d17:meMA.Ode3C1T.ode	@ltx/en_uk_lash/miscellanea:misc.Ode3
ltx/en_uk_lash/me.m01.d17:meMA.Ode3C1T.text	
ltx/en_uk_lash/me.m01.d17:meMA.Ode3Kathisma1.greekmelody	@ltx/en_uk_lash/he.a.m8:heAU.TinSofianKaiLogon.greekname
ltx/en_uk_lash/me.m01.d17:meMA.Ode3Kathisma1.incipit	…
ltx/en_uk_lash/me.m01.d17:meMA.Ode3Kathisma1.melody	@ltx/en_uk_lash/he.a.m8:heAU.TinSofianKaiLogon.notmetered
ltx/en_uk_lash/me.m01.d17:meMA.Ode3Kathisma1.mode	@ltx/en_uk_lash/miscellanea:misc.Mode8
ltx/en_uk_lash/me.m01.d17:meMA.Ode3Kathisma1.text	
ltx/en_uk_lash/me.m01.d17:meMA.Ode3KathismaT.incipit	…
ltx/en_uk_lash/me.m01.d17:meMA.Ode3KathismaT.melody	@ltx/en_uk_lash/he.a.m8:heAU.TinSofianKaiLogon.notmetered
ltx/en_uk_lash/me.m01.d17:meMA.Ode3KathismaT.mode	@ltx/en_uk_lash/miscellanea:misc.Mode8
ltx/en_uk_lash/me.m01.d17:meMA.Ode3KathismaT.text	
ltx/en_uk_lash/me.m01.d17:meMA.Ode4C11.greekmelody	@ltx/en_uk_lash/he.h.m8:heHE.SyMouIschys.greekname
ltx/en_uk_lash/me.m01.d17:meMA.Ode4C11.incipit	…
ltx/en_uk_lash/me.m01.d17:meMA.Ode4C11.melody	@ltx/en_uk_lash/he.h.m8:heHE.SyMouIschys.name
ltx/en_uk_lash/me.m01.d17:meMA.Ode4C11.mode	@ltx/en_uk_lash/miscellanea:misc.Mode8
ltx/en_uk_lash/me.m01.d17:meMA.Ode4C11.ode	@ltx/en_uk_lash/miscellanea:misc.Ode4
ltx/en_uk_lash/me.m01.d17:meMA.Ode4C11.text	
ltx/en_uk_lash/me.m01.d17:meMA.Ode4C12.incipit	…
ltx/en_uk_lash/me.m01.d17:meMA.Ode4C12.melody	@ltx/en_uk_lash/he.h.m8:heHE.SyMouIschys.name
ltx/en_uk_lash/me.m01.d17:meMA.Ode4C12.mode	@ltx/en_uk_lash/miscellanea:misc.Mode8
ltx/en_uk_lash/me.m01.d17:meMA.Ode4C12.ode	@ltx/en_uk_lash/miscellanea:misc.Ode4
ltx/en_uk_lash/me.m01.d17:meMA.Ode4C12.text	
ltx/en_uk_lash/me.m01.d17:meMA.Ode4C13.incipit	…
ltx/en_uk_lash/me.m01.d17:meMA.Ode4C13.melody	@ltx/en_uk_lash/he.h.m8:heHE.SyMouIschys.name
ltx/en_uk_lash/me.m01.d17:meMA.Ode4C13.mode	@ltx/en_uk_lash/miscellanea:misc.Mode8
ltx/en_uk_lash/me.m01.d17:meMA.Ode4C13.ode	@ltx/en_uk_lash/miscellanea:misc.Ode4
ltx/en_uk_lash/me.m01.d17:meMA.Ode4C13.text	
ltx/en_uk_lash/me.m01.d17:meMA.Ode4C1T.incipit	…
ltx/en_uk_lash/me.m01.d17:meMA.Ode4C1T.melody	@ltx/en_uk_lash/he.h.m8:heHE.SyMouIschys.name
ltx/en_uk_lash/me.m01.d17:meMA.Ode4C1T.mode	@ltx/en_uk_lash/miscellanea:misc.Mode8
ltx/en_uk_lash/me.m01.d17:meMA.Ode4C1T.ode	@ltx/en_uk_lash/miscellanea:misc.Ode4
ltx/en_uk_lash/me.m01.d17:meMA.Ode4C1T.text	
ltx/en_uk_lash/me.m01.d17:meMA.Ode5C11.greekmelody	@ltx/en_uk_lash/he.h.m8:heHE.InaTiMeAposo.greekname
ltx/en_uk_lash/me.m01.d17:meMA.Ode5C11.incipit	…
ltx/en_uk_lash/me.m01.d17:meMA.Ode5C11.melody	@ltx/en_uk_lash/he.h.m8:heHE.InaTiMeAposo.name
ltx/en_uk_lash/me.m01.d17:meMA.Ode5C11.mode	@ltx/en_uk_lash/miscellanea:misc.Mode8
ltx/en_uk_lash/me.m01.d17:meMA.Ode5C11.ode	@ltx/en_uk_lash/miscellanea:misc.Ode5
ltx/en_uk_lash/me.m01.d17:meMA.Ode5C11.text	
ltx/en_uk_lash/me.m01.d17:meMA.Ode5C12.incipit	…
ltx/en_uk_lash/me.m01.d17:meMA.Ode5C12.melody	@ltx/en_uk_lash/he.h.m8:heHE.InaTiMeAposo.name
ltx/en_uk_lash/me.m01.d17:meMA.Ode5C12.mode	@ltx/en_uk_lash/miscellanea:misc.Mode8
ltx/en_uk_lash/me.m01.d17:meMA.Ode5C12.ode	@ltx/en_uk_lash/miscellanea:misc.Ode5
ltx/en_uk_lash/me.m01.d17:meMA.Ode5C12.text	
ltx/en_uk_lash/me.m01.d17:meMA.Ode5C1T.incipit	…
ltx/en_uk_lash/me.m01.d17:meMA.Ode5C1T.melody	@ltx/en_uk_lash/he.h.m8:heHE.InaTiMeAposo.name
ltx/en_uk_lash/me.m01.d17:meMA.Ode5C1T.mode	@ltx/en_uk_lash/miscellanea:misc.Mode8
ltx/en_uk_lash/me.m01.d17:meMA.Ode5C1T.ode	@ltx/en_uk_lash/miscellanea:misc.Ode5
ltx/en_uk_lash/me.m01.d17:meMA.Ode5C1T.text	
ltx/en_uk_lash/me.m01.d17:meMA.Ode6C11.greekmelody	@ltx/en_uk_lash/he.h.m8:heHE.AvyssosAmartion.greekname
ltx/en_uk_lash/me.m01.d17:meMA.Ode6C11.incipit	…
ltx/en_uk_lash/me.m01.d17:meMA.Ode6C11.melody	@ltx/en_uk_lash/he.h.m8:heHE.AvyssosAmartion.name
ltx/en_uk_lash/me.m01.d17:meMA.Ode6C11.mode	@ltx/en_uk_lash/miscellanea:misc.Mode8
ltx/en_uk_lash/me.m01.d17:meMA.Ode6C11.ode	@ltx/en_uk_lash/miscellanea:misc.Ode6
ltx/en_uk_lash/me.m01.d17:meMA.Ode6C11.text	
ltx/en_uk_lash/me.m01.d17:meMA.Ode6C12.incipit	…
ltx/en_uk_lash/me.m01.d17:meMA.Ode6C12.melody	@ltx/en_uk_lash/he.h.m8:heHE.AvyssosAmartion.name
ltx/en_uk_lash/me.m01.d17:meMA.Ode6C12.mode	@ltx/en_uk_lash/miscellanea:misc.Mode8
ltx/en_uk_lash/me.m01.d17:meMA.Ode6C12.ode	@ltx/en_uk_lash/miscellanea:misc.Ode6
ltx/en_uk_lash/me.m01.d17:meMA.Ode6C12.text	
ltx/en_uk_lash/me.m01.d17:meMA.Ode6C1T.incipit	…
ltx/en_uk_lash/me.m01.d17:meMA.Ode6C1T.melody	@ltx/en_uk_lash/he.h.m8:heHE.AvyssosAmartion.name
ltx/en_uk_lash/me.m01.d17:meMA.Ode6C1T.mode	@ltx/en_uk_lash/miscellanea:misc.Mode8
ltx/en_uk_lash/me.m01.d17:meMA.Ode6C1T.ode	@ltx/en_uk_lash/miscellanea:misc.Ode6
ltx/en_uk_lash/me.m01.d17:meMA.Ode6C1T.text	
ltx/en_uk_lash/me.m01.d17:meMA.Ode7C11.greekmelody	@ltx/en_uk_lash/he.h.m8:heHE.TheouSynkatavasin.greekname
ltx/en_uk_lash/me.m01.d17:meMA.Ode7C11.incipit	…
ltx/en_uk_lash/me.m01.d17:meMA.Ode7C11.melody	@ltx/en_uk_lash/he.h.m8:heHE.TheouSynkatavasin.name
ltx/en_uk_lash/me.m01.d17:meMA.Ode7C11.mode	@ltx/en_uk_lash/miscellanea:misc.Mode8
ltx/en_uk_lash/me.m01.d17:meMA.Ode7C11.ode	@ltx/en_uk_lash/miscellanea:misc.Ode7
ltx/en_uk_lash/me.m01.d17:meMA.Ode7C11.text	
ltx/en_uk_lash/me.m01.d17:meMA.Ode7C12.incipit	…
ltx/en_uk_lash/me.m01.d17:meMA.Ode7C12.melody	@ltx/en_uk_lash/he.h.m8:heHE.TheouSynkatavasin.name
ltx/en_uk_lash/me.m01.d17:meMA.Ode7C12.mode	@ltx/en_uk_lash/miscellanea:misc.Mode8
ltx/en_uk_lash/me.m01.d17:meMA.Ode7C12.ode	@ltx/en_uk_lash/miscellanea:misc.Ode7
ltx/en_uk_lash/me.m01.d17:meMA.Ode7C12.text	
ltx/en_uk_lash/me.m01.d17:meMA.Ode7C1T.incipit	…
ltx/en_uk_lash/me.m01.d17:meMA.Ode7C1T.melody	@ltx/en_uk_lash/he.h.m8:heHE.TheouSynkatavasin.name
ltx/en_uk_lash/me.m01.d17:meMA.Ode7C1T.mode	@ltx/en_uk_lash/miscellanea:misc.Mode8
ltx/en_uk_lash/me.m01.d17:meMA.Ode7C1T.ode	@ltx/en_uk_lash/miscellanea:misc.Ode7
ltx/en_uk_lash/me.m01.d17:meMA.Ode7C1T.text	
ltx/en_uk_lash/me.m01.d17:meMA.Ode8C11.greekmelody	@ltx/en_uk_lash/he.h.m8:heHE.EptaplasiosKaminon.greekname
ltx/en_uk_lash/me.m01.d17:meMA.Ode8C11.incipit	…
ltx/en_uk_lash/me.m01.d17:meMA.Ode8C11.melody	@ltx/en_uk_lash/he.h.m8:heHE.EptaplasiosKaminon.name
ltx/en_uk_lash/me.m01.d17:meMA.Ode8C11.mode	@ltx/en_uk_lash/miscellanea:misc.Mode8
ltx/en_uk_lash/me.m01.d17:meMA.Ode8C11.ode	@ltx/en_uk_lash/miscellanea:misc.Ode8
ltx/en_uk_lash/me.m01.d17:meMA.Ode8C11.text	
ltx/en_uk_lash/me.m01.d17:meMA.Ode8C12.incipit	…
ltx/en_uk_lash/me.m01.d17:meMA.Ode8C12.melody	@ltx/en_uk_lash/he.h.m8:heHE.EptaplasiosKaminon.name
ltx/en_uk_lash/me.m01.d17:meMA.Ode8C12.mode	@ltx/en_uk_lash/miscellanea:misc.Mode8
ltx/en_uk_lash/me.m01.d17:meMA.Ode8C12.ode	@ltx/en_uk_lash/miscellanea:misc.Ode8
ltx/en_uk_lash/me.m01.d17:meMA.Ode8C12.text	
ltx/en_uk_lash/me.m01.d17:meMA.Ode8C13.incipit	…
ltx/en_uk_lash/me.m01.d17:meMA.Ode8C13.melody	@ltx/en_uk_lash/he.h.m8:heHE.EptaplasiosKaminon.name
ltx/en_uk_lash/me.m01.d17:meMA.Ode8C13.mode	@ltx/en_uk_lash/miscellanea:misc.Mode8
ltx/en_uk_lash/me.m01.d17:meMA.Ode8C13.ode	@ltx/en_uk_lash/miscellanea:misc.Ode8
ltx/en_uk_lash/me.m01.d17:meMA.Ode8C13.text	
ltx/en_uk_lash/me.m01.d17:meMA.Ode8C1T.incipit	…
ltx/en_uk_lash/me.m01.d17:meMA.Ode8C1T.melody	@ltx/en_uk_lash/he.h.m8:heHE.EptaplasiosKaminon.name
ltx/en_uk_lash/me.m01.d17:meMA.Ode8C1T.mode	@ltx/en_uk_lash/miscellanea:misc.Mode8
ltx/en_uk_lash/me.m01.d17:meMA.Ode8C1T.ode	@ltx/en_uk_lash/miscellanea:misc.Ode8
ltx/en_uk_lash/me.m01.d17:meMA.Ode8C1T.text	
ltx/en_uk_lash/me.m01.d17:meMA.Ode9C11.greekmelody	@ltx/en_uk_lash/he.h.m8:heHE.ExestiEpiTouto.greekname
ltx/en_uk_lash/me.m01.d17:meMA.Ode9C11.incipit	…
ltx/en_uk_lash/me.m01.d17:meMA.Ode9C11.melody	@ltx/en_uk_lash/he.h.m8:heHE.ExestiEpiTouto.name
ltx/en_uk_lash/me.m01.d17:meMA.Ode9C11.mode	@ltx/en_uk_lash/miscellanea:misc.Mode8
ltx/en_uk_lash/me.m01.d17:meMA.Ode9C11.ode	@ltx/en_uk_lash/miscellanea:misc.Ode9
ltx/en_uk_lash/me.m01.d17:meMA.Ode9C11.text	
ltx/en_uk_lash/me.m01.d17:meMA.Ode9C12.incipit	…
ltx/en_uk_lash/me.m01.d17:meMA.Ode9C12.melody	@ltx/en_uk_lash/he.h.m8:heHE.ExestiEpiTouto.name
ltx/en_uk_lash/me.m01.d17:meMA.Ode9C12.mode	@ltx/en_uk_lash/miscellanea:misc.Mode8
ltx/en_uk_lash/me.m01.d17:meMA.Ode9C12.ode	@ltx/en_uk_lash/miscellanea:misc.Ode9
ltx/en_uk_lash/me.m01.d17:meMA.Ode9C12.text	
ltx/en_uk_lash/me.m01.d17:meMA.Ode9C13.incipit	…
ltx/en_uk_lash/me.m01.d17:meMA.Ode9C13.melody	@ltx/en_uk_lash/he.h.m8:heHE.ExestiEpiTouto.name
ltx/en_uk_lash/me.m01.d17:meMA.Ode9C13.mode	@ltx/en_uk_lash/miscellanea:misc.Mode8
ltx/en_uk_lash/me.m01.d17:meMA.Ode9C13.ode	@ltx/en_uk_lash/miscellanea:misc.Ode9
ltx/en_uk_lash/me.m01.d17:meMA.Ode9C13.text	
ltx/en_uk_lash/me.m01.d17:meMA.Ode9C1T.incipit	…
ltx/en_uk_lash/me.m01.d17:meMA.Ode9C1T.melody	@ltx/en_uk_lash/he.h.m8:heHE.ExestiEpiTouto.name
ltx/en_uk_lash/me.m01.d17:meMA.Ode9C1T.mode	@ltx/en_uk_lash/miscellanea:misc.Mode8
ltx/en_uk_lash/me.m01.d17:meMA.Ode9C1T.ode	@ltx/en_uk_lash/miscellanea:misc.Ode9
ltx/en_uk_lash/me.m01.d17:meMA.Ode9C1T.text	
ltx/en_uk_lash/me.m01.d17:meMA.Oikos1.text	
ltx/en_uk_lash/me.m01.d17:meMA.PostGospelBoth.incipit	@ltx/en_uk_lash/ho.ho03:hoMA.PostGospelTheotokos.incipit
ltx/en_uk_lash/me.m01.d17:meMA.PostGospelBoth.melody	
ltx/en_uk_lash/me.m01.d17:meMA.PostGospelBoth.mode	@ltx/en_uk_lash/miscellanea:misc.Mode2
ltx/en_uk_lash/me.m01.d17:meMA.PostGospelBoth.text	@ltx/en_uk_lash/ho.ho03:hoMA.PostGospelTheotokos.text
ltx/en_uk_lash/me.m01.d17:meMA.PostGospelGlory.incipit	@ltx/en_uk_lash/ho.ho03:hoMA.PostGospelMonastic.incipit
ltx/en_uk_lash/me.m01.d17:meMA.PostGospelGlory.melody	
ltx/en_uk_lash/me.m01.d17:meMA.PostGospelGlory.mode	@ltx/en_uk_lash/miscellanea:misc.Mode2
ltx/en_uk_lash/me.m01.d17:meMA.PostGospelGlory.text	@ltx/en_uk_lash/ho.ho03:hoMA.PostGospelMonastic.text
ltx/en_uk_lash/me.m01.d17:meMA.PostGospelIdiomelon.incipit	…
ltx/en_uk_lash/me.m01.d17:meMA.PostGospelIdiomelon.melody	
ltx/en_uk_lash/me.m01.d17:meMA.PostGospelIdiomelon.mode	@ltx/en_uk_lash/miscellanea:misc.Mode6
ltx/en_uk_lash/me.m01.d17:meMA.PostGospelIdiomelon.text	
ltx/en_uk_lash/me.m01.d17:meSV.AposGlory.incipit	…
ltx/en_uk_lash/me.m01.d17:meSV.AposGlory.melody	@ltx/en_uk_lash/he.a.m2:heAU.OikosTouEfratha.notmetered
ltx/en_uk_lash/me.m01.d17:meSV.AposGlory.mode	@ltx/en_uk_lash/miscellanea:misc.Mode2
ltx/en_uk_lash/me.m01.d17:meSV.AposGlory.text	
ltx/en_uk_lash/me.m01.d17:meSV.Aposticha1.incipit	…
ltx/en_uk_lash/me.m01.d17:meSV.Aposticha1.melody	@ltx/en_uk_lash/he.a.m2:heAU.OikosTouEfratha.notmetered
ltx/en_uk_lash/me.m01.d17:meSV.Aposticha1.mode	@ltx/en_uk_lash/miscellanea:misc.Mode2
ltx/en_uk_lash/me.m01.d17:meSV.Aposticha1.text	
ltx/en_uk_lash/me.m01.d17:meSV.Aposticha2.incipit	…
ltx/en_uk_lash/me.m01.d17:meSV.Aposticha2.melody	@ltx/en_uk_lash/he.a.m2:heAU.OikosTouEfratha.notmetered
ltx/en_uk_lash/me.m01.d17:meSV.Aposticha2.mode	@ltx/en_uk_lash/miscellanea:misc.Mode2
ltx/en_uk_lash/me.m01.d17:meSV.Aposticha2.text	
ltx/en_uk_lash/me.m01.d17:meSV.Aposticha3.incipit	…
ltx/en_uk_lash/me.m01.d17:meSV.Aposticha3.melody	@ltx/en_uk_lash/he.a.m2:heAU.OikosTouEfratha.notmetered
ltx/en_uk_lash/me.m01.d17:meSV.Aposticha3.mode	@ltx/en_uk_lash/miscellanea:misc.Mode2
ltx/en_uk_lash/me.m01.d17:meSV.Aposticha3.text	
ltx/en_uk_lash/me.m01.d17:meSV.SticBoth.incipit	…
ltx/en_uk_lash/me.m01.d17:meSV.SticBoth.melody	
ltx/en_uk_lash/me.m01.d17:meSV.SticBoth.mode	@ltx/en_uk_lash/miscellanea:misc.Mode2
ltx/en_uk_lash/me.m01.d17:meSV.SticBoth.text	
ltx/en_uk_lash/me.m01.d17:meSV.SticGlory.incipit	…
ltx/en_uk_lash/me.m01.d17:meSV.SticGlory.melody	
ltx/en_uk_lash/me.m01.d17:meSV.SticGlory.mode	@ltx/en_uk_lash/miscellanea:misc.Mode2
ltx/en_uk_lash/me.m01.d17:meSV.SticGlory.text	
ltx/en_uk_lash/me.m01.d17:meSV.Stichera1.incipit	…
ltx/en_uk_lash/me.m01.d17:meSV.Stichera1.melody	@ltx/en_uk_lash/he.a.m2:heAU.OteEkTouXylou.notmetered
ltx/en_uk_lash/me.m01.d17:meSV.Stichera1.mode	@ltx/en_uk_lash/miscellanea:misc.Mode2
ltx/en_uk_lash/me.m01.d17:meSV.Stichera1.text	
ltx/en_uk_lash/me.m01.d17:meSV.Stichera2.incipit	…
ltx/en_uk_lash/me.m01.d17:meSV.Stichera2.melody	@ltx/en_uk_lash/he.a.m2:heAU.OteEkTouXylou.notmetered
ltx/en_uk_lash/me.m01.d17:meSV.Stichera2.mode	@ltx/en_uk_lash/miscellanea:misc.Mode2
ltx/en_uk_lash/me.m01.d17:meSV.Stichera2.text	
ltx/en_uk_lash/me.m01.d17:meSV.Stichera3.incipit	…
ltx/en_uk_lash/me.m01.d17:meSV.Stichera3.melody	@ltx/en_uk_lash/he.a.m2:heAU.OteEkTouXylou.notmetered
ltx/en_uk_lash/me.m01.d17:meSV.Stichera3.mode	@ltx/en_uk_lash/miscellanea:misc.Mode2
ltx/en_uk_lash/me.m01.d17:meSV.Stichera3.text	
ltx/en_uk_lash/me.m01.d17:meVE.Apolytikion1.incipit	…
ltx/en_uk_lash/me.m01.d17:meVE.Apolytikion1.melody	
ltx/en_uk_lash/me.m01.d17:meVE.Apolytikion1.mode	@ltx/en_uk_lash/miscellanea:misc.Mode4
ltx/en_uk_lash/me.m01.d17:meVE.Apolytikion1.text	
ltx/en_uk_lash/me.m01.d17:meVE.AposGlory.incipit	We multitudes of monastics honour…
ltx/en_uk_lash/me.m01.d17:meVE.AposGlory.melody	
ltx/en_uk_lash/me.m01.d17:meVE.AposGlory.mode	@ltx/en_uk_lash/miscellanea:misc.Mode8
ltx/en_uk_lash/me.m01.d17:meVE.AposGlory.poet	@ltx/en_uk_lash/poets:po.Sykeotou
ltx/en_uk_lash/me.m01.d17:meVE.AposGlory.text	We multitudes of monastics honour you as our teacher and guide, for through you we have learned to walk the truly straight path. Blessed are you, for enslaved to Christ you triumphed over the power of the foe, companion of Angels and comrade of Paul the Theban. With them intercede with the Lord to have mercy on our souls.
ltx/en_uk_lash/me.m01.d17:meVE.AposTheotokion.incipit	@ltx/en_uk_lash/oc.m8.d1:ocVE.AposTheotokion.incipit
ltx/en_uk_lash/me.m01.d17:meVE.AposTheotokion.melody	
ltx/en_uk_lash/me.m01.d17:meVE.AposTheotokion.mode	@ltx/en_uk_lash/miscellanea:misc.Mode8
ltx/en_uk_lash/me.m01.d17:meVE.AposTheotokion.text	@ltx/en_uk_lash/oc.m8.d1:ocVE.AposTheotokion.text
ltx/en_uk_lash/me.m01.d17:meVE.Aposticha1.greekmelody	@ltx/en_uk_lash/he.a.m5:heAU.ChairoisAskitikon.greekname
ltx/en_uk_lash/me.m01.d17:meVE.Aposticha1.incipit	Hail, prince of ascetics and…
ltx/en_uk_lash/me.m01.d17:meVE.Aposticha1.melody	@ltx/en_uk_lash/he.a.m5:heAU.ChairoisAskitikon.notmetered
ltx/en_uk_lash/me.m01.d17:meVE.Aposticha1.mode	@ltx/en_uk_lash/miscellanea:misc.Mode5
ltx/en_uk_lash/me.m01.d17:meVE.Aposticha1.text	Hail, prince of ascetics and their undefeated champion, for cutting out the roots of the passions and withstanding the assaults of the demons, you triumphed over their enfeeblements and their soul-destroying error. You displayed the unconquerable power of the Saviour''s Cross. Clothed in it you conquered all those who reject Christ''s divine manifestation through flesh. Implore him to grant our souls his great mercy.
ltx/en_uk_lash/me.m01.d17:meVE.Aposticha2.incipit	Hail, Antony, companion of the…
ltx/en_uk_lash/me.m01.d17:meVE.Aposticha2.melody	@ltx/en_uk_lash/he.a.m5:heAU.ChairoisAskitikon.notmetered
ltx/en_uk_lash/me.m01.d17:meVE.Aposticha2.mode	@ltx/en_uk_lash/miscellanea:misc.Mode5
ltx/en_uk_lash/me.m01.d17:meVE.Aposticha2.text	Hail, Antony, companion of the angelic choirs in the highest, for you truly lived their way of life on earth, practising virtue, and you appeared as a pure unsullied mirror, reflecting the dazzling lightning flashes of the Holy Spirit, all-happy Father. And so you were illumined and saw what was to come, foretelling all things, initiated by the divine light of Christ''s manifestation. Implore him to grant our souls his great mercy.
ltx/en_uk_lash/me.m01.d17:meVE.Aposticha3.incipit	Established by virtues, you became…
ltx/en_uk_lash/me.m01.d17:meVE.Aposticha3.melody	@ltx/en_uk_lash/he.a.m5:heAU.ChairoisAskitikon.notmetered
ltx/en_uk_lash/me.m01.d17:meVE.Aposticha3.mode	@ltx/en_uk_lash/miscellanea:misc.Mode5
ltx/en_uk_lash/me.m01.d17:meVE.Aposticha3.text	Established by virtues, you became a pillar formed of light and an overshadowing cloud for those in the desert, leading those who see God from earth to heaven. With the staff of the Cross you divided the sea of the passions, while by routing the spiritual Amalek you found the unimpeded ascent to heaven, O blessed of God, and an unsullied lot with the Bodiless Powers, as you stand with greatest joy before the throne of Christ, implore him to grant our souls his great mercy.
ltx/en_uk_lash/me.m01.d17:meVE.Lity1.incipit	Constructing an ascetic gymnastic school…
ltx/en_uk_lash/me.m01.d17:meVE.Lity1.melody	
ltx/en_uk_lash/me.m01.d17:meVE.Lity1.mode	@ltx/en_uk_lash/miscellanea:misc.Mode2
ltx/en_uk_lash/me.m01.d17:meVE.Lity1.poet	@ltx/en_uk_lash/poets:po.Stouditou
ltx/en_uk_lash/me.m01.d17:meVE.Lity1.text	Constructing an ascetic gymnastic school on earth, Venerable Antony, you blunted all the assaults of the passions with the stream of your tears. Your godly way of life was acknowledged for all as a ladder leading up to heaven; for by it you displayed the fruits of true religion, and through them you the diseases of the passions of those who cry to with faith, ‘Hail, radiant golden star of the East, torchbearer and shepherd of Monastics! Hail, fairest offspring of the desert, and unshakeable bulwark of the Church! Hail, great guide of those who gone astray! Hail, our boast, and bright glory of the inhabited world!
ltx/en_uk_lash/me.m01.d17:meVE.Lity2.incipit	Let us honour Antony, Angel…
ltx/en_uk_lash/me.m01.d17:meVE.Lity2.melody	
ltx/en_uk_lash/me.m01.d17:meVE.Lity2.mode	@ltx/en_uk_lash/miscellanea:misc.Mode2
ltx/en_uk_lash/me.m01.d17:meVE.Lity2.text	Let us honour Antony, Angel on earth and man of God in heaven, ornament of the world, delight of the good and of the virtues, boast of ascetics; for planted in the house of God, he flowered righteously and, like a cedar in the desert, he multiplied the flocks of Christ’s rational sheep with holiness and justice.
ltx/en_uk_lash/me.m01.d17:meVE.Lity3.incipit	Venerable Father, from childhood you…
ltx/en_uk_lash/me.m01.d17:meVE.Lity3.melody	
ltx/en_uk_lash/me.m01.d17:meVE.Lity3.mode	@ltx/en_uk_lash/miscellanea:misc.Mode2
ltx/en_uk_lash/me.m01.d17:meVE.Lity3.text	Venerable Father, from childhood you practised virtue assiduously and became an instrument of the Holy Spirit; receiving from him power to work wonders, you persuaded men to despise pleasures; while now, as you shine more brightly by the divine light, enlighten our minds also, Father Antony.
ltx/en_uk_lash/me.m01.d17:meVE.Lity4.incipit	Venerable Antony, as though at…
ltx/en_uk_lash/me.m01.d17:meVE.Lity4.melody	
ltx/en_uk_lash/me.m01.d17:meVE.Lity4.mode	@ltx/en_uk_lash/miscellanea:misc.Mode3
ltx/en_uk_lash/me.m01.d17:meVE.Lity4.poet	@ltx/en_uk_lash/poets:po.Anatoliou
ltx/en_uk_lash/me.m01.d17:meVE.Lity4.text	Venerable Antony, as though at rest among non-material things, you accomplished the ardent and courageous life of the strictest discipline, and bravely resisting the assaults of demons, you triumphed over their weakness and their soul-destroying error; while you displayed the force and invincible power of the Saviour’s Cross; and girded with its power, you defeated all those who reject Christ’s divine manifestation through the flesh. Implore him that our souls may be given his great mercy.
ltx/en_uk_lash/me.m01.d17:meVE.LityBoth.incipit	@ltx/en_uk_lash/oc.m5.d3:ocVE.AposTheotokion.incipit
ltx/en_uk_lash/me.m01.d17:meVE.LityBoth.melody	
ltx/en_uk_lash/me.m01.d17:meVE.LityBoth.mode	@ltx/en_uk_lash/miscellanea:misc.Mode5
ltx/en_uk_lash/me.m01.d17:meVE.LityBoth.text	@ltx/en_uk_lash/oc.m5.d3:ocVE.AposTheotokion.text
ltx/en_uk_lash/me.m01.d17:meVE.LityGlory.incipit	Venerable Father, when you heard…
ltx/en_uk_lash/me.m01.d17:meVE.LityGlory.melody	
ltx/en_uk_lash/me.m01.d17:meVE.LityGlory.mode	@ltx/en_uk_lash/miscellanea:misc.Mode5
ltx/en_uk_lash/me.m01.d17:meVE.LityGlory.poet	@ltx/en_uk_lash/poets:po.Stouditou
ltx/en_uk_lash/me.m01.d17:meVE.LityGlory.text	Venerable Father, when you heard the voice of the Lord’s Gospel you abandoned the world, reckoning its wealth and glory to be nothing. And so you cried to all, ‘Love God, and you will find everlasting grace. Prefer nothing to his love, so that when he comes in his glory, you may find rest with all the Saints. At his intercessions, O Christ, guard and save our souls.
ltx/en_uk_lash/me.m01.d17:meVE.MM.Stichera1234as78910.text	@ltx/en_uk_lash/properties:media.key
ltx/en_uk_lash/me.m01.d17:meVE.SticGlory.incipit	Having preserved unblemished that which…
ltx/en_uk_lash/me.m01.d17:meVE.SticGlory.melody	
ltx/en_uk_lash/me.m01.d17:meVE.SticGlory.mode	@ltx/en_uk_lash/miscellanea:misc.Mode6
ltx/en_uk_lash/me.m01.d17:meVE.SticGlory.poet	@ltx/en_uk_lash/poets:po.Sykeotou
ltx/en_uk_lash/me.m01.d17:meVE.SticGlory.text	Having preserved unblemished that which is according to God''s image, by ascetic endeavour determining the mind as leader against destructive passions, you ascended as far as possible to that which is according to God''s likeness. For bravely overmastering nature, you hastened to submit the worse to the better, and to make the flesh the slave of the spirit. Therefore you were named ''summit of monastics'', ''founder of the desert'', ''trainer of those who run well'', ''most accurate rule of virtue'', and now in heaven, Antony, where mirrors are abolished, you look directly at the holy Trinity, appealing with no intermediary on behalf of those who honour you with faith and love.
ltx/en_uk_lash/me.m01.d17:meVE.SticTheotokion.incipit	@ltx/en_uk_lash/oc.m6.d1:ocVE.SticTheotokion.incipit
ltx/en_uk_lash/me.m01.d17:meVE.SticTheotokion.melody	
ltx/en_uk_lash/me.m01.d17:meVE.SticTheotokion.mode	@ltx/en_uk_lash/miscellanea:misc.Mode6
ltx/en_uk_lash/me.m01.d17:meVE.SticTheotokion.text	@ltx/en_uk_lash/oc.m6.d1:ocVE.SticTheotokion.text
ltx/en_uk_lash/me.m01.d17:meVE.Stichera01.incipit	You were enlightened by the…
ltx/en_uk_lash/me.m01.d17:meVE.Stichera01.melody	@ltx/en_uk_lash/he.a.m4:heAU.OExYpsistouKlitheis.notmetered
ltx/en_uk_lash/me.m01.d17:meVE.Stichera01.mode	@ltx/en_uk_lash/miscellanea:misc.Mode4
ltx/en_uk_lash/me.m01.d17:meVE.Stichera01.text	You were enlightened by the rays of the Spirit when love inspired by God set you aflame and gave wings to your soul to long for the true highest point of love. Then you despised both flesh and blood and, united to this love by great ascetic toil and stillness, you lived far from the world. Therefore, Antony, you were filled, as you had sought, with good things from there, and, like a shining Star, gave light to our souls.
ltx/en_uk_lash/me.m01.d17:meVE.Stichera02.incipit	By the grace of God''s…
ltx/en_uk_lash/me.m01.d17:meVE.Stichera02.melody	@ltx/en_uk_lash/he.a.m4:heAU.OExYpsistouKlitheis.notmetered
ltx/en_uk_lash/me.m01.d17:meVE.Stichera02.mode	@ltx/en_uk_lash/miscellanea:misc.Mode4
ltx/en_uk_lash/me.m01.d17:meVE.Stichera02.text	By the grace of God''s Spirit you smashed the arrows and darts of the demons, and you unmasked their wickedness and ambush for all by godlike teachings, as you blazed with godlike radiance and became the brightest beacon of monastics, and the first ornament of the desert, most experienced and revered physician of the sick and archetypal model of virtuous living, Father Antony.
ltx/en_uk_lash/me.m01.d17:meVE.Stichera03.incipit	Filled with God''s gifts of…
ltx/en_uk_lash/me.m01.d17:meVE.Stichera03.melody	@ltx/en_uk_lash/he.a.m4:heAU.OExYpsistouKlitheis.notmetered
ltx/en_uk_lash/me.m01.d17:meVE.Stichera03.mode	@ltx/en_uk_lash/miscellanea:misc.Mode4
ltx/en_uk_lash/me.m01.d17:meVE.Stichera03.text	Filled with God''s gifts of grace, Christ, having found you as an unsullied mirror of the manifestations of God, made the bright lightning flashes of his own light blaze for you. From this you appeared as an unstinted source of healings, nourishment for the starving and quenching through abundant rains the desire of the thirsty, while seeing the dispositions of souls, by your word you wisely made them better for God. Implore him to save and enlighten our souls.
ltx/en_uk_lash/me.m01.d17:meVE.Stichera04.incipit	Pure in soul and heart…
ltx/en_uk_lash/me.m01.d17:meVE.Stichera04.melody	@ltx/en_uk_lash/he.a.m4:heAU.OExYpsistouKlitheis.notmetered
ltx/en_uk_lash/me.m01.d17:meVE.Stichera04.mode	@ltx/en_uk_lash/miscellanea:misc.Mode4
ltx/en_uk_lash/me.m01.d17:meVE.Stichera04.text	Pure in soul and heart, an Angel on earth, a heavenly mortal, teacher of virginity, accurate measure of self-mastery, blessed Antony, united to your Master and bringing to him with the Angels, all the holy Ascetics and Martyrs the never silent hymn of glory, free from dread dangers and faults all those who ever celebrate your sacred memory.
