ltx/en_uk_lash/oc.m3.d4:ocBK.ModeNaked	@ltx/en_uk_lash/miscellanea:misc.Mode3.naked
ltx/en_uk_lash/oc.m3.d4:ocLI.Beatitudes1.incipit	@ltx/en_uk_lash/oc.m3.d1:ocLI.Beatitudes1.incipit
ltx/en_uk_lash/oc.m3.d4:ocLI.Beatitudes1.melody	
ltx/en_uk_lash/oc.m3.d4:ocLI.Beatitudes1.mode	@ltx/en_uk_lash/miscellanea:misc.Mode3
ltx/en_uk_lash/oc.m3.d4:ocLI.Beatitudes1.text	@ltx/en_uk_lash/oc.m3.d1:ocLI.Beatitudes1.text
ltx/en_uk_lash/oc.m3.d4:ocLI.Beatitudes2.incipit	…
ltx/en_uk_lash/oc.m3.d4:ocLI.Beatitudes2.melody	
ltx/en_uk_lash/oc.m3.d4:ocLI.Beatitudes2.mode	@ltx/en_uk_lash/miscellanea:misc.Mode3
ltx/en_uk_lash/oc.m3.d4:ocLI.Beatitudes2.text	
ltx/en_uk_lash/oc.m3.d4:ocLI.Beatitudes3.incipit	…
ltx/en_uk_lash/oc.m3.d4:ocLI.Beatitudes3.melody	
ltx/en_uk_lash/oc.m3.d4:ocLI.Beatitudes3.mode	@ltx/en_uk_lash/miscellanea:misc.Mode3
ltx/en_uk_lash/oc.m3.d4:ocLI.Beatitudes3.text	
ltx/en_uk_lash/oc.m3.d4:ocLI.Beatitudes4.incipit	…
ltx/en_uk_lash/oc.m3.d4:ocLI.Beatitudes4.melody	
ltx/en_uk_lash/oc.m3.d4:ocLI.Beatitudes4.mode	@ltx/en_uk_lash/miscellanea:misc.Mode3
ltx/en_uk_lash/oc.m3.d4:ocLI.Beatitudes4.text	
ltx/en_uk_lash/oc.m3.d4:ocLI.BeatitudesT.incipit	…
ltx/en_uk_lash/oc.m3.d4:ocLI.BeatitudesT.melody	
ltx/en_uk_lash/oc.m3.d4:ocLI.BeatitudesT.mode	@ltx/en_uk_lash/miscellanea:misc.Mode3
ltx/en_uk_lash/oc.m3.d4:ocLI.BeatitudesT.text	
ltx/en_uk_lash/oc.m3.d4:ocLI.BeatitudesTr.incipit	…
ltx/en_uk_lash/oc.m3.d4:ocLI.BeatitudesTr.melody	
ltx/en_uk_lash/oc.m3.d4:ocLI.BeatitudesTr.mode	@ltx/en_uk_lash/miscellanea:misc.Mode3
ltx/en_uk_lash/oc.m3.d4:ocLI.BeatitudesTr.text	
ltx/en_uk_lash/oc.m3.d4:ocLI.MM.Beatitudes1234TrTas78910GB.text	@ltx/en_uk_lash/properties:media.key
ltx/en_uk_lash/oc.m3.d4:ocMA.ApolTheotokion.incipit	@ltx/en_uk_lash/oc.m3.d3:ocMA.Kathisma13.incipit
ltx/en_uk_lash/oc.m3.d4:ocMA.ApolTheotokion.melody	
ltx/en_uk_lash/oc.m3.d4:ocMA.ApolTheotokion.mode	@ltx/en_uk_lash/miscellanea:misc.Mode3
ltx/en_uk_lash/oc.m3.d4:ocMA.ApolTheotokion.text	@ltx/en_uk_lash/oc.m3.d3:ocMA.Kathisma13.text
ltx/en_uk_lash/oc.m3.d4:ocMA.AposTheotokion.incipit	Seeing you hanging on the…
ltx/en_uk_lash/oc.m3.d4:ocMA.AposTheotokion.melody	
ltx/en_uk_lash/oc.m3.d4:ocMA.AposTheotokion.mode	@ltx/en_uk_lash/miscellanea:misc.Mode3
ltx/en_uk_lash/oc.m3.d4:ocMA.AposTheotokion.text	Seeing you hanging on the tree, my Christ, supremely good, the All-blameless lamented and cried out as a mother: my Son so greatly loved, how has the lawless nation condemned you to the tree?
ltx/en_uk_lash/oc.m3.d4:ocMA.Aposticha1.incipit	Through jealousy I was cast…
ltx/en_uk_lash/oc.m3.d4:ocMA.Aposticha1.melody	
ltx/en_uk_lash/oc.m3.d4:ocMA.Aposticha1.mode	@ltx/en_uk_lash/miscellanea:misc.Mode3
ltx/en_uk_lash/oc.m3.d4:ocMA.Aposticha1.text	Through jealousy I was cast out from delight and fell in a harsh fall; you did not disdain, Master, to assume for me that which was mine and to crucify it, and you save me, you lead me into glory. My Redeemer, glory to you!
ltx/en_uk_lash/oc.m3.d4:ocMA.Aposticha2.greekmelody	@ltx/en_uk_lash/he.a.m3:heAU.StavrofanosMoysis.greekname
ltx/en_uk_lash/oc.m3.d4:ocMA.Aposticha2.incipit	@ltx/en_uk_lash/he.a.m3:heAU.StavrofanosMoysis.incipit
ltx/en_uk_lash/oc.m3.d4:ocMA.Aposticha2.melody	@ltx/en_uk_lash/he.a.m3:heAU.StavrofanosMoysis.melody
ltx/en_uk_lash/oc.m3.d4:ocMA.Aposticha2.mode	@ltx/en_uk_lash/miscellanea:misc.Mode3
ltx/en_uk_lash/oc.m3.d4:ocMA.Aposticha2.text	@ltx/en_uk_lash/he.a.m3:heAU.StavrofanosMoysis.text
ltx/en_uk_lash/oc.m3.d4:ocMA.Aposticha3.incipit	Having fought the good fight…
ltx/en_uk_lash/oc.m3.d4:ocMA.Aposticha3.melody	
ltx/en_uk_lash/oc.m3.d4:ocMA.Aposticha3.mode	@ltx/en_uk_lash/miscellanea:misc.Mode3
ltx/en_uk_lash/oc.m3.d4:ocMA.Aposticha3.text	Having fought the good fight, holy Martyrs, after death also you shine out like beacons in the world; and so, as you have boldness, implore Christ to have mercy on our souls.
ltx/en_uk_lash/oc.m3.d4:ocMA.C1.acrostic.notice1	
ltx/en_uk_lash/oc.m3.d4:ocMA.C1.acrostic.text	
ltx/en_uk_lash/oc.m3.d4:ocMA.C1.acrostic.title	
ltx/en_uk_lash/oc.m3.d4:ocMA.C2.acrostic.notice1	
ltx/en_uk_lash/oc.m3.d4:ocMA.C2.acrostic.text	
ltx/en_uk_lash/oc.m3.d4:ocMA.C2.acrostic.title	
ltx/en_uk_lash/oc.m3.d4:ocMA.C2.poet	@ltx/en_uk_lash/poets:po.IoannouMonachou
ltx/en_uk_lash/oc.m3.d4:ocMA.Kathisma11.incipit	A Cross was fixed on…
ltx/en_uk_lash/oc.m3.d4:ocMA.Kathisma11.melody	
ltx/en_uk_lash/oc.m3.d4:ocMA.Kathisma11.mode	@ltx/en_uk_lash/miscellanea:misc.Mode3
ltx/en_uk_lash/oc.m3.d4:ocMA.Kathisma11.text	A Cross was fixed on earth and touched the heavens, not that the tree reached the heights, but you, who were on it, filled the universe. Lord, glory to you!
ltx/en_uk_lash/oc.m3.d4:ocMA.Kathisma12.incipit	You were lifted up, Lamb…
ltx/en_uk_lash/oc.m3.d4:ocMA.Kathisma12.melody	
ltx/en_uk_lash/oc.m3.d4:ocMA.Kathisma12.mode	@ltx/en_uk_lash/miscellanea:misc.Mode3
ltx/en_uk_lash/oc.m3.d4:ocMA.Kathisma12.text	You were lifted up, Lamb of God, on cypress, pine and cedar, that you might save those who worship in faith your voluntary Cruci-fixion. Christ our God, glory to you!
ltx/en_uk_lash/oc.m3.d4:ocMA.Kathisma13.incipit	Having gained the Cross of…
ltx/en_uk_lash/oc.m3.d4:ocMA.Kathisma13.melody	
ltx/en_uk_lash/oc.m3.d4:ocMA.Kathisma13.mode	@ltx/en_uk_lash/miscellanea:misc.Mode3
ltx/en_uk_lash/oc.m3.d4:ocMA.Kathisma13.text	Having gained the Cross of your Son, O Mother of God, as a rod of power, with it we shall cast down the ramparts of the foes as with love we ceaselessly magnify you.
ltx/en_uk_lash/oc.m3.d4:ocMA.Kathisma21.incipit	You were struck with blows…
ltx/en_uk_lash/oc.m3.d4:ocMA.Kathisma21.melody	
ltx/en_uk_lash/oc.m3.d4:ocMA.Kathisma21.mode	@ltx/en_uk_lash/miscellanea:misc.Mode3
ltx/en_uk_lash/oc.m3.d4:ocMA.Kathisma21.text	You were struck with blows for the sake of the human race and were not enraged; free our life from corruption, Lord, and save us.
ltx/en_uk_lash/oc.m3.d4:ocMA.Kathisma22.greekmelody	@ltx/en_uk_lash/he.a.m3:heAU.TinOraiotita.greekname
ltx/en_uk_lash/oc.m3.d4:ocMA.Kathisma22.incipit	The armies of the Angels…
ltx/en_uk_lash/oc.m3.d4:ocMA.Kathisma22.melody	@ltx/en_uk_lash/he.a.m3:heAU.TinOraiotita.notmetered
ltx/en_uk_lash/oc.m3.d4:ocMA.Kathisma22.mode	@ltx/en_uk_lash/miscellanea:misc.Mode3
ltx/en_uk_lash/oc.m3.d4:ocMA.Kathisma22.text	The armies of the Angels are amazed as they contemplate your measureless authority and your voluntary Crucifixion: How is He who cannot be looked at scourged in the flesh? He wishes to de-liver human nature from corruption, and so we cry out to you, Giver of life: Glory, O Christ, to your compassion!
ltx/en_uk_lash/oc.m3.d4:ocMA.Kathisma23.greekmelody	@ltx/en_uk_lash/he.a.m3:heAU.TinOraiotita.greekname
ltx/en_uk_lash/oc.m3.d4:ocMA.Kathisma23.incipit	Your pure Mother who knew…
ltx/en_uk_lash/oc.m3.d4:ocMA.Kathisma23.melody	@ltx/en_uk_lash/he.a.m3:heAU.TinOraiotita.notmetered
ltx/en_uk_lash/oc.m3.d4:ocMA.Kathisma23.mode	@ltx/en_uk_lash/miscellanea:misc.Mode3
ltx/en_uk_lash/oc.m3.d4:ocMA.Kathisma23.text	Your pure Mother who knew not wedlock, seeing you hanging dead upon the Tree, mourned as a mother and said, ''Is this how the lawless and ungrateful people of the Hebrews, who had the benefit of your many and great gifts, have repaid you, my Son? I hymn your divine condescension.''
ltx/en_uk_lash/oc.m3.d4:ocMA.Kathisma31.greekmelody	@ltx/en_uk_lash/he.a.m3:heAU.TinOraiotita.greekname
ltx/en_uk_lash/oc.m3.d4:ocMA.Kathisma31.incipit	Dishonoured you endured the Cross…
ltx/en_uk_lash/oc.m3.d4:ocMA.Kathisma31.melody	@ltx/en_uk_lash/he.a.m3:heAU.TinOraiotita.notmetered
ltx/en_uk_lash/oc.m3.d4:ocMA.Kathisma31.mode	@ltx/en_uk_lash/miscellanea:misc.Mode3
ltx/en_uk_lash/oc.m3.d4:ocMA.Kathisma31.text	Dishonoured you endured the Cross, O Master beyond all creation, that you might honour me, of old dreadfully dishonoured; with a lance you were pierced in your side, O Longsuffering, as you wished to ransom me, your fashioning, from corruption. I hymn your great compassion and your goodness, O Lover of humankind.
ltx/en_uk_lash/oc.m3.d4:ocMA.Kathisma32.greekmelody	@ltx/en_uk_lash/he.a.m3:heAU.TinOraiotita.greekname
ltx/en_uk_lash/oc.m3.d4:ocMA.Kathisma32.incipit	Armoured with the panoply of…
ltx/en_uk_lash/oc.m3.d4:ocMA.Kathisma32.melody	@ltx/en_uk_lash/he.a.m3:heAU.TinOraiotita.notmetered
ltx/en_uk_lash/oc.m3.d4:ocMA.Kathisma32.mode	@ltx/en_uk_lash/miscellanea:misc.Mode3
ltx/en_uk_lash/oc.m3.d4:ocMA.Kathisma32.text	Armoured with the panoply of Christ and clothed with the weapons of the Faith you stoutly cast down the battle lines of the foe; for eagerly, in hope of life, you endured all the threats and scourges of the tyrants; and so you have received the crowns, valiant Martyrs of Christ.
ltx/en_uk_lash/oc.m3.d4:ocMA.Kathisma33.greekmelody	@ltx/en_uk_lash/he.a.m3:heAU.TinOraiotita.greekname
ltx/en_uk_lash/oc.m3.d4:ocMA.Kathisma33.incipit	As your Mother, the pure…
ltx/en_uk_lash/oc.m3.d4:ocMA.Kathisma33.melody	@ltx/en_uk_lash/he.a.m3:heAU.TinOraiotita.notmetered
ltx/en_uk_lash/oc.m3.d4:ocMA.Kathisma33.mode	@ltx/en_uk_lash/miscellanea:misc.Mode3
ltx/en_uk_lash/oc.m3.d4:ocMA.Kathisma33.text	As your Mother, the pure and all blameless Virgin who knew not wedlock, saw you nailed to the Tree, O Master, she cried aloud to you, ''Alas, my sweetest Son, how has a lawless people condemned you, the Maker and Master of all, to the tree? I hymn your supreme goodness.
ltx/en_uk_lash/oc.m3.d4:ocMA.OdeW1C11.incipit	You ended painful passions, O…
ltx/en_uk_lash/oc.m3.d4:ocMA.OdeW1C11.melody	@ltx/en_uk_lash/he.h.m3:heHE.OTaYdata.name
ltx/en_uk_lash/oc.m3.d4:ocMA.OdeW1C11.mode	@ltx/en_uk_lash/miscellanea:misc.Mode3
ltx/en_uk_lash/oc.m3.d4:ocMA.OdeW1C11.ode	@ltx/en_uk_lash/miscellanea:misc.Ode1
ltx/en_uk_lash/oc.m3.d4:ocMA.OdeW1C11.text	You ended painful passions, O Word, by the passion of your precious flesh, and saved mortals, whom the opponent had wounded of old, mortals who venerate your incomprehensible dispensation.
ltx/en_uk_lash/oc.m3.d4:ocMA.OdeW1C12.incipit	He who by deception bound…
ltx/en_uk_lash/oc.m3.d4:ocMA.OdeW1C12.melody	@ltx/en_uk_lash/he.h.m3:heHE.OTaYdata.name
ltx/en_uk_lash/oc.m3.d4:ocMA.OdeW1C12.mode	@ltx/en_uk_lash/miscellanea:misc.Mode3
ltx/en_uk_lash/oc.m3.d4:ocMA.OdeW1C12.ode	@ltx/en_uk_lash/miscellanea:misc.Ode1
ltx/en_uk_lash/oc.m3.d4:ocMA.OdeW1C12.text	He who by deception bound mankind in Paradise by transgression of the commandment, has been bound, Lord, with the indissoluble bonds with which you were willingly bound in body, loosing our offence, O Lover of humankind.
ltx/en_uk_lash/oc.m3.d4:ocMA.OdeW1C13.incipit	The famed Champions, seeing creation…
ltx/en_uk_lash/oc.m3.d4:ocMA.OdeW1C13.melody	@ltx/en_uk_lash/he.h.m3:heHE.OTaYdata.name
ltx/en_uk_lash/oc.m3.d4:ocMA.OdeW1C13.mode	@ltx/en_uk_lash/miscellanea:misc.Mode3
ltx/en_uk_lash/oc.m3.d4:ocMA.OdeW1C13.ode	@ltx/en_uk_lash/miscellanea:misc.Ode1
ltx/en_uk_lash/oc.m3.d4:ocMA.OdeW1C13.text	The famed Champions, seeing creation being shipwrecked by the deceptions of the demons, appeared as fair havens, drowning all the power of the avenger in the red sea of their blood.
ltx/en_uk_lash/oc.m3.d4:ocMA.OdeW1C14.incipit	The choir of the Martyrs…
ltx/en_uk_lash/oc.m3.d4:ocMA.OdeW1C14.melody	@ltx/en_uk_lash/he.h.m3:heHE.OTaYdata.name
ltx/en_uk_lash/oc.m3.d4:ocMA.OdeW1C14.mode	@ltx/en_uk_lash/miscellanea:misc.Mode3
ltx/en_uk_lash/oc.m3.d4:ocMA.OdeW1C14.ode	@ltx/en_uk_lash/miscellanea:misc.Ode1
ltx/en_uk_lash/oc.m3.d4:ocMA.OdeW1C14.text	The choir of the Martyrs, clearly united with the choirs above, is ever surrounded by the rays of the uncreated Godhead, and shines on those on earth who with faith glorify their wonders.
ltx/en_uk_lash/oc.m3.d4:ocMA.OdeW1C1H.greekmelody	@ltx/en_uk_lash/he.h.m3:heHE.OTaYdata.greekname
ltx/en_uk_lash/oc.m3.d4:ocMA.OdeW1C1H.incipit	@ltx/en_uk_lash/he.h.m3:heHE.OTaYdata.incipit
ltx/en_uk_lash/oc.m3.d4:ocMA.OdeW1C1H.melody	@ltx/en_uk_lash/he.h.m3:heHE.OTaYdata.melody
ltx/en_uk_lash/oc.m3.d4:ocMA.OdeW1C1H.mode	@ltx/en_uk_lash/miscellanea:misc.Mode3
ltx/en_uk_lash/oc.m3.d4:ocMA.OdeW1C1H.ode	@ltx/en_uk_lash/miscellanea:misc.Ode1
ltx/en_uk_lash/oc.m3.d4:ocMA.OdeW1C1H.text	@ltx/en_uk_lash/he.h.m3:heHE.OTaYdata.text
ltx/en_uk_lash/oc.m3.d4:ocMA.OdeW1C1T.incipit	You appeared higher than the…
ltx/en_uk_lash/oc.m3.d4:ocMA.OdeW1C1T.melody	@ltx/en_uk_lash/he.h.m3:heHE.OTaYdata.name
ltx/en_uk_lash/oc.m3.d4:ocMA.OdeW1C1T.mode	@ltx/en_uk_lash/miscellanea:misc.Mode3
ltx/en_uk_lash/oc.m3.d4:ocMA.OdeW1C1T.ode	@ltx/en_uk_lash/miscellanea:misc.Ode1
ltx/en_uk_lash/oc.m3.d4:ocMA.OdeW1C1T.text	You appeared higher than the Hosts on high, O Immaculate, who bore God the Word on earth, who through his goodness by his Passion and Cross has made us mount to heaven.
ltx/en_uk_lash/oc.m3.d4:ocMA.OdeW1C21.greekmelody	@ltx/en_uk_lash/he.h.m3:heHE.OTaYdata.greekname
ltx/en_uk_lash/oc.m3.d4:ocMA.OdeW1C21.incipit	…
ltx/en_uk_lash/oc.m3.d4:ocMA.OdeW1C21.melody	@ltx/en_uk_lash/he.h.m3:heHE.OTaYdata.name
ltx/en_uk_lash/oc.m3.d4:ocMA.OdeW1C21.mode	@ltx/en_uk_lash/miscellanea:misc.Mode3
ltx/en_uk_lash/oc.m3.d4:ocMA.OdeW1C21.ode	@ltx/en_uk_lash/miscellanea:misc.Ode1
ltx/en_uk_lash/oc.m3.d4:ocMA.OdeW1C21.text	
ltx/en_uk_lash/oc.m3.d4:ocMA.OdeW1C22.incipit	With the sprinkling of the…
ltx/en_uk_lash/oc.m3.d4:ocMA.OdeW1C22.melody	@ltx/en_uk_lash/he.h.m3:heHE.OTaYdata.name
ltx/en_uk_lash/oc.m3.d4:ocMA.OdeW1C22.mode	@ltx/en_uk_lash/miscellanea:misc.Mode3
ltx/en_uk_lash/oc.m3.d4:ocMA.OdeW1C22.ode	@ltx/en_uk_lash/miscellanea:misc.Ode1
ltx/en_uk_lash/oc.m3.d4:ocMA.OdeW1C22.text	With the sprinkling of the divine stream which was emptied from the divine side of your Son, Pure Lady, wash the bruises of my heart, that I may magnify you and, as is fitting, glorify you as ever blest and all blameless.
ltx/en_uk_lash/oc.m3.d4:ocMA.OdeW1C23.incipit	You bore the Word, equal…
ltx/en_uk_lash/oc.m3.d4:ocMA.OdeW1C23.melody	@ltx/en_uk_lash/he.h.m3:heHE.OTaYdata.name
ltx/en_uk_lash/oc.m3.d4:ocMA.OdeW1C23.mode	@ltx/en_uk_lash/miscellanea:misc.Mode3
ltx/en_uk_lash/oc.m3.d4:ocMA.OdeW1C23.ode	@ltx/en_uk_lash/miscellanea:misc.Ode1
ltx/en_uk_lash/oc.m3.d4:ocMA.OdeW1C23.text	You bore the Word, equal in power to his Begetter and who makes the being of mortals divine; but ask him, O Pure One, to grant me, in despair and made weak by the wiles of the foe, divine consolation.
ltx/en_uk_lash/oc.m3.d4:ocMA.OdeW3C11.incipit	The people of the Hebrews…
ltx/en_uk_lash/oc.m3.d4:ocMA.OdeW3C11.melody	@ltx/en_uk_lash/he.h.m3:heHE.OEkMiOnton.name
ltx/en_uk_lash/oc.m3.d4:ocMA.OdeW3C11.mode	@ltx/en_uk_lash/miscellanea:misc.Mode3
ltx/en_uk_lash/oc.m3.d4:ocMA.OdeW3C11.ode	@ltx/en_uk_lash/miscellanea:misc.Ode3
ltx/en_uk_lash/oc.m3.d4:ocMA.OdeW3C11.text	The people of the Hebrews put you to death, who by the impassible nature of the Godhead became passible in the flesh through your goodness and make us immortal.
ltx/en_uk_lash/oc.m3.d4:ocMA.OdeW3C12.incipit	O Word, who hung the…
ltx/en_uk_lash/oc.m3.d4:ocMA.OdeW3C12.melody	@ltx/en_uk_lash/he.h.m3:heHE.OEkMiOnton.name
ltx/en_uk_lash/oc.m3.d4:ocMA.OdeW3C12.mode	@ltx/en_uk_lash/miscellanea:misc.Mode3
ltx/en_uk_lash/oc.m3.d4:ocMA.OdeW3C12.ode	@ltx/en_uk_lash/miscellanea:misc.Ode3
ltx/en_uk_lash/oc.m3.d4:ocMA.OdeW3C12.text	O Word, who hung the earth upon the waters, by your will you were hung upon a tree, leading me up to heavenly things who had fallen into the deeps of wickedness.
ltx/en_uk_lash/oc.m3.d4:ocMA.OdeW3C13.incipit	Embellished with the marks of…
ltx/en_uk_lash/oc.m3.d4:ocMA.OdeW3C13.melody	@ltx/en_uk_lash/he.h.m3:heHE.OEkMiOnton.name
ltx/en_uk_lash/oc.m3.d4:ocMA.OdeW3C13.mode	@ltx/en_uk_lash/miscellanea:misc.Mode3
ltx/en_uk_lash/oc.m3.d4:ocMA.OdeW3C13.ode	@ltx/en_uk_lash/miscellanea:misc.Ode3
ltx/en_uk_lash/oc.m3.d4:ocMA.OdeW3C13.text	Embellished with the marks of Christ, all praised Martyrs, you stand before the Lord, receiving from his rich hand your rewards.
ltx/en_uk_lash/oc.m3.d4:ocMA.OdeW3C14.incipit	With joyful soul the Saints…
ltx/en_uk_lash/oc.m3.d4:ocMA.OdeW3C14.melody	@ltx/en_uk_lash/he.h.m3:heHE.OEkMiOnton.name
ltx/en_uk_lash/oc.m3.d4:ocMA.OdeW3C14.mode	@ltx/en_uk_lash/miscellanea:misc.Mode3
ltx/en_uk_lash/oc.m3.d4:ocMA.OdeW3C14.ode	@ltx/en_uk_lash/miscellanea:misc.Ode3
ltx/en_uk_lash/oc.m3.d4:ocMA.OdeW3C14.text	With joyful soul the Saints ran towards torments, causing extreme grief to the dragon and joining the choirs of Angels.
ltx/en_uk_lash/oc.m3.d4:ocMA.OdeW3C1H.greekmelody	@ltx/en_uk_lash/he.h.m3:heHE.OEkMiOnton.greekname
ltx/en_uk_lash/oc.m3.d4:ocMA.OdeW3C1H.incipit	@ltx/en_uk_lash/he.h.m3:heHE.OEkMiOnton.incipit
ltx/en_uk_lash/oc.m3.d4:ocMA.OdeW3C1H.melody	@ltx/en_uk_lash/he.h.m3:heHE.OEkMiOnton.melody
ltx/en_uk_lash/oc.m3.d4:ocMA.OdeW3C1H.mode	@ltx/en_uk_lash/miscellanea:misc.Mode3
ltx/en_uk_lash/oc.m3.d4:ocMA.OdeW3C1H.ode	@ltx/en_uk_lash/miscellanea:misc.Ode3
ltx/en_uk_lash/oc.m3.d4:ocMA.OdeW3C1H.text	@ltx/en_uk_lash/he.h.m3:heHE.OEkMiOnton.text
ltx/en_uk_lash/oc.m3.d4:ocMA.OdeW3C1T.incipit	Bride who knew not wedlock…
ltx/en_uk_lash/oc.m3.d4:ocMA.OdeW3C1T.melody	@ltx/en_uk_lash/he.h.m3:heHE.OEkMiOnton.name
ltx/en_uk_lash/oc.m3.d4:ocMA.OdeW3C1T.mode	@ltx/en_uk_lash/miscellanea:misc.Mode3
ltx/en_uk_lash/oc.m3.d4:ocMA.OdeW3C1T.ode	@ltx/en_uk_lash/miscellanea:misc.Ode3
ltx/en_uk_lash/oc.m3.d4:ocMA.OdeW3C1T.text	Bride who knew not wedlock, seeing Christ suspended on the Cross, grieving you said, ''You have set, O Sun of glory, from my sight, enlightening those in darkness.''
ltx/en_uk_lash/oc.m3.d4:ocMA.OdeW3C21.greekmelody	@ltx/en_uk_lash/he.h.m3:heHE.OEkMiOnton.greekname
ltx/en_uk_lash/oc.m3.d4:ocMA.OdeW3C21.incipit	All-holy, you are merciful, ask…
ltx/en_uk_lash/oc.m3.d4:ocMA.OdeW3C21.melody	@ltx/en_uk_lash/he.h.m3:heHE.OEkMiOnton.name
ltx/en_uk_lash/oc.m3.d4:ocMA.OdeW3C21.mode	@ltx/en_uk_lash/miscellanea:misc.Mode3
ltx/en_uk_lash/oc.m3.d4:ocMA.OdeW3C21.ode	@ltx/en_uk_lash/miscellanea:misc.Ode3
ltx/en_uk_lash/oc.m3.d4:ocMA.OdeW3C21.text	All-holy, you are merciful, ask him who is rich in ineffable mercy and pity to take on us who are afflicted.
ltx/en_uk_lash/oc.m3.d4:ocMA.OdeW3C22.incipit	You, the dwelling of the…
ltx/en_uk_lash/oc.m3.d4:ocMA.OdeW3C22.melody	@ltx/en_uk_lash/he.h.m3:heHE.OEkMiOnton.name
ltx/en_uk_lash/oc.m3.d4:ocMA.OdeW3C22.mode	@ltx/en_uk_lash/miscellanea:misc.Mode3
ltx/en_uk_lash/oc.m3.d4:ocMA.OdeW3C22.ode	@ltx/en_uk_lash/miscellanea:misc.Ode3
ltx/en_uk_lash/oc.m3.d4:ocMA.OdeW3C22.text	You, the dwelling of the Maker of all, implore that the Advocate may dwell in me who have become a den of soul destroying thieves, pure Virgin.
ltx/en_uk_lash/oc.m3.d4:ocMA.OdeW3C23.incipit	Mother of God, as you…
ltx/en_uk_lash/oc.m3.d4:ocMA.OdeW3C23.melody	@ltx/en_uk_lash/he.h.m3:heHE.OEkMiOnton.name
ltx/en_uk_lash/oc.m3.d4:ocMA.OdeW3C23.mode	@ltx/en_uk_lash/miscellanea:misc.Mode3
ltx/en_uk_lash/oc.m3.d4:ocMA.OdeW3C23.ode	@ltx/en_uk_lash/miscellanea:misc.Ode3
ltx/en_uk_lash/oc.m3.d4:ocMA.OdeW3C23.text	Mother of God, as you bear in your embrace him who bears all things by his divine inclination, incline to me and deliver me from my foul inclination to the passions.
ltx/en_uk_lash/oc.m3.d4:ocMA.OdeW4C11.incipit	O Master Christ, who are…
ltx/en_uk_lash/oc.m3.d4:ocMA.OdeW4C11.melody	@ltx/en_uk_lash/he.h.m3:heHE.EthouProsImas.name
ltx/en_uk_lash/oc.m3.d4:ocMA.OdeW4C11.mode	@ltx/en_uk_lash/miscellanea:misc.Mode3
ltx/en_uk_lash/oc.m3.d4:ocMA.OdeW4C11.ode	@ltx/en_uk_lash/miscellanea:misc.Ode4
ltx/en_uk_lash/oc.m3.d4:ocMA.OdeW4C11.text	O Master Christ, who are above all honour, truly you endured outrage, being struck on the head with a reed, that you might honour me who had become dishonoured through transgression, O Lover of humankind.
ltx/en_uk_lash/oc.m3.d4:ocMA.OdeW4C12.incipit	Willingly you were bound with…
ltx/en_uk_lash/oc.m3.d4:ocMA.OdeW4C12.melody	@ltx/en_uk_lash/he.h.m3:heHE.EthouProsImas.name
ltx/en_uk_lash/oc.m3.d4:ocMA.OdeW4C12.mode	@ltx/en_uk_lash/miscellanea:misc.Mode3
ltx/en_uk_lash/oc.m3.d4:ocMA.OdeW4C12.ode	@ltx/en_uk_lash/miscellanea:misc.Ode4
ltx/en_uk_lash/oc.m3.d4:ocMA.OdeW4C12.text	Willingly you were bound with a crown of thorns, O Longsuffering, as true King, and you put an end to thorn-bearing sin by the roots; I confess your sufferings, O Saviour.
ltx/en_uk_lash/oc.m3.d4:ocMA.OdeW4C13.incipit	You remained unbroken by the…
ltx/en_uk_lash/oc.m3.d4:ocMA.OdeW4C13.melody	@ltx/en_uk_lash/he.h.m3:heHE.EthouProsImas.name
ltx/en_uk_lash/oc.m3.d4:ocMA.OdeW4C13.mode	@ltx/en_uk_lash/miscellanea:misc.Mode3
ltx/en_uk_lash/oc.m3.d4:ocMA.OdeW4C13.ode	@ltx/en_uk_lash/miscellanea:misc.Ode4
ltx/en_uk_lash/oc.m3.d4:ocMA.OdeW4C13.text	You remained unbroken by the pains of torments, O Martyrs, breaking the deception of the foe and placing him beneath your feet as he boasted wildly and expired completely from lack of breath.
ltx/en_uk_lash/oc.m3.d4:ocMA.OdeW4C14.incipit	Incorruptible bodies you gained divine…
ltx/en_uk_lash/oc.m3.d4:ocMA.OdeW4C14.melody	@ltx/en_uk_lash/he.h.m3:heHE.EthouProsImas.name
ltx/en_uk_lash/oc.m3.d4:ocMA.OdeW4C14.mode	@ltx/en_uk_lash/miscellanea:misc.Mode3
ltx/en_uk_lash/oc.m3.d4:ocMA.OdeW4C14.ode	@ltx/en_uk_lash/miscellanea:misc.Ode4
ltx/en_uk_lash/oc.m3.d4:ocMA.OdeW4C14.text	Incorruptible bodies you gained divine incorruption, stoutly imitating by your sufferings the Passion of the Impassible, all praised Martyrs, numbered with all the Bodiless Powers.
ltx/en_uk_lash/oc.m3.d4:ocMA.OdeW4C1H.greekmelody	@ltx/en_uk_lash/he.h.m3:heHE.EthouProsImas.greekname
ltx/en_uk_lash/oc.m3.d4:ocMA.OdeW4C1H.incipit	@ltx/en_uk_lash/he.h.m3:heHE.EthouProsImas.incipit
ltx/en_uk_lash/oc.m3.d4:ocMA.OdeW4C1H.melody	@ltx/en_uk_lash/he.h.m3:heHE.EthouProsImas.melody
ltx/en_uk_lash/oc.m3.d4:ocMA.OdeW4C1H.mode	@ltx/en_uk_lash/miscellanea:misc.Mode3
ltx/en_uk_lash/oc.m3.d4:ocMA.OdeW4C1H.ode	@ltx/en_uk_lash/miscellanea:misc.Ode4
ltx/en_uk_lash/oc.m3.d4:ocMA.OdeW4C1H.text	@ltx/en_uk_lash/he.h.m3:heHE.EthouProsImas.text
ltx/en_uk_lash/oc.m3.d4:ocMA.OdeW4C1T.incipit	The Prophet once saw you…
ltx/en_uk_lash/oc.m3.d4:ocMA.OdeW4C1T.melody	@ltx/en_uk_lash/he.h.m3:heHE.EthouProsImas.name
ltx/en_uk_lash/oc.m3.d4:ocMA.OdeW4C1T.mode	@ltx/en_uk_lash/miscellanea:misc.Mode3
ltx/en_uk_lash/oc.m3.d4:ocMA.OdeW4C1T.ode	@ltx/en_uk_lash/miscellanea:misc.Ode4
ltx/en_uk_lash/oc.m3.d4:ocMA.OdeW4C1T.text	The Prophet once saw you, O Maiden, as a book in which the Word incarnate was inscribed by the finger of the Father, and with a lance he tears up the record of the Forefather, O Immaculate.
ltx/en_uk_lash/oc.m3.d4:ocMA.OdeW4C21.greekmelody	@ltx/en_uk_lash/he.h.m3:heHE.EthouProsImas.greekname
ltx/en_uk_lash/oc.m3.d4:ocMA.OdeW4C21.incipit	As you willingly endured bruises…
ltx/en_uk_lash/oc.m3.d4:ocMA.OdeW4C21.melody	@ltx/en_uk_lash/he.h.m3:heHE.EthouProsImas.name
ltx/en_uk_lash/oc.m3.d4:ocMA.OdeW4C21.mode	@ltx/en_uk_lash/miscellanea:misc.Mode3
ltx/en_uk_lash/oc.m3.d4:ocMA.OdeW4C21.ode	@ltx/en_uk_lash/miscellanea:misc.Ode4
ltx/en_uk_lash/oc.m3.d4:ocMA.OdeW4C21.text	As you willingly endured bruises and slaughter, O Christ, heal my soul bruised by the thieving malice of demons, at the intercessions of her who bore you, O Most Merciful.
ltx/en_uk_lash/oc.m3.d4:ocMA.OdeW4C22.incipit	I am the work and…
ltx/en_uk_lash/oc.m3.d4:ocMA.OdeW4C22.melody	@ltx/en_uk_lash/he.h.m3:heHE.EthouProsImas.name
ltx/en_uk_lash/oc.m3.d4:ocMA.OdeW4C22.mode	@ltx/en_uk_lash/miscellanea:misc.Mode3
ltx/en_uk_lash/oc.m3.d4:ocMA.OdeW4C22.ode	@ltx/en_uk_lash/miscellanea:misc.Ode4
ltx/en_uk_lash/oc.m3.d4:ocMA.OdeW4C22.text	I am the work and creation of your hands, O Creator, but by the wickedness of the serpent I have been smashed by the pleasures of life, O Christ; and so refashion me at the entreaties of her who bore you.
ltx/en_uk_lash/oc.m3.d4:ocMA.OdeW4C23.incipit	Beyond reason you gave birth…
ltx/en_uk_lash/oc.m3.d4:ocMA.OdeW4C23.melody	@ltx/en_uk_lash/he.h.m3:heHE.EthouProsImas.name
ltx/en_uk_lash/oc.m3.d4:ocMA.OdeW4C23.mode	@ltx/en_uk_lash/miscellanea:misc.Mode3
ltx/en_uk_lash/oc.m3.d4:ocMA.OdeW4C23.ode	@ltx/en_uk_lash/miscellanea:misc.Ode4
ltx/en_uk_lash/oc.m3.d4:ocMA.OdeW4C23.text	Beyond reason you gave birth to the Word of the Father who loosed mortals from all unreason; earnestly entreat him to free me, who am enslaved to irrational passions, O only Ever-Virgin.
ltx/en_uk_lash/oc.m3.d4:ocMA.OdeW4C24.incipit	At every moment you pour…
ltx/en_uk_lash/oc.m3.d4:ocMA.OdeW4C24.melody	@ltx/en_uk_lash/he.h.m3:heHE.EthouProsImas.name
ltx/en_uk_lash/oc.m3.d4:ocMA.OdeW4C24.mode	@ltx/en_uk_lash/miscellanea:misc.Mode3
ltx/en_uk_lash/oc.m3.d4:ocMA.OdeW4C24.ode	@ltx/en_uk_lash/miscellanea:misc.Ode4
ltx/en_uk_lash/oc.m3.d4:ocMA.OdeW4C24.text	At every moment you pour healing from your hand, who are wholly the tabernacle of sanctification, wholly filled with light, wholly letting fall drops of the myrrh of sweet fragrance, All-pure Bride of God.
ltx/en_uk_lash/oc.m3.d4:ocMA.OdeW5C11.incipit	Like a lamb you were…
ltx/en_uk_lash/oc.m3.d4:ocMA.OdeW5C11.melody	@ltx/en_uk_lash/he.h.m3:heHE.EpiTisGis.name
ltx/en_uk_lash/oc.m3.d4:ocMA.OdeW5C11.mode	@ltx/en_uk_lash/miscellanea:misc.Mode3
ltx/en_uk_lash/oc.m3.d4:ocMA.OdeW5C11.ode	@ltx/en_uk_lash/miscellanea:misc.Ode5
ltx/en_uk_lash/oc.m3.d4:ocMA.OdeW5C11.text	Like a lamb you were suspended on a tree and were offered as a sacrifice to the Father for our sake, O Good One, and you brought to an end the sacrifices of idols, O All-powerful.
ltx/en_uk_lash/oc.m3.d4:ocMA.OdeW5C12.incipit	Pierced in the side by…
ltx/en_uk_lash/oc.m3.d4:ocMA.OdeW5C12.melody	@ltx/en_uk_lash/he.h.m3:heHE.EpiTisGis.name
ltx/en_uk_lash/oc.m3.d4:ocMA.OdeW5C12.mode	@ltx/en_uk_lash/miscellanea:misc.Mode3
ltx/en_uk_lash/oc.m3.d4:ocMA.OdeW5C12.ode	@ltx/en_uk_lash/miscellanea:misc.Ode5
ltx/en_uk_lash/oc.m3.d4:ocMA.OdeW5C12.text	Pierced in the side by the lance, O Giver of Life, you poured out two streams of salvation for those who proclaim you as one of the Trinity, who bear two modes of action.
ltx/en_uk_lash/oc.m3.d4:ocMA.OdeW5C13.incipit	The doughty Champions found you…
ltx/en_uk_lash/oc.m3.d4:ocMA.OdeW5C13.melody	@ltx/en_uk_lash/he.h.m3:heHE.EpiTisGis.name
ltx/en_uk_lash/oc.m3.d4:ocMA.OdeW5C13.mode	@ltx/en_uk_lash/miscellanea:misc.Mode3
ltx/en_uk_lash/oc.m3.d4:ocMA.OdeW5C13.ode	@ltx/en_uk_lash/miscellanea:misc.Ode5
ltx/en_uk_lash/oc.m3.d4:ocMA.OdeW5C13.text	The doughty Champions found you by faith, O Jesus, as a firm foundation and unshakeable rock and on which they built themselves as precious stones.
ltx/en_uk_lash/oc.m3.d4:ocMA.OdeW5C14.incipit	Empowered by faith with the…
ltx/en_uk_lash/oc.m3.d4:ocMA.OdeW5C14.melody	@ltx/en_uk_lash/he.h.m3:heHE.EpiTisGis.name
ltx/en_uk_lash/oc.m3.d4:ocMA.OdeW5C14.mode	@ltx/en_uk_lash/miscellanea:misc.Mode3
ltx/en_uk_lash/oc.m3.d4:ocMA.OdeW5C14.ode	@ltx/en_uk_lash/miscellanea:misc.Ode5
ltx/en_uk_lash/oc.m3.d4:ocMA.OdeW5C14.text	Empowered by faith with the strength of God, O Martyrs, like champions you overthrew all the power of the deceiver and were radiantly crowned.
ltx/en_uk_lash/oc.m3.d4:ocMA.OdeW5C1H.greekmelody	@ltx/en_uk_lash/he.h.m3:heHE.EpiTisGis.greekname
ltx/en_uk_lash/oc.m3.d4:ocMA.OdeW5C1H.incipit	@ltx/en_uk_lash/he.h.m3:heHE.EpiTisGis.incipit
ltx/en_uk_lash/oc.m3.d4:ocMA.OdeW5C1H.melody	@ltx/en_uk_lash/he.h.m3:heHE.EpiTisGis.melody
ltx/en_uk_lash/oc.m3.d4:ocMA.OdeW5C1H.mode	@ltx/en_uk_lash/miscellanea:misc.Mode3
ltx/en_uk_lash/oc.m3.d4:ocMA.OdeW5C1H.ode	@ltx/en_uk_lash/miscellanea:misc.Ode5
ltx/en_uk_lash/oc.m3.d4:ocMA.OdeW5C1H.text	@ltx/en_uk_lash/he.h.m3:heHE.EpiTisGis.text
ltx/en_uk_lash/oc.m3.d4:ocMA.OdeW5C1T.incipit	Our nature which before had…
ltx/en_uk_lash/oc.m3.d4:ocMA.OdeW5C1T.melody	@ltx/en_uk_lash/he.h.m3:heHE.EpiTisGis.name
ltx/en_uk_lash/oc.m3.d4:ocMA.OdeW5C1T.mode	@ltx/en_uk_lash/miscellanea:misc.Mode3
ltx/en_uk_lash/oc.m3.d4:ocMA.OdeW5C1T.ode	@ltx/en_uk_lash/miscellanea:misc.Ode5
ltx/en_uk_lash/oc.m3.d4:ocMA.OdeW5C1T.text	Our nature which before had changed through transgression you, All-holy Lady, protection of our souls, as she who without change bore Christ, have refashioned.
ltx/en_uk_lash/oc.m3.d4:ocMA.OdeW5C21.greekmelody	@ltx/en_uk_lash/he.h.m3:heHE.OsEidenIsaias.greekname
ltx/en_uk_lash/oc.m3.d4:ocMA.OdeW5C21.incipit	Transform the pains of my…
ltx/en_uk_lash/oc.m3.d4:ocMA.OdeW5C21.melody	@ltx/en_uk_lash/he.h.m3:heHE.OsEidenIsaias.name
ltx/en_uk_lash/oc.m3.d4:ocMA.OdeW5C21.mode	@ltx/en_uk_lash/miscellanea:misc.Mode3
ltx/en_uk_lash/oc.m3.d4:ocMA.OdeW5C21.ode	@ltx/en_uk_lash/miscellanea:misc.Ode5
ltx/en_uk_lash/oc.m3.d4:ocMA.OdeW5C21.text	Transform the pains of my flesh and the toil of my soul, and dispel the clouds of sloth, O Virgin, cloud of light, and give health in exchange for troubles to me who ask and glorify you with love.
ltx/en_uk_lash/oc.m3.d4:ocMA.OdeW5C22.incipit	I who am full of…
ltx/en_uk_lash/oc.m3.d4:ocMA.OdeW5C22.melody	@ltx/en_uk_lash/he.h.m3:heHE.OsEidenIsaias.name
ltx/en_uk_lash/oc.m3.d4:ocMA.OdeW5C22.mode	@ltx/en_uk_lash/miscellanea:misc.Mode3
ltx/en_uk_lash/oc.m3.d4:ocMA.OdeW5C22.ode	@ltx/en_uk_lash/miscellanea:misc.Ode5
ltx/en_uk_lash/oc.m3.d4:ocMA.OdeW5C22.text	I who am full of every sin put you forward as mediator and advocate with him who was born of you; O Virgin be at my side and be the righter of my life, leading me by the hand to the paths of knowledge of God.
ltx/en_uk_lash/oc.m3.d4:ocMA.OdeW5C23.incipit	Sanctify my mind and lead…
ltx/en_uk_lash/oc.m3.d4:ocMA.OdeW5C23.melody	@ltx/en_uk_lash/he.h.m3:heHE.OsEidenIsaias.name
ltx/en_uk_lash/oc.m3.d4:ocMA.OdeW5C23.mode	@ltx/en_uk_lash/miscellanea:misc.Mode3
ltx/en_uk_lash/oc.m3.d4:ocMA.OdeW5C23.ode	@ltx/en_uk_lash/miscellanea:misc.Ode5
ltx/en_uk_lash/oc.m3.d4:ocMA.OdeW5C23.text	Sanctify my mind and lead my soul to light, O Virgin, and make me a partaker of divine glory; for see, I am filled with evils and have become enslaved to every kind of pleasure, and I bring forward a sullied conscience.
ltx/en_uk_lash/oc.m3.d4:ocMA.OdeW6C11.incipit	The trickster serpent led me…
ltx/en_uk_lash/oc.m3.d4:ocMA.OdeW6C11.melody	@ltx/en_uk_lash/he.h.m3:heHE.AvyssosEschati.name
ltx/en_uk_lash/oc.m3.d4:ocMA.OdeW6C11.mode	@ltx/en_uk_lash/miscellanea:misc.Mode3
ltx/en_uk_lash/oc.m3.d4:ocMA.OdeW6C11.ode	@ltx/en_uk_lash/miscellanea:misc.Ode6
ltx/en_uk_lash/oc.m3.d4:ocMA.OdeW6C11.text	The trickster serpent led me out of Eden, tricking me with a trick of eating; but Christ, suspended on a tree by his own will, gives me back the ancient entry.
ltx/en_uk_lash/oc.m3.d4:ocMA.OdeW6C12.incipit	The one who wounded us…
ltx/en_uk_lash/oc.m3.d4:ocMA.OdeW6C12.melody	@ltx/en_uk_lash/he.h.m3:heHE.AvyssosEschati.name
ltx/en_uk_lash/oc.m3.d4:ocMA.OdeW6C12.mode	@ltx/en_uk_lash/miscellanea:misc.Mode3
ltx/en_uk_lash/oc.m3.d4:ocMA.OdeW6C12.ode	@ltx/en_uk_lash/miscellanea:misc.Ode6
ltx/en_uk_lash/oc.m3.d4:ocMA.OdeW6C12.text	The one who wounded us has been wounded by your wounded side, and remains incurable, O Lord our Benefactor; but we the faithful have been cured by the bruises with which you were willingly wounded.
ltx/en_uk_lash/oc.m3.d4:ocMA.OdeW6C13.incipit	You appeared as wise in…
ltx/en_uk_lash/oc.m3.d4:ocMA.OdeW6C13.melody	@ltx/en_uk_lash/he.h.m3:heHE.AvyssosEschati.name
ltx/en_uk_lash/oc.m3.d4:ocMA.OdeW6C13.mode	@ltx/en_uk_lash/miscellanea:misc.Mode3
ltx/en_uk_lash/oc.m3.d4:ocMA.OdeW6C13.ode	@ltx/en_uk_lash/miscellanea:misc.Ode6
ltx/en_uk_lash/oc.m3.d4:ocMA.OdeW6C13.text	You appeared as wise in the midst of fire, Foot Soldiers of Christ, roasted like lambs and served on the table of God the universal sovereign, and inheriting ineffable gladness.
ltx/en_uk_lash/oc.m3.d4:ocMA.OdeW6C14.incipit	Drawing from inexhaustible treasuries, distribute…
ltx/en_uk_lash/oc.m3.d4:ocMA.OdeW6C14.melody	@ltx/en_uk_lash/he.h.m3:heHE.AvyssosEschati.name
ltx/en_uk_lash/oc.m3.d4:ocMA.OdeW6C14.mode	@ltx/en_uk_lash/miscellanea:misc.Mode3
ltx/en_uk_lash/oc.m3.d4:ocMA.OdeW6C14.ode	@ltx/en_uk_lash/miscellanea:misc.Ode6
ltx/en_uk_lash/oc.m3.d4:ocMA.OdeW6C14.text	Drawing from inexhaustible treasuries, distribute rivers of healings and dry up the experience of the passions and water the gatherings of the faithful.
ltx/en_uk_lash/oc.m3.d4:ocMA.OdeW6C1H.greekmelody	@ltx/en_uk_lash/he.h.m3:heHE.AvyssosEschati.greekname
ltx/en_uk_lash/oc.m3.d4:ocMA.OdeW6C1H.incipit	@ltx/en_uk_lash/he.h.m3:heHE.AvyssosEschati.incipit
ltx/en_uk_lash/oc.m3.d4:ocMA.OdeW6C1H.melody	@ltx/en_uk_lash/he.h.m3:heHE.AvyssosEschati.melody
ltx/en_uk_lash/oc.m3.d4:ocMA.OdeW6C1H.mode	@ltx/en_uk_lash/miscellanea:misc.Mode3
ltx/en_uk_lash/oc.m3.d4:ocMA.OdeW6C1H.ode	@ltx/en_uk_lash/miscellanea:misc.Ode6
ltx/en_uk_lash/oc.m3.d4:ocMA.OdeW6C1H.text	@ltx/en_uk_lash/he.h.m3:heHE.AvyssosEschati.text
ltx/en_uk_lash/oc.m3.d4:ocMA.OdeW6C1T.incipit	Seeing the death of the…
ltx/en_uk_lash/oc.m3.d4:ocMA.OdeW6C1T.melody	@ltx/en_uk_lash/he.h.m3:heHE.AvyssosEschati.name
ltx/en_uk_lash/oc.m3.d4:ocMA.OdeW6C1T.mode	@ltx/en_uk_lash/miscellanea:misc.Mode3
ltx/en_uk_lash/oc.m3.d4:ocMA.OdeW6C1T.ode	@ltx/en_uk_lash/miscellanea:misc.Ode6
ltx/en_uk_lash/oc.m3.d4:ocMA.OdeW6C1T.text	Seeing the death of the Word who became incarnate of your blood, All-Blameless, you bewailed him as a mother and magnified him as the cause of life, O Lady, Virgin-Mother.
ltx/en_uk_lash/oc.m3.d4:ocMA.OdeW6C21.greekmelody	@ltx/en_uk_lash/he.h.m3:heHE.TousEisTaTeli.greekname
ltx/en_uk_lash/oc.m3.d4:ocMA.OdeW6C21.incipit	I have exceeded the puffed…
ltx/en_uk_lash/oc.m3.d4:ocMA.OdeW6C21.melody	@ltx/en_uk_lash/he.h.m3:heHE.TousEisTaTeli.name
ltx/en_uk_lash/oc.m3.d4:ocMA.OdeW6C21.mode	@ltx/en_uk_lash/miscellanea:misc.Mode3
ltx/en_uk_lash/oc.m3.d4:ocMA.OdeW6C21.ode	@ltx/en_uk_lash/miscellanea:misc.Ode6
ltx/en_uk_lash/oc.m3.d4:ocMA.OdeW6C21.text	I have exceeded the puffed up mind of the Pharisee, ever giving myself airs and plunging into the deeps of unnumbered falls; O only pure one, take pity on me who have been terribly humbled.
ltx/en_uk_lash/oc.m3.d4:ocMA.OdeW6C22.incipit	Your conceiving and your giving…
ltx/en_uk_lash/oc.m3.d4:ocMA.OdeW6C22.melody	@ltx/en_uk_lash/he.h.m3:heHE.TousEisTaTeli.name
ltx/en_uk_lash/oc.m3.d4:ocMA.OdeW6C22.mode	@ltx/en_uk_lash/miscellanea:misc.Mode3
ltx/en_uk_lash/oc.m3.d4:ocMA.OdeW6C22.ode	@ltx/en_uk_lash/miscellanea:misc.Ode6
ltx/en_uk_lash/oc.m3.d4:ocMA.OdeW6C22.text	Your conceiving and your giving birth were beyond wonder. Now show me in my wretchedness the wonder of your mercies; for in lawlessness conceived and born, I have become enslaved to pleasures.
ltx/en_uk_lash/oc.m3.d4:ocMA.OdeW6C23.incipit	I lament and weep and…
ltx/en_uk_lash/oc.m3.d4:ocMA.OdeW6C23.melody	@ltx/en_uk_lash/he.h.m3:heHE.TousEisTaTeli.name
ltx/en_uk_lash/oc.m3.d4:ocMA.OdeW6C23.mode	@ltx/en_uk_lash/miscellanea:misc.Mode3
ltx/en_uk_lash/oc.m3.d4:ocMA.OdeW6C23.ode	@ltx/en_uk_lash/miscellanea:misc.Ode6
ltx/en_uk_lash/oc.m3.d4:ocMA.OdeW6C23.text	I lament and weep and mourn whenever I consider that dread judgement seat; for I have acquired evil deeds; Virgin Mother of God, who knew not man, stand up for me in that fearful hour.
ltx/en_uk_lash/oc.m3.d4:ocMA.OdeW7C11.incipit	By your toils you ended…
ltx/en_uk_lash/oc.m3.d4:ocMA.OdeW7C11.melody	@ltx/en_uk_lash/he.h.m3:heHE.ToPrinEikoni.name
ltx/en_uk_lash/oc.m3.d4:ocMA.OdeW7C11.mode	@ltx/en_uk_lash/miscellanea:misc.Mode3
ltx/en_uk_lash/oc.m3.d4:ocMA.OdeW7C11.ode	@ltx/en_uk_lash/miscellanea:misc.Ode7
ltx/en_uk_lash/oc.m3.d4:ocMA.OdeW7C11.text	By your toils you ended our toils, Lover of humankind; so now take over to a life without toil those who devoutly worship your holy sufferings, O God of all.
ltx/en_uk_lash/oc.m3.d4:ocMA.OdeW7C12.incipit	When creation saw you crucified…
ltx/en_uk_lash/oc.m3.d4:ocMA.OdeW7C12.melody	@ltx/en_uk_lash/he.h.m3:heHE.ToPrinEikoni.name
ltx/en_uk_lash/oc.m3.d4:ocMA.OdeW7C12.mode	@ltx/en_uk_lash/miscellanea:misc.Mode3
ltx/en_uk_lash/oc.m3.d4:ocMA.OdeW7C12.ode	@ltx/en_uk_lash/miscellanea:misc.Ode7
ltx/en_uk_lash/oc.m3.d4:ocMA.OdeW7C12.text	When creation saw you crucified it was altered and trembled: earth was shaken, rocks were rent and the sun''s course drew away the light.
ltx/en_uk_lash/oc.m3.d4:ocMA.OdeW7C13.incipit	Obedient to the laws of…
ltx/en_uk_lash/oc.m3.d4:ocMA.OdeW7C13.melody	@ltx/en_uk_lash/he.h.m3:heHE.ToPrinEikoni.name
ltx/en_uk_lash/oc.m3.d4:ocMA.OdeW7C13.mode	@ltx/en_uk_lash/miscellanea:misc.Mode3
ltx/en_uk_lash/oc.m3.d4:ocMA.OdeW7C13.ode	@ltx/en_uk_lash/miscellanea:misc.Ode7
ltx/en_uk_lash/oc.m3.d4:ocMA.OdeW7C13.text	Obedient to the laws of Christ the Martyrs laid low the flatteries of the lawless and lawfully in the midst of the stadium they struggled and were gloriously crowned.
ltx/en_uk_lash/oc.m3.d4:ocMA.OdeW7C14.incipit	You were not burnt up…
ltx/en_uk_lash/oc.m3.d4:ocMA.OdeW7C14.melody	@ltx/en_uk_lash/he.h.m3:heHE.ToPrinEikoni.name
ltx/en_uk_lash/oc.m3.d4:ocMA.OdeW7C14.mode	@ltx/en_uk_lash/miscellanea:misc.Mode3
ltx/en_uk_lash/oc.m3.d4:ocMA.OdeW7C14.ode	@ltx/en_uk_lash/miscellanea:misc.Ode7
ltx/en_uk_lash/oc.m3.d4:ocMA.OdeW7C14.text	You were not burnt up by the flame of fire but obtained a more fervent purpose, champions of Christ, and bearing crowns you cried: O God, blessed are you!
ltx/en_uk_lash/oc.m3.d4:ocMA.OdeW7C1H.greekmelody	@ltx/en_uk_lash/he.h.m3:heHE.ToPrinEikoni.greekname
ltx/en_uk_lash/oc.m3.d4:ocMA.OdeW7C1H.incipit	@ltx/en_uk_lash/he.h.m3:heHE.ToPrinEikoni.incipit
ltx/en_uk_lash/oc.m3.d4:ocMA.OdeW7C1H.melody	@ltx/en_uk_lash/he.h.m3:heHE.ToPrinEikoni.melody
ltx/en_uk_lash/oc.m3.d4:ocMA.OdeW7C1H.mode	@ltx/en_uk_lash/miscellanea:misc.Mode3
ltx/en_uk_lash/oc.m3.d4:ocMA.OdeW7C1H.ode	@ltx/en_uk_lash/miscellanea:misc.Ode7
ltx/en_uk_lash/oc.m3.d4:ocMA.OdeW7C1H.text	@ltx/en_uk_lash/he.h.m3:heHE.ToPrinEikoni.text
ltx/en_uk_lash/oc.m3.d4:ocMA.OdeW7C1T.incipit	You stood watching Christ, whom…
ltx/en_uk_lash/oc.m3.d4:ocMA.OdeW7C1T.melody	@ltx/en_uk_lash/he.h.m3:heHE.ToPrinEikoni.name
ltx/en_uk_lash/oc.m3.d4:ocMA.OdeW7C1T.mode	@ltx/en_uk_lash/miscellanea:misc.Mode3
ltx/en_uk_lash/oc.m3.d4:ocMA.OdeW7C1T.ode	@ltx/en_uk_lash/miscellanea:misc.Ode7
ltx/en_uk_lash/oc.m3.d4:ocMA.OdeW7C1T.text	You stood watching Christ, whom you had borne, lifted up on the Cross, O Immaculate, and you cried: Do not make me childless, whom you preserved pure‚ even after childbirth.
ltx/en_uk_lash/oc.m3.d4:ocMA.OdeW7C21.greekmelody	@ltx/en_uk_lash/he.h.m3:heHE.TreisPaidesEnKamino.greekname
ltx/en_uk_lash/oc.m3.d4:ocMA.OdeW7C21.incipit	There is no salvation for…
ltx/en_uk_lash/oc.m3.d4:ocMA.OdeW7C21.melody	@ltx/en_uk_lash/he.h.m3:heHE.TreisPaidesEnKamino.name
ltx/en_uk_lash/oc.m3.d4:ocMA.OdeW7C21.mode	@ltx/en_uk_lash/miscellanea:misc.Mode3
ltx/en_uk_lash/oc.m3.d4:ocMA.OdeW7C21.ode	@ltx/en_uk_lash/miscellanea:misc.Ode7
ltx/en_uk_lash/oc.m3.d4:ocMA.OdeW7C21.text	There is no salvation for me from my works, Sovereign Lady, for I have added sins to sins and wickedness to wickedness; by your prayer then, pure Virgin, take pity and save me.
ltx/en_uk_lash/oc.m3.d4:ocMA.OdeW7C22.incipit	The judgement is at the…
ltx/en_uk_lash/oc.m3.d4:ocMA.OdeW7C22.melody	@ltx/en_uk_lash/he.h.m3:heHE.TreisPaidesEnKamino.name
ltx/en_uk_lash/oc.m3.d4:ocMA.OdeW7C22.mode	@ltx/en_uk_lash/miscellanea:misc.Mode3
ltx/en_uk_lash/oc.m3.d4:ocMA.OdeW7C22.ode	@ltx/en_uk_lash/miscellanea:misc.Ode7
ltx/en_uk_lash/oc.m3.d4:ocMA.OdeW7C22.text	The judgement is at the doors, the judgement seat is ready; get ready, my lowly soul, and cry: When you judge me, O Word, at the prayer of her who bore you, do not condemn me.
ltx/en_uk_lash/oc.m3.d4:ocMA.OdeW7C23.incipit	I devoured the fruits of…
ltx/en_uk_lash/oc.m3.d4:ocMA.OdeW7C23.melody	@ltx/en_uk_lash/he.h.m3:heHE.TreisPaidesEnKamino.name
ltx/en_uk_lash/oc.m3.d4:ocMA.OdeW7C23.mode	@ltx/en_uk_lash/miscellanea:misc.Mode3
ltx/en_uk_lash/oc.m3.d4:ocMA.OdeW7C23.ode	@ltx/en_uk_lash/miscellanea:misc.Ode7
ltx/en_uk_lash/oc.m3.d4:ocMA.OdeW7C23.text	I devoured the fruits of sin and I have met my death; and as I bring a fruitless soul I cry to you: Make me fruitful, for you wiped out corruption by your fruit.
ltx/en_uk_lash/oc.m3.d4:ocMA.OdeW8C11.incipit	When you were crucified Paradise…
ltx/en_uk_lash/oc.m3.d4:ocMA.OdeW8C11.melody	@ltx/en_uk_lash/he.h.m3:heHE.VavyloniaKaminos.name
ltx/en_uk_lash/oc.m3.d4:ocMA.OdeW8C11.mode	@ltx/en_uk_lash/miscellanea:misc.Mode3
ltx/en_uk_lash/oc.m3.d4:ocMA.OdeW8C11.ode	@ltx/en_uk_lash/miscellanea:misc.Ode8
ltx/en_uk_lash/oc.m3.d4:ocMA.OdeW8C11.text	When you were crucified Paradise was opened again, and the sword that was turned against us withdrew, fearing the lance which had pierced your holy side, O Christ, most merciful.
ltx/en_uk_lash/oc.m3.d4:ocMA.OdeW8C12.incipit	The enemy was wounded by…
ltx/en_uk_lash/oc.m3.d4:ocMA.OdeW8C12.melody	@ltx/en_uk_lash/he.h.m3:heHE.VavyloniaKaminos.name
ltx/en_uk_lash/oc.m3.d4:ocMA.OdeW8C12.mode	@ltx/en_uk_lash/miscellanea:misc.Mode3
ltx/en_uk_lash/oc.m3.d4:ocMA.OdeW8C12.ode	@ltx/en_uk_lash/miscellanea:misc.Ode8
ltx/en_uk_lash/oc.m3.d4:ocMA.OdeW8C12.text	The enemy was wounded by your lance and fell, while fallen Adam was brought back crying out to you, O Christ, who were willingly slain: Blessing, I glorify you, God most merciful!
ltx/en_uk_lash/oc.m3.d4:ocMA.OdeW8C13.incipit	The world is made radiant…
ltx/en_uk_lash/oc.m3.d4:ocMA.OdeW8C13.melody	@ltx/en_uk_lash/he.h.m3:heHE.VavyloniaKaminos.name
ltx/en_uk_lash/oc.m3.d4:ocMA.OdeW8C13.mode	@ltx/en_uk_lash/miscellanea:misc.Mode3
ltx/en_uk_lash/oc.m3.d4:ocMA.OdeW8C13.ode	@ltx/en_uk_lash/miscellanea:misc.Ode8
ltx/en_uk_lash/oc.m3.d4:ocMA.OdeW8C13.text	The world is made radiant by your struggles and your deeds of valour, O Athletes, and by your infinite wonders, and is delivered from the darkness of diseases as it cries: Bless the Lord works of the Lord.
ltx/en_uk_lash/oc.m3.d4:ocMA.OdeW8C14.incipit	He who of old boasted…
ltx/en_uk_lash/oc.m3.d4:ocMA.OdeW8C14.melody	@ltx/en_uk_lash/he.h.m3:heHE.VavyloniaKaminos.name
ltx/en_uk_lash/oc.m3.d4:ocMA.OdeW8C14.mode	@ltx/en_uk_lash/miscellanea:misc.Mode3
ltx/en_uk_lash/oc.m3.d4:ocMA.OdeW8C14.ode	@ltx/en_uk_lash/miscellanea:misc.Ode8
ltx/en_uk_lash/oc.m3.d4:ocMA.OdeW8C14.text	He who of old boasted of obliterating land and sea appears a laughing stock, lying at your feet, O Saints; while Christ with his life bearing right hand adorns you, All revered, with unfading crowns.
ltx/en_uk_lash/oc.m3.d4:ocMA.OdeW8C1H.greekmelody	@ltx/en_uk_lash/he.h.m3:heHE.VavyloniaKaminos.greekname
ltx/en_uk_lash/oc.m3.d4:ocMA.OdeW8C1H.incipit	@ltx/en_uk_lash/he.h.m3:heHE.VavyloniaKaminos.incipit
ltx/en_uk_lash/oc.m3.d4:ocMA.OdeW8C1H.melody	@ltx/en_uk_lash/he.h.m3:heHE.VavyloniaKaminos.melody
ltx/en_uk_lash/oc.m3.d4:ocMA.OdeW8C1H.mode	@ltx/en_uk_lash/miscellanea:misc.Mode3
ltx/en_uk_lash/oc.m3.d4:ocMA.OdeW8C1H.ode	@ltx/en_uk_lash/miscellanea:misc.Ode8
ltx/en_uk_lash/oc.m3.d4:ocMA.OdeW8C1H.text	@ltx/en_uk_lash/he.h.m3:heHE.VavyloniaKaminos.text
ltx/en_uk_lash/oc.m3.d4:ocMA.OdeW8C1T.incipit	The One who is above…
ltx/en_uk_lash/oc.m3.d4:ocMA.OdeW8C1T.melody	@ltx/en_uk_lash/he.h.m3:heHE.VavyloniaKaminos.name
ltx/en_uk_lash/oc.m3.d4:ocMA.OdeW8C1T.mode	@ltx/en_uk_lash/miscellanea:misc.Mode3
ltx/en_uk_lash/oc.m3.d4:ocMA.OdeW8C1T.ode	@ltx/en_uk_lash/miscellanea:misc.Ode8
ltx/en_uk_lash/oc.m3.d4:ocMA.OdeW8C1T.text	The One who is above time you bore in time, who looses the timeless bonds of Adam the first formed by his bonds, O Immaculate, and bound him to himself with the bonds of his sweet love.
ltx/en_uk_lash/oc.m3.d4:ocMA.OdeW8C21.greekmelody	@ltx/en_uk_lash/he.h.m3:heHE.AstektoPyri.greekname
ltx/en_uk_lash/oc.m3.d4:ocMA.OdeW8C21.incipit	As wholly fair and neighbour…
ltx/en_uk_lash/oc.m3.d4:ocMA.OdeW8C21.melody	@ltx/en_uk_lash/he.h.m3:heHE.AstektoPyri.name
ltx/en_uk_lash/oc.m3.d4:ocMA.OdeW8C21.mode	@ltx/en_uk_lash/miscellanea:misc.Mode3
ltx/en_uk_lash/oc.m3.d4:ocMA.OdeW8C21.ode	@ltx/en_uk_lash/miscellanea:misc.Ode8
ltx/en_uk_lash/oc.m3.d4:ocMA.OdeW8C21.text	As wholly fair and neighbour to the Universal King, O Mother of God, fill me with good works, for I have lived in wickedness and passed through my whole life in sloth, that I may glorify you to all the ages.
ltx/en_uk_lash/oc.m3.d4:ocMA.OdeW8C22.incipit	As you snatched the Prophet…
ltx/en_uk_lash/oc.m3.d4:ocMA.OdeW8C22.melody	@ltx/en_uk_lash/he.h.m3:heHE.AstektoPyri.name
ltx/en_uk_lash/oc.m3.d4:ocMA.OdeW8C22.mode	@ltx/en_uk_lash/miscellanea:misc.Mode3
ltx/en_uk_lash/oc.m3.d4:ocMA.OdeW8C22.ode	@ltx/en_uk_lash/miscellanea:misc.Ode8
ltx/en_uk_lash/oc.m3.d4:ocMA.OdeW8C22.text	As you snatched the Prophet marvellously from the belly of the whale of old, O Word of God, so deliver my soul, which has slipped down into a deep of destruction, O Saviour, for you have to implore you the Virgin who gave you birth without wedlock.
ltx/en_uk_lash/oc.m3.d4:ocMA.OdeW8C23.incipit	The workers of wickedness, finding…
ltx/en_uk_lash/oc.m3.d4:ocMA.OdeW8C23.melody	@ltx/en_uk_lash/he.h.m3:heHE.AstektoPyri.name
ltx/en_uk_lash/oc.m3.d4:ocMA.OdeW8C23.mode	@ltx/en_uk_lash/miscellanea:misc.Mode3
ltx/en_uk_lash/oc.m3.d4:ocMA.OdeW8C23.ode	@ltx/en_uk_lash/miscellanea:misc.Ode8
ltx/en_uk_lash/oc.m3.d4:ocMA.OdeW8C23.text	The workers of wickedness, finding that I had been clothed with a fair robe by the birth of God, stripped me naked of it; but do you, O Virgin, by your prayers make me radiant with godlike robes through repentance.
ltx/en_uk_lash/oc.m3.d4:ocMA.OdeW9C11.incipit	That you might find the…
ltx/en_uk_lash/oc.m3.d4:ocMA.OdeW9C11.melody	@ltx/en_uk_lash/he.h.m3:heHE.TinEnVatoKaiPyri.name
ltx/en_uk_lash/oc.m3.d4:ocMA.OdeW9C11.mode	@ltx/en_uk_lash/miscellanea:misc.Mode3
ltx/en_uk_lash/oc.m3.d4:ocMA.OdeW9C11.ode	@ltx/en_uk_lash/miscellanea:misc.Ode9
ltx/en_uk_lash/oc.m3.d4:ocMA.OdeW9C11.text	That you might find the drachma you had lost, O Christ, you fixed your flesh to the Cross and you make us partakers with your Powers above, O Giver of life, with whom, as we hymn you as benefactor, in songs we magnify you.
ltx/en_uk_lash/oc.m3.d4:ocMA.OdeW9C12.incipit	As you lifted up your…
ltx/en_uk_lash/oc.m3.d4:ocMA.OdeW9C12.melody	@ltx/en_uk_lash/he.h.m3:heHE.TinEnVatoKaiPyri.name
ltx/en_uk_lash/oc.m3.d4:ocMA.OdeW9C12.mode	@ltx/en_uk_lash/miscellanea:misc.Mode3
ltx/en_uk_lash/oc.m3.d4:ocMA.OdeW9C12.ode	@ltx/en_uk_lash/miscellanea:misc.Ode9
ltx/en_uk_lash/oc.m3.d4:ocMA.OdeW9C12.text	As you lifted up your hands on the Cross, O Christ, you pulled up by your power my hands enfeebled of old by many passions, and you gave strength to my weakened knees for the godly course; and so we magnify you.
ltx/en_uk_lash/oc.m3.d4:ocMA.OdeW9C13.incipit	Burned by the flame of…
ltx/en_uk_lash/oc.m3.d4:ocMA.OdeW9C13.melody	@ltx/en_uk_lash/he.h.m3:heHE.TinEnVatoKaiPyri.name
ltx/en_uk_lash/oc.m3.d4:ocMA.OdeW9C13.mode	@ltx/en_uk_lash/miscellanea:misc.Mode3
ltx/en_uk_lash/oc.m3.d4:ocMA.OdeW9C13.ode	@ltx/en_uk_lash/miscellanea:misc.Ode9
ltx/en_uk_lash/oc.m3.d4:ocMA.OdeW9C13.text	Burned by the flame of limitless torments, the brave and wondrous Athletes found you, O Christ, as a refreshing dew; therefore rejoicing they completed their course with their desire for prizes, as in hymns they unceasingly magnify you.
ltx/en_uk_lash/oc.m3.d4:ocMA.OdeW9C14.incipit	The multitude of the Athletes…
ltx/en_uk_lash/oc.m3.d4:ocMA.OdeW9C14.melody	@ltx/en_uk_lash/he.h.m3:heHE.TinEnVatoKaiPyri.name
ltx/en_uk_lash/oc.m3.d4:ocMA.OdeW9C14.mode	@ltx/en_uk_lash/miscellanea:misc.Mode3
ltx/en_uk_lash/oc.m3.d4:ocMA.OdeW9C14.ode	@ltx/en_uk_lash/miscellanea:misc.Ode9
ltx/en_uk_lash/oc.m3.d4:ocMA.OdeW9C14.text	The multitude of the Athletes and the choir of the Saints implore you, O Christ, on behalf of a people and nation who have much embittered you, to wipe away in the multitude of your mercy, O Pitying One, the multitudes of our offences, as you love mankind.
ltx/en_uk_lash/oc.m3.d4:ocMA.OdeW9C1H.greekmelody	@ltx/en_uk_lash/he.h.m3:heHE.TinEnVatoKaiPyri.greekname
ltx/en_uk_lash/oc.m3.d4:ocMA.OdeW9C1H.incipit	@ltx/en_uk_lash/he.h.m3:heHE.TinEnVatoKaiPyri.incipit
ltx/en_uk_lash/oc.m3.d4:ocMA.OdeW9C1H.melody	@ltx/en_uk_lash/he.h.m3:heHE.TinEnVatoKaiPyri.melody
ltx/en_uk_lash/oc.m3.d4:ocMA.OdeW9C1H.mode	@ltx/en_uk_lash/miscellanea:misc.Mode3
ltx/en_uk_lash/oc.m3.d4:ocMA.OdeW9C1H.ode	@ltx/en_uk_lash/miscellanea:misc.Ode9
ltx/en_uk_lash/oc.m3.d4:ocMA.OdeW9C1H.text	@ltx/en_uk_lash/he.h.m3:heHE.TinEnVatoKaiPyri.text
ltx/en_uk_lash/oc.m3.d4:ocMA.OdeW9C1T.incipit	O Virgin, you bore the…
ltx/en_uk_lash/oc.m3.d4:ocMA.OdeW9C1T.melody	@ltx/en_uk_lash/he.h.m3:heHE.TinEnVatoKaiPyri.name
ltx/en_uk_lash/oc.m3.d4:ocMA.OdeW9C1T.mode	@ltx/en_uk_lash/miscellanea:misc.Mode3
ltx/en_uk_lash/oc.m3.d4:ocMA.OdeW9C1T.ode	@ltx/en_uk_lash/miscellanea:misc.Ode9
ltx/en_uk_lash/oc.m3.d4:ocMA.OdeW9C1T.text	O Virgin, you bore the Brightness of the Father, bearing a mortal form; the sun not able to bear seeing him raised on the Cross, grew black and the fog of the folly of idols was worsted; therefore with him we magnify you.
ltx/en_uk_lash/oc.m3.d4:ocMA.OdeW9C21.greekmelody	@ltx/en_uk_lash/he.h.m3:heHE.EnNomoSkia.greekname
ltx/en_uk_lash/oc.m3.d4:ocMA.OdeW9C21.incipit	My mind is corrupted, my…
ltx/en_uk_lash/oc.m3.d4:ocMA.OdeW9C21.melody	@ltx/en_uk_lash/he.h.m3:heHE.EnNomoSkia.name
ltx/en_uk_lash/oc.m3.d4:ocMA.OdeW9C21.mode	@ltx/en_uk_lash/miscellanea:misc.Mode3
ltx/en_uk_lash/oc.m3.d4:ocMA.OdeW9C21.ode	@ltx/en_uk_lash/miscellanea:misc.Ode9
ltx/en_uk_lash/oc.m3.d4:ocMA.OdeW9C21.text	My mind is corrupted, my soul is corrupted, with wickedness I have been fouled in my conscience and I have been exposed as naked of any sort of goodness; but Virgin, blameless and incorrupt, do not despise me, but adorn me with works of true religion.
ltx/en_uk_lash/oc.m3.d4:ocMA.OdeW9C22.incipit	I am filed with wickedness…
ltx/en_uk_lash/oc.m3.d4:ocMA.OdeW9C22.melody	@ltx/en_uk_lash/he.h.m3:heHE.EnNomoSkia.name
ltx/en_uk_lash/oc.m3.d4:ocMA.OdeW9C22.mode	@ltx/en_uk_lash/miscellanea:misc.Mode3
ltx/en_uk_lash/oc.m3.d4:ocMA.OdeW9C22.ode	@ltx/en_uk_lash/miscellanea:misc.Ode9
ltx/en_uk_lash/oc.m3.d4:ocMA.OdeW9C22.text	I am filed with wickedness, I am filled with thoughts that alienate me from you, Lover of mankind; and so I groan and cry: At the prayers of her who gave you birth receive me as I repent and do not reject me, Benefactor great in mercy.
ltx/en_uk_lash/oc.m3.d4:ocMA.OdeW9C23.incipit	May I be delivered by…
ltx/en_uk_lash/oc.m3.d4:ocMA.OdeW9C23.melody	@ltx/en_uk_lash/he.h.m3:heHE.EnNomoSkia.name
ltx/en_uk_lash/oc.m3.d4:ocMA.OdeW9C23.mode	@ltx/en_uk_lash/miscellanea:misc.Mode3
ltx/en_uk_lash/oc.m3.d4:ocMA.OdeW9C23.ode	@ltx/en_uk_lash/miscellanea:misc.Ode9
ltx/en_uk_lash/oc.m3.d4:ocMA.OdeW9C23.text	May I be delivered by your prayers, all blameless Maiden, from all wrath, from death bringing passions, harsh Hades and fire, from unjust men, from evil foes; I who run to your protection and call on you for help.
ltx/en_uk_lash/oc.m3.d4:ocMA.OdeW9C24.incipit	As Mother of God implore…
ltx/en_uk_lash/oc.m3.d4:ocMA.OdeW9C24.melody	@ltx/en_uk_lash/he.h.m3:heHE.EnNomoSkia.name
ltx/en_uk_lash/oc.m3.d4:ocMA.OdeW9C24.mode	@ltx/en_uk_lash/miscellanea:misc.Mode3
ltx/en_uk_lash/oc.m3.d4:ocMA.OdeW9C24.ode	@ltx/en_uk_lash/miscellanea:misc.Ode9
ltx/en_uk_lash/oc.m3.d4:ocMA.OdeW9C24.text	As Mother of God implore the Lord, God and King, who was born of you, that you suppliant may be delivered from every threat and evil habit, for from my mother''s womb I have trusted in you, pure Lady.
ltx/en_uk_lash/oc.m3.d4:ocVE.ApolTheotokionVM.incipit	@ltx/en_uk_lash/oc.m3.d4:ocMA.Kathisma13.incipit
ltx/en_uk_lash/oc.m3.d4:ocVE.ApolTheotokionVM.melody	
ltx/en_uk_lash/oc.m3.d4:ocVE.ApolTheotokionVM.mode	@ltx/en_uk_lash/miscellanea:misc.Mode3
ltx/en_uk_lash/oc.m3.d4:ocVE.ApolTheotokionVM.text	@ltx/en_uk_lash/oc.m3.d4:ocMA.Kathisma13.text
ltx/en_uk_lash/oc.m3.d4:ocVE.AposTheotokion.greekmelody	@ltx/en_uk_lash/he.a.m3:heAU.MegaliTouStavrouSou.greekname
ltx/en_uk_lash/oc.m3.d4:ocVE.AposTheotokion.incipit	When she saw you nailed…
ltx/en_uk_lash/oc.m3.d4:ocVE.AposTheotokion.melody	@ltx/en_uk_lash/he.a.m3:heAU.MegaliTouStavrouSou.notmetered
ltx/en_uk_lash/oc.m3.d4:ocVE.AposTheotokion.mode	@ltx/en_uk_lash/miscellanea:misc.Mode3
ltx/en_uk_lash/oc.m3.d4:ocVE.AposTheotokion.text	When she saw you nailed to the Cross, my Christ, the Lamb who gave you birth, without blemish and your Mother, with weeping lamented and cried out, ''Do not make me childless, whom you kept pure after childbirth!''
ltx/en_uk_lash/oc.m3.d4:ocVE.Aposticha1.incipit	I worship your precious Cross…
ltx/en_uk_lash/oc.m3.d4:ocVE.Aposticha1.melody	
ltx/en_uk_lash/oc.m3.d4:ocVE.Aposticha1.mode	@ltx/en_uk_lash/miscellanea:misc.Mode3
ltx/en_uk_lash/oc.m3.d4:ocVE.Aposticha1.text	I worship your precious Cross, O Christ, the guardian of the world, the salvation of us sinners, the great expiation, the victory of the King, the boast of the whole inhabited world.
ltx/en_uk_lash/oc.m3.d4:ocVE.Aposticha2.incipit	A tree of disobedience sprouted…
ltx/en_uk_lash/oc.m3.d4:ocVE.Aposticha2.melody	
ltx/en_uk_lash/oc.m3.d4:ocVE.Aposticha2.mode	@ltx/en_uk_lash/miscellanea:misc.Mode3
ltx/en_uk_lash/oc.m3.d4:ocVE.Aposticha2.text	A tree of disobedience sprouted death for the world; the tree of the Cross life and incorruption; and so we worship you, the crucified Lord. May the light of your face be marked upon us.
ltx/en_uk_lash/oc.m3.d4:ocVE.Aposticha3.incipit	Prophets, Apostles and Martyrs of…
ltx/en_uk_lash/oc.m3.d4:ocVE.Aposticha3.melody	
ltx/en_uk_lash/oc.m3.d4:ocVE.Aposticha3.mode	@ltx/en_uk_lash/miscellanea:misc.Mode3
ltx/en_uk_lash/oc.m3.d4:ocVE.Aposticha3.text	Prophets, Apostles and Martyrs of Christ taught that a consubstantial Trinity should be praised and they enlightened the nations that had gone astray and made the children of men fellows of the Angels.
ltx/en_uk_lash/oc.m3.d4:ocVE.SticTheotokion.greekmelody	@ltx/en_uk_lash/he.a.m3:heAU.MegaliTouStavrouSou.greekname
ltx/en_uk_lash/oc.m3.d4:ocVE.SticTheotokion.incipit	A sword passed through your…
ltx/en_uk_lash/oc.m3.d4:ocVE.SticTheotokion.melody	@ltx/en_uk_lash/he.a.m3:heAU.MegaliTouStavrouSou.notmetered
ltx/en_uk_lash/oc.m3.d4:ocVE.SticTheotokion.mode	@ltx/en_uk_lash/miscellanea:misc.Mode3
ltx/en_uk_lash/oc.m3.d4:ocVE.SticTheotokion.text	A sword passed through your heart, O All-pure, when you looked towards your Son on the Cross, and you cried out, ''Do not leave me childless, my Son and my God, who kept me virgin after childbirth!''
ltx/en_uk_lash/oc.m3.d4:ocVE.Stichera1.greekmelody	@ltx/en_uk_lash/he.a.m3:heAU.MegaliTouStavrouSou.greekname
ltx/en_uk_lash/oc.m3.d4:ocVE.Stichera1.incipit	Creation was changed at your…
ltx/en_uk_lash/oc.m3.d4:ocVE.Stichera1.melody	@ltx/en_uk_lash/he.a.m3:heAU.MegaliTouStavrouSou.notmetered
ltx/en_uk_lash/oc.m3.d4:ocVE.Stichera1.mode	@ltx/en_uk_lash/miscellanea:misc.Mode3
ltx/en_uk_lash/oc.m3.d4:ocVE.Stichera1.text	Creation was changed at your Crucifixion, O Word; the sun withdrew its rays in fear, the veil of the temple was rent and every believer was saved; therefore we glorify your measureless riches.
ltx/en_uk_lash/oc.m3.d4:ocVE.Stichera2.incipit	He who is both God…
ltx/en_uk_lash/oc.m3.d4:ocVE.Stichera2.melody	@ltx/en_uk_lash/he.a.m3:heAU.MegaliTouStavrouSou.notmetered
ltx/en_uk_lash/oc.m3.d4:ocVE.Stichera2.mode	@ltx/en_uk_lash/miscellanea:misc.Mode3
ltx/en_uk_lash/oc.m3.d4:ocVE.Stichera2.text	He who is both God and Master assumed our flesh through pity, was nailed to the Tree and lifted us up by being lifted up himself in body, as he was well pleased, through the compassion of his mercy.
ltx/en_uk_lash/oc.m3.d4:ocVE.Stichera3.incipit	Drops of blood and water…
ltx/en_uk_lash/oc.m3.d4:ocVE.Stichera3.melody	@ltx/en_uk_lash/he.a.m3:heAU.MegaliTouStavrouSou.notmetered
ltx/en_uk_lash/oc.m3.d4:ocVE.Stichera3.mode	@ltx/en_uk_lash/miscellanea:misc.Mode3
ltx/en_uk_lash/oc.m3.d4:ocVE.Stichera3.text	Drops of blood and water, which flowed from God, refashioned the world as they poured from your side. With the water, as you are compassionate, you wash away the sins of all, while with the blood, Lord, you write out their pardon.
ltx/en_uk_lash/oc.m3.d4:ocVE.Stichera4.greekmelody	@ltx/en_uk_lash/he.a.m3:heAU.MegaliTouStavrouSou.greekname
ltx/en_uk_lash/oc.m3.d4:ocVE.Stichera4.incipit	In lying on the bed…
ltx/en_uk_lash/oc.m3.d4:ocVE.Stichera4.melody	@ltx/en_uk_lash/he.a.m3:heAU.MegaliTouStavrouSou.notmetered
ltx/en_uk_lash/oc.m3.d4:ocVE.Stichera4.mode	@ltx/en_uk_lash/miscellanea:misc.Mode3
ltx/en_uk_lash/oc.m3.d4:ocVE.Stichera4.text	In lying on the bed of my indifference, I have passed the length of my life in sloth, and I tremble at the hour of my departure, but rouse me to repentance by your intercession, O Maiden, and save m
ltx/en_uk_lash/oc.m3.d4:ocVE.Stichera5.incipit	Heal the pain of my…
ltx/en_uk_lash/oc.m3.d4:ocVE.Stichera5.melody	@ltx/en_uk_lash/he.a.m3:heAU.MegaliTouStavrouSou.notmetered
ltx/en_uk_lash/oc.m3.d4:ocVE.Stichera5.mode	@ltx/en_uk_lash/miscellanea:misc.Mode3
ltx/en_uk_lash/oc.m3.d4:ocVE.Stichera5.text	Heal the pain of my heart, O Pure one, stop the wandering of my mind and grant that I may sing your praise with a pure heart, ask for grace and find mercy on the day of judgement.
ltx/en_uk_lash/oc.m3.d4:ocVE.Stichera6.incipit	Cast away, my humble soul…
ltx/en_uk_lash/oc.m3.d4:ocVE.Stichera6.melody	@ltx/en_uk_lash/he.a.m3:heAU.MegaliTouStavrouSou.notmetered
ltx/en_uk_lash/oc.m3.d4:ocVE.Stichera6.mode	@ltx/en_uk_lash/miscellanea:misc.Mode3
ltx/en_uk_lash/oc.m3.d4:ocVE.Stichera6.text	Cast away, my humble soul, the burdens of wickedness that are hard to bear, and draw near, weeping and crying out, ''Grant, pure Virgin, that I may bear the light yoke of your Son and God''.
ltx/en_uk_lash/oc.m3.d4:octrMA.Kathisma11.greekmelody	@ltx/en_uk_lash/he.a.m3:heAU.TinOraiotita.greekname
ltx/en_uk_lash/oc.m3.d4:octrMA.Kathisma11.incipit	@ltx/en_uk_lash/oc.m3.d4:ocMA.Kathisma22.incipit
ltx/en_uk_lash/oc.m3.d4:octrMA.Kathisma11.melody	@ltx/en_uk_lash/he.a.m3:heAU.TinOraiotita.notmetered
ltx/en_uk_lash/oc.m3.d4:octrMA.Kathisma11.mode	@ltx/en_uk_lash/miscellanea:misc.Mode3
ltx/en_uk_lash/oc.m3.d4:octrMA.Kathisma11.text	@ltx/en_uk_lash/oc.m3.d4:ocMA.Kathisma22.text
ltx/en_uk_lash/oc.m3.d4:octrMA.Kathisma12.incipit	@ltx/en_uk_lash/oc.m3.d4:ocMA.Kathisma11.incipit
ltx/en_uk_lash/oc.m3.d4:octrMA.Kathisma12.melody	
ltx/en_uk_lash/oc.m3.d4:octrMA.Kathisma12.mode	@ltx/en_uk_lash/miscellanea:misc.Mode3
ltx/en_uk_lash/oc.m3.d4:octrMA.Kathisma12.text	@ltx/en_uk_lash/oc.m3.d4:ocMA.Kathisma11.text
ltx/en_uk_lash/oc.m3.d4:octrMA.Kathisma1T.incipit	@ltx/en_uk_lash/oc.m3.d4:ocMA.Kathisma13.incipit
ltx/en_uk_lash/oc.m3.d4:octrMA.Kathisma1T.melody	
ltx/en_uk_lash/oc.m3.d4:octrMA.Kathisma1T.mode	@ltx/en_uk_lash/miscellanea:misc.Mode3
ltx/en_uk_lash/oc.m3.d4:octrMA.Kathisma1T.text	@ltx/en_uk_lash/oc.m3.d4:ocMA.Kathisma13.text
ltx/en_uk_lash/oc.m3.d4:octrMA.Ode7Martyricon.greekmelody	@ltx/en_uk_lash/he.a.m3:heAU.TinOraiotita.greekname
ltx/en_uk_lash/oc.m3.d4:octrMA.Ode7Martyricon.incipit	@ltx/en_uk_lash/oc.m3.d3:ocMA.Kathisma32.incipit
ltx/en_uk_lash/oc.m3.d4:octrMA.Ode7Martyricon.melody	@ltx/en_uk_lash/he.a.m3:heAU.TinOraiotita.notmetered
ltx/en_uk_lash/oc.m3.d4:octrMA.Ode7Martyricon.mode	@ltx/en_uk_lash/miscellanea:misc.Mode3
ltx/en_uk_lash/oc.m3.d4:octrMA.Ode7Martyricon.text	@ltx/en_uk_lash/oc.m3.d3:ocMA.Kathisma32.text
ltx/en_uk_lash/oc.m3.d4:octrMA.Photogogic.incipit	@ltx/en_uk_lash/oc.m3.d2:octrMA.Photagogic.incipit
ltx/en_uk_lash/oc.m3.d4:octrMA.Photogogic.mode	@ltx/en_uk_lash/miscellanea:misc.Mode3
ltx/en_uk_lash/oc.m3.d4:octrMA.Photogogic.text	@ltx/en_uk_lash/oc.m3.d2:octrMA.Photagogic.text
ltx/en_uk_lash/oc.m3.d4:octrMA.Triadic1.incipit	@ltx/en_uk_lash/oc.m3.d2:octrMA.Triadic1.incipit
ltx/en_uk_lash/oc.m3.d4:octrMA.Triadic1.mode	@ltx/en_uk_lash/miscellanea:misc.Mode3
ltx/en_uk_lash/oc.m3.d4:octrMA.Triadic1.text	@ltx/en_uk_lash/oc.m3.d2:octrMA.Triadic1.text
ltx/en_uk_lash/oc.m3.d4:octrMA.Triadic2.incipit	@ltx/en_uk_lash/oc.m3.d2:octrMA.Triadic2.incipit
ltx/en_uk_lash/oc.m3.d4:octrMA.Triadic2.mode	@ltx/en_uk_lash/miscellanea:misc.Mode3
ltx/en_uk_lash/oc.m3.d4:octrMA.Triadic2.text	@ltx/en_uk_lash/oc.m3.d2:octrMA.Triadic2.text
ltx/en_uk_lash/oc.m3.d4:octrMA.Triadic3.incipit	@ltx/en_uk_lash/oc.m3.d2:octrMA.Triadic3.incipit
ltx/en_uk_lash/oc.m3.d4:octrMA.Triadic3.mode	@ltx/en_uk_lash/miscellanea:misc.Mode3
ltx/en_uk_lash/oc.m3.d4:octrMA.Triadic3.text	@ltx/en_uk_lash/oc.m3.d2:octrMA.Triadic3.text
