ltx/en_uk_lash/eo.e10:eo.Doxasticon.incipit	…
ltx/en_uk_lash/eo.e10:eo.Doxasticon.mode	@ltx/en_uk_lash/miscellanea:misc.Mode6
ltx/en_uk_lash/eo.e10:eo.Doxasticon.text	
ltx/en_uk_lash/eo.e10:eo.Exaposteilarion.incipit	…
ltx/en_uk_lash/eo.e10:eo.Exaposteilarion.melody	@ltx/en_uk_lash/he.a.m2:heAU.ToisMathitaisSynelthomen.notmetered
ltx/en_uk_lash/eo.e10:eo.Exaposteilarion.mode	@ltx/en_uk_lash/miscellanea:misc.Mode2
ltx/en_uk_lash/eo.e10:eo.Exaposteilarion.text	
ltx/en_uk_lash/eo.e10:eo.Theotokion.incipit	…
ltx/en_uk_lash/eo.e10:eo.Theotokion.melody	@ltx/en_uk_lash/he.a.m2:heAU.ToisMathitaisSynelthomen.notmetered
ltx/en_uk_lash/eo.e10:eo.Theotokion.mode	@ltx/en_uk_lash/miscellanea:misc.Mode2
ltx/en_uk_lash/eo.e10:eo.Theotokion.text	
ltx/en_uk_lash/eo.e10:eo.title	
