ltx/en_uk_lash/me.m07.d01:meDA.commemoration.first	
ltx/en_uk_lash/me.m07.d01:meDA.commemoration.first_name	
ltx/en_uk_lash/me.m07.d01:meDA.commemoration.first_short	
ltx/en_uk_lash/me.m07.d01:meDA.commemoration.first_title	
ltx/en_uk_lash/me.m07.d01:meDA.commemoration.full	
ltx/en_uk_lash/me.m07.d01:meDA.commemoration.second_name	
ltx/en_uk_lash/me.m07.d01:meDA.commemoration.second_title	
ltx/en_uk_lash/me.m07.d01:meDA.date	
ltx/en_uk_lash/me.m07.d01:meDA.insert1	
ltx/en_uk_lash/me.m07.d01:meDA.insert2	
ltx/en_uk_lash/me.m07.d01:meDA.note	
ltx/en_uk_lash/me.m07.d01:meHO.commemorations	
ltx/en_uk_lash/me.m07.d01:meHO.note1	
ltx/en_uk_lash/me.m07.d01:meHO.note2	
ltx/en_uk_lash/me.m07.d01:meHO.number	
ltx/en_uk_lash/me.m07.d01:meHO.rank	
ltx/en_uk_lash/me.m07.d01:meLE.commemoration1	
ltx/en_uk_lash/me.m07.d01:meLE.commemoration2	
ltx/en_uk_lash/me.m07.d01:meLI.Kontakion1.incipit	@ltx/en_uk_lash/me.m07.d01:meMA.Kontakion1.incipit
ltx/en_uk_lash/me.m07.d01:meLI.Kontakion1.melody	@ltx/en_uk_lash/me.m07.d01:meMA.Kontakion1.melody
ltx/en_uk_lash/me.m07.d01:meLI.Kontakion1.mode	@ltx/en_uk_lash/me.m07.d01:meMA.Kontakion1.mode
ltx/en_uk_lash/me.m07.d01:meLI.Kontakion1.text	@ltx/en_uk_lash/me.m07.d01:meMA.Kontakion1.text
ltx/en_uk_lash/me.m07.d01:meLI.MM.CommunionHymn.text	
ltx/en_uk_lash/me.m07.d01:meLI.Megalynarion.text	
ltx/en_uk_lash/me.m07.d01:meMA.C1.acrostic.notice1	
ltx/en_uk_lash/me.m07.d01:meMA.C1.acrostic.text	
ltx/en_uk_lash/me.m07.d01:meMA.C1.acrostic.title	
ltx/en_uk_lash/me.m07.d01:meMA.C1.title	@ltx/en_uk_lash/titles:ti.CanonSaints
ltx/en_uk_lash/me.m07.d01:meMA.C1.verse	@ltx/en_uk_lash/prayers:pr.verse_SaintsM.text
ltx/en_uk_lash/me.m07.d01:meMA.ExapTheotokion.incipit	All-immaculate, you bore God the…
ltx/en_uk_lash/me.m07.d01:meMA.ExapTheotokion.melody	@ltx/en_uk_lash/he.a.m3:heAU.EnPnevmatiToIero.notmetered
ltx/en_uk_lash/me.m07.d01:meMA.ExapTheotokion.mode	@ltx/en_uk_lash/miscellanea:misc.Mode3
ltx/en_uk_lash/me.m07.d01:meMA.ExapTheotokion.text	All-immaculate, you bore God the Word of God, when he in his great wisdom accomplished his great dispensation; and therefore we all worthily praise you as her who intercedes with him that we may be rescued from diseases and every kind of danger.
ltx/en_uk_lash/me.m07.d01:meMA.Exaposteilarion1.greekmelody	@ltx/en_uk_lash/he.a.m3:heAU.EnPnevmatiToIero.greekname
ltx/en_uk_lash/me.m07.d01:meMA.Exaposteilarion1.incipit	Receiving the grace of healings…
ltx/en_uk_lash/me.m07.d01:meMA.Exaposteilarion1.melody	@ltx/en_uk_lash/he.a.m3:heAU.EnPnevmatiToIero.notmetered
ltx/en_uk_lash/me.m07.d01:meMA.Exaposteilarion1.mode	@ltx/en_uk_lash/miscellanea:misc.Mode3
ltx/en_uk_lash/me.m07.d01:meMA.Exaposteilarion1.text	Receiving the grace of healings from God, blest Unmercenaries, you cure diseases and heal all those who faithfully have recourse to your godlike shrine; and therefore with one voice we worthily call your holy memory blest.
ltx/en_uk_lash/me.m07.d01:meMA.Kathisma11.greekmelody	@ltx/en_uk_lash/he.a.m8:heAU.TinSofianKaiLogon.greekname
ltx/en_uk_lash/me.m07.d01:meMA.Kathisma11.incipit	…
ltx/en_uk_lash/me.m07.d01:meMA.Kathisma11.melody	@ltx/en_uk_lash/he.a.m8:heAU.TinSofianKaiLogon.notmetered
ltx/en_uk_lash/me.m07.d01:meMA.Kathisma11.mode	@ltx/en_uk_lash/miscellanea:misc.Mode8
ltx/en_uk_lash/me.m07.d01:meMA.Kathisma11.text	
ltx/en_uk_lash/me.m07.d01:meMA.Kathisma1T.incipit	…
ltx/en_uk_lash/me.m07.d01:meMA.Kathisma1T.melody	@ltx/en_uk_lash/he.a.m8:heAU.TinSofianKaiLogon.notmetered
ltx/en_uk_lash/me.m07.d01:meMA.Kathisma1T.mode	@ltx/en_uk_lash/miscellanea:misc.Mode8
ltx/en_uk_lash/me.m07.d01:meMA.Kathisma1T.text	
ltx/en_uk_lash/me.m07.d01:meMA.Kathisma21.greekmelody	@ltx/en_uk_lash/he.a.m4:heAU.EpefanisSimeron.greekname
ltx/en_uk_lash/me.m07.d01:meMA.Kathisma21.incipit	…
ltx/en_uk_lash/me.m07.d01:meMA.Kathisma21.melody	@ltx/en_uk_lash/he.a.m4:heAU.EpefanisSimeron.notmetered
ltx/en_uk_lash/me.m07.d01:meMA.Kathisma21.mode	@ltx/en_uk_lash/miscellanea:misc.Mode4
ltx/en_uk_lash/me.m07.d01:meMA.Kathisma21.text	
ltx/en_uk_lash/me.m07.d01:meMA.Kathisma2T.incipit	…
ltx/en_uk_lash/me.m07.d01:meMA.Kathisma2T.melody	@ltx/en_uk_lash/he.a.m4:heAU.EpefanisSimeron.notmetered
ltx/en_uk_lash/me.m07.d01:meMA.Kathisma2T.mode	@ltx/en_uk_lash/miscellanea:misc.Mode4
ltx/en_uk_lash/me.m07.d01:meMA.Kathisma2T.text	
ltx/en_uk_lash/me.m07.d01:meMA.Kontakion1.incipit	…
ltx/en_uk_lash/me.m07.d01:meMA.Kontakion1.melody	
ltx/en_uk_lash/me.m07.d01:meMA.Kontakion1.mode	@ltx/en_uk_lash/miscellanea:misc.Mode2
ltx/en_uk_lash/me.m07.d01:meMA.Kontakion1.text	
ltx/en_uk_lash/me.m07.d01:meMA.Lauds1.greekmelody	@ltx/en_uk_lash/he.a.m4:heAU.EdokasSimeiosin.greekname
ltx/en_uk_lash/me.m07.d01:meMA.Lauds1.incipit	…
ltx/en_uk_lash/me.m07.d01:meMA.Lauds1.melody	@ltx/en_uk_lash/he.a.m4:heAU.EdokasSimeiosin.notmetered
ltx/en_uk_lash/me.m07.d01:meMA.Lauds1.mode	@ltx/en_uk_lash/miscellanea:misc.Mode4
ltx/en_uk_lash/me.m07.d01:meMA.Lauds1.text	
ltx/en_uk_lash/me.m07.d01:meMA.Lauds2.incipit	…
ltx/en_uk_lash/me.m07.d01:meMA.Lauds2.melody	@ltx/en_uk_lash/he.a.m4:heAU.EdokasSimeiosin.notmetered
ltx/en_uk_lash/me.m07.d01:meMA.Lauds2.mode	@ltx/en_uk_lash/miscellanea:misc.Mode4
ltx/en_uk_lash/me.m07.d01:meMA.Lauds2.text	
ltx/en_uk_lash/me.m07.d01:meMA.Lauds3.incipit	…
ltx/en_uk_lash/me.m07.d01:meMA.Lauds3.melody	@ltx/en_uk_lash/he.a.m4:heAU.EdokasSimeiosin.notmetered
ltx/en_uk_lash/me.m07.d01:meMA.Lauds3.mode	@ltx/en_uk_lash/miscellanea:misc.Mode4
ltx/en_uk_lash/me.m07.d01:meMA.Lauds3.text	
ltx/en_uk_lash/me.m07.d01:meMA.LaudsGlory.incipit	Holy Unmercenaries, you possess a…
ltx/en_uk_lash/me.m07.d01:meMA.LaudsGlory.melody	
ltx/en_uk_lash/me.m07.d01:meMA.LaudsGlory.mode	@ltx/en_uk_lash/miscellanea:misc.Mode4
ltx/en_uk_lash/me.m07.d01:meMA.LaudsGlory.text	Holy Unmercenaries, you possess a source of remedies and grant healings to all who ask, for you have been found worthy of the greatest gifts from the unfailing source of the Saviour Christ. For to you, as rivals of the Apostles in zeal, the Lord says: See, I have given you authority against unclean spirits, so as to cast them out and so as to cure every disease and every weakness. And so, having lived your lives well in accordance with his commands, freely you have received, freely you give, as you heal the sufferings of our souls and bodies.
ltx/en_uk_lash/me.m07.d01:meMA.LaudsTheotokion.incipit	@ltx/en_uk_lash/oc.m4.d2:ocMA.AposTheotokion.incipit
ltx/en_uk_lash/me.m07.d01:meMA.LaudsTheotokion.melody	
ltx/en_uk_lash/me.m07.d01:meMA.LaudsTheotokion.mode	@ltx/en_uk_lash/miscellanea:misc.Mode4
ltx/en_uk_lash/me.m07.d01:meMA.LaudsTheotokion.text	@ltx/en_uk_lash/oc.m4.d2:ocMA.AposTheotokion.text
ltx/en_uk_lash/me.m07.d01:meMA.MM.Lauds1123as5678.text	@ltx/en_uk_lash/properties:media.key
ltx/en_uk_lash/me.m07.d01:meMA.Ode1C11.greekmelody	@ltx/en_uk_lash/he.h.m6:heHE.OsEnIpeiroPezefsas.greekname
ltx/en_uk_lash/me.m07.d01:meMA.Ode1C11.incipit	…
ltx/en_uk_lash/me.m07.d01:meMA.Ode1C11.melody	@ltx/en_uk_lash/he.h.m6:heHE.OsEnIpeiroPezefsas.name
ltx/en_uk_lash/me.m07.d01:meMA.Ode1C11.mode	@ltx/en_uk_lash/miscellanea:misc.Mode6
ltx/en_uk_lash/me.m07.d01:meMA.Ode1C11.ode	@ltx/en_uk_lash/miscellanea:misc.Ode1
ltx/en_uk_lash/me.m07.d01:meMA.Ode1C11.text	
ltx/en_uk_lash/me.m07.d01:meMA.Ode1C12.incipit	…
ltx/en_uk_lash/me.m07.d01:meMA.Ode1C12.melody	@ltx/en_uk_lash/he.h.m6:heHE.OsEnIpeiroPezefsas.name
ltx/en_uk_lash/me.m07.d01:meMA.Ode1C12.mode	@ltx/en_uk_lash/miscellanea:misc.Mode6
ltx/en_uk_lash/me.m07.d01:meMA.Ode1C12.ode	@ltx/en_uk_lash/miscellanea:misc.Ode1
ltx/en_uk_lash/me.m07.d01:meMA.Ode1C12.text	
ltx/en_uk_lash/me.m07.d01:meMA.Ode1C13.incipit	…
ltx/en_uk_lash/me.m07.d01:meMA.Ode1C13.melody	@ltx/en_uk_lash/he.h.m6:heHE.OsEnIpeiroPezefsas.name
ltx/en_uk_lash/me.m07.d01:meMA.Ode1C13.mode	@ltx/en_uk_lash/miscellanea:misc.Mode6
ltx/en_uk_lash/me.m07.d01:meMA.Ode1C13.ode	@ltx/en_uk_lash/miscellanea:misc.Ode1
ltx/en_uk_lash/me.m07.d01:meMA.Ode1C13.text	
ltx/en_uk_lash/me.m07.d01:meMA.Ode1C1T.incipit	…
ltx/en_uk_lash/me.m07.d01:meMA.Ode1C1T.melody	@ltx/en_uk_lash/he.h.m6:heHE.OsEnIpeiroPezefsas.name
ltx/en_uk_lash/me.m07.d01:meMA.Ode1C1T.mode	@ltx/en_uk_lash/miscellanea:misc.Mode6
ltx/en_uk_lash/me.m07.d01:meMA.Ode1C1T.ode	@ltx/en_uk_lash/miscellanea:misc.Ode1
ltx/en_uk_lash/me.m07.d01:meMA.Ode1C1T.text	
ltx/en_uk_lash/me.m07.d01:meMA.Ode3C11.greekmelody	@ltx/en_uk_lash/he.h.m6:heHE.OukEstinAgios.greekname
ltx/en_uk_lash/me.m07.d01:meMA.Ode3C11.incipit	…
ltx/en_uk_lash/me.m07.d01:meMA.Ode3C11.melody	@ltx/en_uk_lash/he.h.m6:heHE.OukEstinAgios.name
ltx/en_uk_lash/me.m07.d01:meMA.Ode3C11.mode	@ltx/en_uk_lash/miscellanea:misc.Mode6
ltx/en_uk_lash/me.m07.d01:meMA.Ode3C11.ode	@ltx/en_uk_lash/miscellanea:misc.Ode3
ltx/en_uk_lash/me.m07.d01:meMA.Ode3C11.text	
ltx/en_uk_lash/me.m07.d01:meMA.Ode3C12.incipit	…
ltx/en_uk_lash/me.m07.d01:meMA.Ode3C12.melody	@ltx/en_uk_lash/he.h.m6:heHE.OukEstinAgios.name
ltx/en_uk_lash/me.m07.d01:meMA.Ode3C12.mode	@ltx/en_uk_lash/miscellanea:misc.Mode6
ltx/en_uk_lash/me.m07.d01:meMA.Ode3C12.ode	@ltx/en_uk_lash/miscellanea:misc.Ode3
ltx/en_uk_lash/me.m07.d01:meMA.Ode3C12.text	
ltx/en_uk_lash/me.m07.d01:meMA.Ode3C13.incipit	…
ltx/en_uk_lash/me.m07.d01:meMA.Ode3C13.melody	@ltx/en_uk_lash/he.h.m6:heHE.OukEstinAgios.name
ltx/en_uk_lash/me.m07.d01:meMA.Ode3C13.mode	@ltx/en_uk_lash/miscellanea:misc.Mode6
ltx/en_uk_lash/me.m07.d01:meMA.Ode3C13.ode	@ltx/en_uk_lash/miscellanea:misc.Ode3
ltx/en_uk_lash/me.m07.d01:meMA.Ode3C13.text	
ltx/en_uk_lash/me.m07.d01:meMA.Ode3C1T.incipit	…
ltx/en_uk_lash/me.m07.d01:meMA.Ode3C1T.melody	@ltx/en_uk_lash/he.h.m6:heHE.OukEstinAgios.name
ltx/en_uk_lash/me.m07.d01:meMA.Ode3C1T.mode	@ltx/en_uk_lash/miscellanea:misc.Mode6
ltx/en_uk_lash/me.m07.d01:meMA.Ode3C1T.ode	@ltx/en_uk_lash/miscellanea:misc.Ode3
ltx/en_uk_lash/me.m07.d01:meMA.Ode3C1T.text	
ltx/en_uk_lash/me.m07.d01:meMA.Ode3Kathisma1.greekmelody	@ltx/en_uk_lash/he.a.m8:heAU.TinSofianKaiLogon.greekname
ltx/en_uk_lash/me.m07.d01:meMA.Ode3Kathisma1.incipit	…
ltx/en_uk_lash/me.m07.d01:meMA.Ode3Kathisma1.melody	@ltx/en_uk_lash/he.a.m8:heAU.TinSofianKaiLogon.notmetered
ltx/en_uk_lash/me.m07.d01:meMA.Ode3Kathisma1.mode	@ltx/en_uk_lash/miscellanea:misc.Mode8
ltx/en_uk_lash/me.m07.d01:meMA.Ode3Kathisma1.text	
ltx/en_uk_lash/me.m07.d01:meMA.Ode3KathismaT.incipit	…
ltx/en_uk_lash/me.m07.d01:meMA.Ode3KathismaT.melody	@ltx/en_uk_lash/he.a.m8:heAU.TinSofianKaiLogon.notmetered
ltx/en_uk_lash/me.m07.d01:meMA.Ode3KathismaT.mode	@ltx/en_uk_lash/miscellanea:misc.Mode8
ltx/en_uk_lash/me.m07.d01:meMA.Ode3KathismaT.text	
ltx/en_uk_lash/me.m07.d01:meMA.Ode4C11.greekmelody	@ltx/en_uk_lash/he.h.m6:heHE.ChristosMouDynamis.greekname
ltx/en_uk_lash/me.m07.d01:meMA.Ode4C11.incipit	…
ltx/en_uk_lash/me.m07.d01:meMA.Ode4C11.melody	@ltx/en_uk_lash/he.h.m6:heHE.ChristosMouDynamis.name
ltx/en_uk_lash/me.m07.d01:meMA.Ode4C11.mode	@ltx/en_uk_lash/miscellanea:misc.Mode6
ltx/en_uk_lash/me.m07.d01:meMA.Ode4C11.ode	@ltx/en_uk_lash/miscellanea:misc.Ode4
ltx/en_uk_lash/me.m07.d01:meMA.Ode4C11.text	
ltx/en_uk_lash/me.m07.d01:meMA.Ode4C12.incipit	…
ltx/en_uk_lash/me.m07.d01:meMA.Ode4C12.melody	@ltx/en_uk_lash/he.h.m6:heHE.ChristosMouDynamis.name
ltx/en_uk_lash/me.m07.d01:meMA.Ode4C12.mode	@ltx/en_uk_lash/miscellanea:misc.Mode6
ltx/en_uk_lash/me.m07.d01:meMA.Ode4C12.ode	@ltx/en_uk_lash/miscellanea:misc.Ode4
ltx/en_uk_lash/me.m07.d01:meMA.Ode4C12.text	
ltx/en_uk_lash/me.m07.d01:meMA.Ode4C13.incipit	…
ltx/en_uk_lash/me.m07.d01:meMA.Ode4C13.melody	@ltx/en_uk_lash/he.h.m6:heHE.ChristosMouDynamis.name
ltx/en_uk_lash/me.m07.d01:meMA.Ode4C13.mode	@ltx/en_uk_lash/miscellanea:misc.Mode6
ltx/en_uk_lash/me.m07.d01:meMA.Ode4C13.ode	@ltx/en_uk_lash/miscellanea:misc.Ode4
ltx/en_uk_lash/me.m07.d01:meMA.Ode4C13.text	
ltx/en_uk_lash/me.m07.d01:meMA.Ode4C1T.incipit	…
ltx/en_uk_lash/me.m07.d01:meMA.Ode4C1T.melody	@ltx/en_uk_lash/he.h.m6:heHE.ChristosMouDynamis.name
ltx/en_uk_lash/me.m07.d01:meMA.Ode4C1T.mode	@ltx/en_uk_lash/miscellanea:misc.Mode6
ltx/en_uk_lash/me.m07.d01:meMA.Ode4C1T.ode	@ltx/en_uk_lash/miscellanea:misc.Ode4
ltx/en_uk_lash/me.m07.d01:meMA.Ode4C1T.text	
ltx/en_uk_lash/me.m07.d01:meMA.Ode5C11.greekmelody	@ltx/en_uk_lash/he.h.m6:heHE.ToTheioFengeiSou.greekname
ltx/en_uk_lash/me.m07.d01:meMA.Ode5C11.incipit	…
ltx/en_uk_lash/me.m07.d01:meMA.Ode5C11.melody	@ltx/en_uk_lash/he.h.m6:heHE.ToTheioFengeiSou.name
ltx/en_uk_lash/me.m07.d01:meMA.Ode5C11.mode	@ltx/en_uk_lash/miscellanea:misc.Mode6
ltx/en_uk_lash/me.m07.d01:meMA.Ode5C11.ode	@ltx/en_uk_lash/miscellanea:misc.Ode5
ltx/en_uk_lash/me.m07.d01:meMA.Ode5C11.text	
ltx/en_uk_lash/me.m07.d01:meMA.Ode5C12.incipit	…
ltx/en_uk_lash/me.m07.d01:meMA.Ode5C12.melody	@ltx/en_uk_lash/he.h.m6:heHE.ToTheioFengeiSou.name
ltx/en_uk_lash/me.m07.d01:meMA.Ode5C12.mode	@ltx/en_uk_lash/miscellanea:misc.Mode6
ltx/en_uk_lash/me.m07.d01:meMA.Ode5C12.ode	@ltx/en_uk_lash/miscellanea:misc.Ode5
ltx/en_uk_lash/me.m07.d01:meMA.Ode5C12.text	
ltx/en_uk_lash/me.m07.d01:meMA.Ode5C13.incipit	…
ltx/en_uk_lash/me.m07.d01:meMA.Ode5C13.melody	@ltx/en_uk_lash/he.h.m6:heHE.ToTheioFengeiSou.name
ltx/en_uk_lash/me.m07.d01:meMA.Ode5C13.mode	@ltx/en_uk_lash/miscellanea:misc.Mode6
ltx/en_uk_lash/me.m07.d01:meMA.Ode5C13.ode	@ltx/en_uk_lash/miscellanea:misc.Ode5
ltx/en_uk_lash/me.m07.d01:meMA.Ode5C13.text	
ltx/en_uk_lash/me.m07.d01:meMA.Ode5C1T.incipit	…
ltx/en_uk_lash/me.m07.d01:meMA.Ode5C1T.melody	@ltx/en_uk_lash/he.h.m6:heHE.ToTheioFengeiSou.name
ltx/en_uk_lash/me.m07.d01:meMA.Ode5C1T.mode	@ltx/en_uk_lash/miscellanea:misc.Mode6
ltx/en_uk_lash/me.m07.d01:meMA.Ode5C1T.ode	@ltx/en_uk_lash/miscellanea:misc.Ode5
ltx/en_uk_lash/me.m07.d01:meMA.Ode5C1T.text	
ltx/en_uk_lash/me.m07.d01:meMA.Ode6C11.greekmelody	@ltx/en_uk_lash/he.h.m6:heHE.TouViouTinThalassan.greekname
ltx/en_uk_lash/me.m07.d01:meMA.Ode6C11.incipit	…
ltx/en_uk_lash/me.m07.d01:meMA.Ode6C11.melody	@ltx/en_uk_lash/he.h.m6:heHE.TouViouTinThalassan.name
ltx/en_uk_lash/me.m07.d01:meMA.Ode6C11.mode	@ltx/en_uk_lash/miscellanea:misc.Mode6
ltx/en_uk_lash/me.m07.d01:meMA.Ode6C11.ode	@ltx/en_uk_lash/miscellanea:misc.Ode6
ltx/en_uk_lash/me.m07.d01:meMA.Ode6C11.text	
ltx/en_uk_lash/me.m07.d01:meMA.Ode6C12.incipit	…
ltx/en_uk_lash/me.m07.d01:meMA.Ode6C12.melody	@ltx/en_uk_lash/he.h.m6:heHE.TouViouTinThalassan.name
ltx/en_uk_lash/me.m07.d01:meMA.Ode6C12.mode	@ltx/en_uk_lash/miscellanea:misc.Mode6
ltx/en_uk_lash/me.m07.d01:meMA.Ode6C12.ode	@ltx/en_uk_lash/miscellanea:misc.Ode6
ltx/en_uk_lash/me.m07.d01:meMA.Ode6C12.text	
ltx/en_uk_lash/me.m07.d01:meMA.Ode6C13.incipit	…
ltx/en_uk_lash/me.m07.d01:meMA.Ode6C13.melody	@ltx/en_uk_lash/he.h.m6:heHE.TouViouTinThalassan.name
ltx/en_uk_lash/me.m07.d01:meMA.Ode6C13.mode	@ltx/en_uk_lash/miscellanea:misc.Mode6
ltx/en_uk_lash/me.m07.d01:meMA.Ode6C13.ode	@ltx/en_uk_lash/miscellanea:misc.Ode6
ltx/en_uk_lash/me.m07.d01:meMA.Ode6C13.text	
ltx/en_uk_lash/me.m07.d01:meMA.Ode6C1T.incipit	…
ltx/en_uk_lash/me.m07.d01:meMA.Ode6C1T.melody	@ltx/en_uk_lash/he.h.m6:heHE.TouViouTinThalassan.name
ltx/en_uk_lash/me.m07.d01:meMA.Ode6C1T.mode	@ltx/en_uk_lash/miscellanea:misc.Mode6
ltx/en_uk_lash/me.m07.d01:meMA.Ode6C1T.ode	@ltx/en_uk_lash/miscellanea:misc.Ode6
ltx/en_uk_lash/me.m07.d01:meMA.Ode6C1T.text	
ltx/en_uk_lash/me.m07.d01:meMA.Ode7C11.greekmelody	@ltx/en_uk_lash/he.h.m6:heHE.DrosovolonMenTinKaminon.greekname
ltx/en_uk_lash/me.m07.d01:meMA.Ode7C11.incipit	…
ltx/en_uk_lash/me.m07.d01:meMA.Ode7C11.melody	@ltx/en_uk_lash/he.h.m6:heHE.DrosovolonMenTinKaminon.name
ltx/en_uk_lash/me.m07.d01:meMA.Ode7C11.mode	@ltx/en_uk_lash/miscellanea:misc.Mode6
ltx/en_uk_lash/me.m07.d01:meMA.Ode7C11.ode	@ltx/en_uk_lash/miscellanea:misc.Ode7
ltx/en_uk_lash/me.m07.d01:meMA.Ode7C11.text	
ltx/en_uk_lash/me.m07.d01:meMA.Ode7C12.incipit	…
ltx/en_uk_lash/me.m07.d01:meMA.Ode7C12.melody	@ltx/en_uk_lash/he.h.m6:heHE.DrosovolonMenTinKaminon.name
ltx/en_uk_lash/me.m07.d01:meMA.Ode7C12.mode	@ltx/en_uk_lash/miscellanea:misc.Mode6
ltx/en_uk_lash/me.m07.d01:meMA.Ode7C12.ode	@ltx/en_uk_lash/miscellanea:misc.Ode7
ltx/en_uk_lash/me.m07.d01:meMA.Ode7C12.text	
ltx/en_uk_lash/me.m07.d01:meMA.Ode7C13.incipit	…
ltx/en_uk_lash/me.m07.d01:meMA.Ode7C13.melody	@ltx/en_uk_lash/he.h.m6:heHE.DrosovolonMenTinKaminon.name
ltx/en_uk_lash/me.m07.d01:meMA.Ode7C13.mode	@ltx/en_uk_lash/miscellanea:misc.Mode6
ltx/en_uk_lash/me.m07.d01:meMA.Ode7C13.ode	@ltx/en_uk_lash/miscellanea:misc.Ode7
ltx/en_uk_lash/me.m07.d01:meMA.Ode7C13.text	
ltx/en_uk_lash/me.m07.d01:meMA.Ode7C14.incipit	…
ltx/en_uk_lash/me.m07.d01:meMA.Ode7C14.melody	@ltx/en_uk_lash/he.h.m6:heHE.DrosovolonMenTinKaminon.name
ltx/en_uk_lash/me.m07.d01:meMA.Ode7C14.mode	@ltx/en_uk_lash/miscellanea:misc.Mode6
ltx/en_uk_lash/me.m07.d01:meMA.Ode7C14.ode	@ltx/en_uk_lash/miscellanea:misc.Ode7
ltx/en_uk_lash/me.m07.d01:meMA.Ode7C14.text	
ltx/en_uk_lash/me.m07.d01:meMA.Ode7C1T.incipit	…
ltx/en_uk_lash/me.m07.d01:meMA.Ode7C1T.melody	@ltx/en_uk_lash/he.h.m6:heHE.DrosovolonMenTinKaminon.name
ltx/en_uk_lash/me.m07.d01:meMA.Ode7C1T.mode	@ltx/en_uk_lash/miscellanea:misc.Mode6
ltx/en_uk_lash/me.m07.d01:meMA.Ode7C1T.ode	@ltx/en_uk_lash/miscellanea:misc.Ode7
ltx/en_uk_lash/me.m07.d01:meMA.Ode7C1T.text	
ltx/en_uk_lash/me.m07.d01:meMA.Ode8C11.greekmelody	@ltx/en_uk_lash/he.h.m6:heHE.EkFlogosToisOsiois.greekname
ltx/en_uk_lash/me.m07.d01:meMA.Ode8C11.incipit	…
ltx/en_uk_lash/me.m07.d01:meMA.Ode8C11.melody	@ltx/en_uk_lash/he.h.m6:heHE.EkFlogosToisOsiois.name
ltx/en_uk_lash/me.m07.d01:meMA.Ode8C11.mode	@ltx/en_uk_lash/miscellanea:misc.Mode6
ltx/en_uk_lash/me.m07.d01:meMA.Ode8C11.ode	@ltx/en_uk_lash/miscellanea:misc.Ode8
ltx/en_uk_lash/me.m07.d01:meMA.Ode8C11.text	
ltx/en_uk_lash/me.m07.d01:meMA.Ode8C12.incipit	…
ltx/en_uk_lash/me.m07.d01:meMA.Ode8C12.melody	@ltx/en_uk_lash/he.h.m6:heHE.EkFlogosToisOsiois.name
ltx/en_uk_lash/me.m07.d01:meMA.Ode8C12.mode	@ltx/en_uk_lash/miscellanea:misc.Mode6
ltx/en_uk_lash/me.m07.d01:meMA.Ode8C12.ode	@ltx/en_uk_lash/miscellanea:misc.Ode8
ltx/en_uk_lash/me.m07.d01:meMA.Ode8C12.text	
ltx/en_uk_lash/me.m07.d01:meMA.Ode8C13.incipit	…
ltx/en_uk_lash/me.m07.d01:meMA.Ode8C13.melody	@ltx/en_uk_lash/he.h.m6:heHE.EkFlogosToisOsiois.name
ltx/en_uk_lash/me.m07.d01:meMA.Ode8C13.mode	@ltx/en_uk_lash/miscellanea:misc.Mode6
ltx/en_uk_lash/me.m07.d01:meMA.Ode8C13.ode	@ltx/en_uk_lash/miscellanea:misc.Ode8
ltx/en_uk_lash/me.m07.d01:meMA.Ode8C13.text	
ltx/en_uk_lash/me.m07.d01:meMA.Ode8C14.incipit	…
ltx/en_uk_lash/me.m07.d01:meMA.Ode8C14.melody	@ltx/en_uk_lash/he.h.m6:heHE.EkFlogosToisOsiois.name
ltx/en_uk_lash/me.m07.d01:meMA.Ode8C14.mode	@ltx/en_uk_lash/miscellanea:misc.Mode6
ltx/en_uk_lash/me.m07.d01:meMA.Ode8C14.ode	@ltx/en_uk_lash/miscellanea:misc.Ode8
ltx/en_uk_lash/me.m07.d01:meMA.Ode8C14.text	
ltx/en_uk_lash/me.m07.d01:meMA.Ode8C15.incipit	…
ltx/en_uk_lash/me.m07.d01:meMA.Ode8C15.melody	@ltx/en_uk_lash/he.h.m6:heHE.EkFlogosToisOsiois.name
ltx/en_uk_lash/me.m07.d01:meMA.Ode8C15.mode	@ltx/en_uk_lash/miscellanea:misc.Mode6
ltx/en_uk_lash/me.m07.d01:meMA.Ode8C15.ode	@ltx/en_uk_lash/miscellanea:misc.Ode8
ltx/en_uk_lash/me.m07.d01:meMA.Ode8C15.text	
ltx/en_uk_lash/me.m07.d01:meMA.Ode8C1Tr.incipit	…
ltx/en_uk_lash/me.m07.d01:meMA.Ode8C1Tr.melody	@ltx/en_uk_lash/he.h.m6:heHE.EkFlogosToisOsiois.name
ltx/en_uk_lash/me.m07.d01:meMA.Ode8C1Tr.mode	@ltx/en_uk_lash/miscellanea:misc.Mode6
ltx/en_uk_lash/me.m07.d01:meMA.Ode8C1Tr.ode	@ltx/en_uk_lash/miscellanea:misc.Ode8
ltx/en_uk_lash/me.m07.d01:meMA.Ode8C1Tr.text	
ltx/en_uk_lash/me.m07.d01:meMA.Ode9C11.greekmelody	@ltx/en_uk_lash/he.h.m6:heHE.TheonAnthropois.greekname
ltx/en_uk_lash/me.m07.d01:meMA.Ode9C11.incipit	…
ltx/en_uk_lash/me.m07.d01:meMA.Ode9C11.melody	@ltx/en_uk_lash/he.h.m6:heHE.TheonAnthropois.name
ltx/en_uk_lash/me.m07.d01:meMA.Ode9C11.mode	@ltx/en_uk_lash/miscellanea:misc.Mode6
ltx/en_uk_lash/me.m07.d01:meMA.Ode9C11.ode	@ltx/en_uk_lash/miscellanea:misc.Ode9
ltx/en_uk_lash/me.m07.d01:meMA.Ode9C11.text	
ltx/en_uk_lash/me.m07.d01:meMA.Ode9C12.incipit	…
ltx/en_uk_lash/me.m07.d01:meMA.Ode9C12.melody	@ltx/en_uk_lash/he.h.m6:heHE.TheonAnthropois.name
ltx/en_uk_lash/me.m07.d01:meMA.Ode9C12.mode	@ltx/en_uk_lash/miscellanea:misc.Mode6
ltx/en_uk_lash/me.m07.d01:meMA.Ode9C12.ode	@ltx/en_uk_lash/miscellanea:misc.Ode9
ltx/en_uk_lash/me.m07.d01:meMA.Ode9C12.text	
ltx/en_uk_lash/me.m07.d01:meMA.Ode9C13.incipit	…
ltx/en_uk_lash/me.m07.d01:meMA.Ode9C13.melody	@ltx/en_uk_lash/he.h.m6:heHE.TheonAnthropois.name
ltx/en_uk_lash/me.m07.d01:meMA.Ode9C13.mode	@ltx/en_uk_lash/miscellanea:misc.Mode6
ltx/en_uk_lash/me.m07.d01:meMA.Ode9C13.ode	@ltx/en_uk_lash/miscellanea:misc.Ode9
ltx/en_uk_lash/me.m07.d01:meMA.Ode9C13.text	
ltx/en_uk_lash/me.m07.d01:meMA.Ode9C14.incipit	…
ltx/en_uk_lash/me.m07.d01:meMA.Ode9C14.melody	@ltx/en_uk_lash/he.h.m6:heHE.TheonAnthropois.name
ltx/en_uk_lash/me.m07.d01:meMA.Ode9C14.mode	@ltx/en_uk_lash/miscellanea:misc.Mode6
ltx/en_uk_lash/me.m07.d01:meMA.Ode9C14.ode	@ltx/en_uk_lash/miscellanea:misc.Ode9
ltx/en_uk_lash/me.m07.d01:meMA.Ode9C14.text	
ltx/en_uk_lash/me.m07.d01:meMA.Ode9C1T.incipit	…
ltx/en_uk_lash/me.m07.d01:meMA.Ode9C1T.melody	@ltx/en_uk_lash/he.h.m6:heHE.TheonAnthropois.name
ltx/en_uk_lash/me.m07.d01:meMA.Ode9C1T.mode	@ltx/en_uk_lash/miscellanea:misc.Mode6
ltx/en_uk_lash/me.m07.d01:meMA.Ode9C1T.ode	@ltx/en_uk_lash/miscellanea:misc.Ode9
ltx/en_uk_lash/me.m07.d01:meMA.Ode9C1T.text	
ltx/en_uk_lash/me.m07.d01:meMA.Oikos1.text	
ltx/en_uk_lash/me.m07.d01:meVE.Apolytikion1.incipit	Holy Unmercenaries and Wonderworkers, visit…
ltx/en_uk_lash/me.m07.d01:meVE.Apolytikion1.melody	
ltx/en_uk_lash/me.m07.d01:meVE.Apolytikion1.mode	@ltx/en_uk_lash/miscellanea:misc.Mode8
ltx/en_uk_lash/me.m07.d01:meVE.Apolytikion1.text	Holy Unmercenaries and Wonderworkers, visit our weaknesses; freely you have received, freely give to us.
ltx/en_uk_lash/me.m07.d01:meVE.AposGlory.incipit	Always having Christ active in you…
ltx/en_uk_lash/me.m07.d01:meVE.AposGlory.melody	
ltx/en_uk_lash/me.m07.d01:meVE.AposGlory.mode	@ltx/en_uk_lash/miscellanea:misc.Mode6
ltx/en_uk_lash/me.m07.d01:meVE.AposGlory.text	Always having Christ active in you, Unmercenary Saints, you work wonders in the world, curing the sick; for your surgery is an inexhaustible source; when drawn on, it overflows yet more; when poured out, it still runs over; emptied each day, each day filled up; giving to all, yet not failing; and those who draw receive their fill of remedies, and it remains unexhausted. What then shall we call you? Healing physicians of souls and bodies, healers of incurable sufferings, freely curing all, who have received gifts of grace from the Saviour Christ, who grants us his great mercy.
ltx/en_uk_lash/me.m07.d01:meVE.AposTheotokion.incipit	@ltx/en_uk_lash/he.o:heOT.TheotokeSyEi.incipit
ltx/en_uk_lash/me.m07.d01:meVE.AposTheotokion.melody	@ltx/en_uk_lash/he.o:heOT.TheotokeSyEi.name
ltx/en_uk_lash/me.m07.d01:meVE.AposTheotokion.mode	@ltx/en_uk_lash/miscellanea:misc.Mode6
ltx/en_uk_lash/me.m07.d01:meVE.AposTheotokion.text	@ltx/en_uk_lash/he.o:heOT.TheotokeSyEiAnargyron.text
ltx/en_uk_lash/me.m07.d01:meVE.Aposticha1.greekmelody	@ltx/en_uk_lash/he.a.m1:heAU.TonOuranionTagmaton.greekname
ltx/en_uk_lash/me.m07.d01:meVE.Aposticha1.incipit	…
ltx/en_uk_lash/me.m07.d01:meVE.Aposticha1.melody	@ltx/en_uk_lash/he.a.m1:heAU.TonOuranionTagmaton.notmetered
ltx/en_uk_lash/me.m07.d01:meVE.Aposticha1.mode	@ltx/en_uk_lash/miscellanea:misc.Mode1
ltx/en_uk_lash/me.m07.d01:meVE.Aposticha1.text	
ltx/en_uk_lash/me.m07.d01:meVE.Aposticha2.incipit	…
ltx/en_uk_lash/me.m07.d01:meVE.Aposticha2.melody	@ltx/en_uk_lash/he.a.m1:heAU.TonOuranionTagmaton.notmetered
ltx/en_uk_lash/me.m07.d01:meVE.Aposticha2.mode	@ltx/en_uk_lash/miscellanea:misc.Mode1
ltx/en_uk_lash/me.m07.d01:meVE.Aposticha2.text	
ltx/en_uk_lash/me.m07.d01:meVE.Aposticha3.incipit	…
ltx/en_uk_lash/me.m07.d01:meVE.Aposticha3.melody	@ltx/en_uk_lash/he.a.m1:heAU.TonOuranionTagmaton.notmetered
ltx/en_uk_lash/me.m07.d01:meVE.Aposticha3.mode	@ltx/en_uk_lash/miscellanea:misc.Mode1
ltx/en_uk_lash/me.m07.d01:meVE.Aposticha3.text	
ltx/en_uk_lash/me.m07.d01:meVE.Lity1.incipit	The source of remedies cured…
ltx/en_uk_lash/me.m07.d01:meVE.Lity1.melody	
ltx/en_uk_lash/me.m07.d01:meVE.Lity1.mode	@ltx/en_uk_lash/miscellanea:misc.Mode2
ltx/en_uk_lash/me.m07.d01:meVE.Lity1.text	The source of remedies cured one and only one each year; the tabernacle of the Unmercenary Saints cures the whole multitude of the sick; for the wealth of the Saints lacks nothing, is never exhausted. At their intercessions, O Christ, have mercy on us.
ltx/en_uk_lash/me.m07.d01:meVE.Lity2.incipit	With divine longing and love…
ltx/en_uk_lash/me.m07.d01:meVE.Lity2.melody	
ltx/en_uk_lash/me.m07.d01:meVE.Lity2.mode	@ltx/en_uk_lash/miscellanea:misc.Mode2
ltx/en_uk_lash/me.m07.d01:meVE.Lity2.text	With divine longing and love for things to come, your way of life was by practice and you passed through the roads of salvation. Therefore having kept your purity of soul unsullied, it left behind completely material things. While gilded by the divine Spirit, Unmercenary Saints, you grant healings to the sick, sacred pair, radiant couple, godlike enlightened twosome, visiting us in troubles and diseases and healing for no money the diseases of our souls.
ltx/en_uk_lash/me.m07.d01:meVE.Lity3.incipit	Made worthy of great gifts…
ltx/en_uk_lash/me.m07.d01:meVE.Lity3.melody	
ltx/en_uk_lash/me.m07.d01:meVE.Lity3.mode	@ltx/en_uk_lash/miscellanea:misc.Mode2
ltx/en_uk_lash/me.m07.d01:meVE.Lity3.text	Made worthy of great gifts, O All-praised, by the lowliness of your way of life; passing through all places healing the sufferings of the diseased freely, you appeared as companions of the Angels, Cosmas with wise Damian, kind brothers, and you heal our sufferings by your prayers.
ltx/en_uk_lash/me.m07.d01:meVE.Lity4.incipit	The choir of the Saints…
ltx/en_uk_lash/me.m07.d01:meVE.Lity4.melody	
ltx/en_uk_lash/me.m07.d01:meVE.Lity4.mode	@ltx/en_uk_lash/miscellanea:misc.Mode2
ltx/en_uk_lash/me.m07.d01:meVE.Lity4.text	The choir of the Saints rejoices to the ages; for they have inherited the kingdom of heaven. Earth has received their relics and is filled with sweet fragrance. Christ''s servants have taken up their dwelling for eternal life.
ltx/en_uk_lash/me.m07.d01:meVE.Lity5.incipit	Physicians of the sick, treasuries…
ltx/en_uk_lash/me.m07.d01:meVE.Lity5.melody	
ltx/en_uk_lash/me.m07.d01:meVE.Lity5.mode	@ltx/en_uk_lash/miscellanea:misc.Mode2
ltx/en_uk_lash/me.m07.d01:meVE.Lity5.text	Physicians of the sick, treasuries of remedies, saviours of believers, far-famed Unmercenaries, heal those who cry out in need and who suffer pain, as with Theodoti you intercede with the good God that we may be rescued from all the snares of the foe.
ltx/en_uk_lash/me.m07.d01:meVE.LityBoth.incipit	@ltx/en_uk_lash/he.o:heOT.TheotokeSyEi.incipit
ltx/en_uk_lash/me.m07.d01:meVE.LityBoth.melody	@ltx/en_uk_lash/he.o:heOT.TheotokeSyEi.name
ltx/en_uk_lash/me.m07.d01:meVE.LityBoth.mode	@ltx/en_uk_lash/miscellanea:misc.Mode6
ltx/en_uk_lash/me.m07.d01:meVE.LityBoth.text	@ltx/en_uk_lash/he.o:heOT.TheotokeSyEiAnargyron.text
ltx/en_uk_lash/me.m07.d01:meVE.LityGlory.incipit	…
ltx/en_uk_lash/me.m07.d01:meVE.LityGlory.melody	
ltx/en_uk_lash/me.m07.d01:meVE.LityGlory.mode	@ltx/en_uk_lash/miscellanea:misc.Mode6
ltx/en_uk_lash/me.m07.d01:meVE.LityGlory.text	
ltx/en_uk_lash/me.m07.d01:meVE.SticGlory.incipit	Unlimited is the grace…
ltx/en_uk_lash/me.m07.d01:meVE.SticGlory.melody	
ltx/en_uk_lash/me.m07.d01:meVE.SticGlory.mode	@ltx/en_uk_lash/miscellanea:misc.Mode6
ltx/en_uk_lash/me.m07.d01:meVE.SticGlory.poet	@ltx/en_uk_lash/poets:po.Anatoliou
ltx/en_uk_lash/me.m07.d01:meVE.SticGlory.text	Unlimited is the grace of the Saints, which they obtained from Christ; therefore their relics too, by divine power, unceasingly act by wonders; whose names alone too, when invoked with faith, drive away incurable pains; through them, Lord, free us too from the passions of soul and body, as you love mankind.
ltx/en_uk_lash/me.m07.d01:meVE.SticTheotokion.incipit	@ltx/en_uk_lash/oc.m6.d1:ocVE.SticTheotokion.incipit
ltx/en_uk_lash/me.m07.d01:meVE.SticTheotokion.melody	
ltx/en_uk_lash/me.m07.d01:meVE.SticTheotokion.mode	@ltx/en_uk_lash/miscellanea:misc.Mode6
ltx/en_uk_lash/me.m07.d01:meVE.SticTheotokion.text	@ltx/en_uk_lash/oc.m6.d1:ocVE.SticTheotokion.text
ltx/en_uk_lash/me.m07.d01:meVE.Stichera01.greekmelody	@ltx/en_uk_lash/he.a.m6:heAU.OlinApothemenoi.greekname
ltx/en_uk_lash/me.m07.d01:meVE.Stichera01.incipit	@ltx/en_uk_lash/he.a.m6:heAU.OlinApothemenoi.incipit
ltx/en_uk_lash/me.m07.d01:meVE.Stichera01.melody	@ltx/en_uk_lash/he.a.m6:heAU.OlinApothemenoi.melody
ltx/en_uk_lash/me.m07.d01:meVE.Stichera01.mode	@ltx/en_uk_lash/miscellanea:misc.Mode6
ltx/en_uk_lash/me.m07.d01:meVE.Stichera01.text	@ltx/en_uk_lash/he.a.m6:heAU.OlinApothemenoi.text
ltx/en_uk_lash/me.m07.d01:meVE.Stichera02.incipit	They spurned all perishable matter…
ltx/en_uk_lash/me.m07.d01:meVE.Stichera02.melody	@ltx/en_uk_lash/he.a.m6:heAU.OlinApothemenoi.notmetered
ltx/en_uk_lash/me.m07.d01:meVE.Stichera02.mode	@ltx/en_uk_lash/miscellanea:misc.Mode6
ltx/en_uk_lash/me.m07.d01:meVE.Stichera02.text	They spurned all perishable matter on earth, while like Angels in the flesh they were declared citizens of heaven, the united comradeship, the like-minded and harmonious pair of saints. And so to all who suffer they award healings, granting their kindness without payment for the needy. Let us worthily sing their praise with yearly feasts as they intercede with confidence on behalf of our souls.
ltx/en_uk_lash/me.m07.d01:meVE.Stichera03.incipit	Bringing all the Trinity…
ltx/en_uk_lash/me.m07.d01:meVE.Stichera03.melody	@ltx/en_uk_lash/he.a.m6:heAU.OlinApothemenoi.notmetered
ltx/en_uk_lash/me.m07.d01:meVE.Stichera03.mode	@ltx/en_uk_lash/miscellanea:misc.Mode6
ltx/en_uk_lash/me.m07.d01:meVE.Stichera03.text	Bringing all the Trinity to dwell in them, the holy pair, inspired Cosmas and Damian, like fountains pour out waters of healings from a life-bearing source; whose relics too heal passions through a touch; and their names alone drive sicknesses from mortals; they are saviours for all who flee to them as they intercede to Christ with boldness on behalf of our souls.
