ltx/en_uk_lash/tr.d063:trCO.C1.poet	@ltx/en_uk_lash/poets:po.AndreouKritis
ltx/en_uk_lash/tr.d063:trCO.C1.title	Canon for Lazarus
ltx/en_uk_lash/tr.d063:trCO.C1.verse	@ltx/en_uk_lash/prayers:pr.verse_God.text
ltx/en_uk_lash/tr.d063:trCO.Ode1C11.incipit	…
ltx/en_uk_lash/tr.d063:trCO.Ode1C11.melody	@ltx/en_uk_lash/he.h.m1:heHE.OdinEpinikion.name
ltx/en_uk_lash/tr.d063:trCO.Ode1C11.mode	@ltx/en_uk_lash/miscellanea:misc.Mode1
ltx/en_uk_lash/tr.d063:trCO.Ode1C11.ode	@ltx/en_uk_lash/miscellanea:misc.Ode1
ltx/en_uk_lash/tr.d063:trCO.Ode1C11.text	
ltx/en_uk_lash/tr.d063:trCO.Ode1C12.incipit	…
ltx/en_uk_lash/tr.d063:trCO.Ode1C12.melody	@ltx/en_uk_lash/he.h.m1:heHE.OdinEpinikion.name
ltx/en_uk_lash/tr.d063:trCO.Ode1C12.mode	@ltx/en_uk_lash/miscellanea:misc.Mode1
ltx/en_uk_lash/tr.d063:trCO.Ode1C12.ode	@ltx/en_uk_lash/miscellanea:misc.Ode1
ltx/en_uk_lash/tr.d063:trCO.Ode1C12.text	
ltx/en_uk_lash/tr.d063:trCO.Ode1C13.incipit	…
ltx/en_uk_lash/tr.d063:trCO.Ode1C13.melody	@ltx/en_uk_lash/he.h.m1:heHE.OdinEpinikion.name
ltx/en_uk_lash/tr.d063:trCO.Ode1C13.mode	@ltx/en_uk_lash/miscellanea:misc.Mode1
ltx/en_uk_lash/tr.d063:trCO.Ode1C13.ode	@ltx/en_uk_lash/miscellanea:misc.Ode1
ltx/en_uk_lash/tr.d063:trCO.Ode1C13.text	
ltx/en_uk_lash/tr.d063:trCO.Ode1C14.incipit	…
ltx/en_uk_lash/tr.d063:trCO.Ode1C14.melody	@ltx/en_uk_lash/he.h.m1:heHE.OdinEpinikion.name
ltx/en_uk_lash/tr.d063:trCO.Ode1C14.mode	@ltx/en_uk_lash/miscellanea:misc.Mode1
ltx/en_uk_lash/tr.d063:trCO.Ode1C14.ode	@ltx/en_uk_lash/miscellanea:misc.Ode1
ltx/en_uk_lash/tr.d063:trCO.Ode1C14.text	
ltx/en_uk_lash/tr.d063:trCO.Ode1C15.incipit	…
ltx/en_uk_lash/tr.d063:trCO.Ode1C15.melody	@ltx/en_uk_lash/he.h.m1:heHE.OdinEpinikion.name
ltx/en_uk_lash/tr.d063:trCO.Ode1C15.mode	@ltx/en_uk_lash/miscellanea:misc.Mode1
ltx/en_uk_lash/tr.d063:trCO.Ode1C15.ode	@ltx/en_uk_lash/miscellanea:misc.Ode1
ltx/en_uk_lash/tr.d063:trCO.Ode1C15.text	
ltx/en_uk_lash/tr.d063:trCO.Ode1C16.incipit	…
ltx/en_uk_lash/tr.d063:trCO.Ode1C16.melody	@ltx/en_uk_lash/he.h.m1:heHE.OdinEpinikion.name
ltx/en_uk_lash/tr.d063:trCO.Ode1C16.mode	@ltx/en_uk_lash/miscellanea:misc.Mode1
ltx/en_uk_lash/tr.d063:trCO.Ode1C16.ode	@ltx/en_uk_lash/miscellanea:misc.Ode1
ltx/en_uk_lash/tr.d063:trCO.Ode1C16.text	
ltx/en_uk_lash/tr.d063:trCO.Ode1C17.incipit	…
ltx/en_uk_lash/tr.d063:trCO.Ode1C17.melody	@ltx/en_uk_lash/he.h.m1:heHE.OdinEpinikion.name
ltx/en_uk_lash/tr.d063:trCO.Ode1C17.mode	@ltx/en_uk_lash/miscellanea:misc.Mode1
ltx/en_uk_lash/tr.d063:trCO.Ode1C17.ode	@ltx/en_uk_lash/miscellanea:misc.Ode1
ltx/en_uk_lash/tr.d063:trCO.Ode1C17.text	
ltx/en_uk_lash/tr.d063:trCO.Ode1C1H.incipit	@ltx/en_uk_lash/he.h.m1:heHE.OdinEpinikion.incipit
ltx/en_uk_lash/tr.d063:trCO.Ode1C1H.melody	@ltx/en_uk_lash/he.h.m1:heHE.OdinEpinikion.melody
ltx/en_uk_lash/tr.d063:trCO.Ode1C1H.mode	@ltx/en_uk_lash/miscellanea:misc.Mode1
ltx/en_uk_lash/tr.d063:trCO.Ode1C1H.ode	@ltx/en_uk_lash/miscellanea:misc.Ode1
ltx/en_uk_lash/tr.d063:trCO.Ode1C1H.text	@ltx/en_uk_lash/he.h.m1:heHE.OdinEpinikion.text
ltx/en_uk_lash/tr.d063:trCO.Ode1C1T.incipit	…
ltx/en_uk_lash/tr.d063:trCO.Ode1C1T.melody	@ltx/en_uk_lash/he.h.m1:heHE.OdinEpinikion.name
ltx/en_uk_lash/tr.d063:trCO.Ode1C1T.mode	@ltx/en_uk_lash/miscellanea:misc.Mode1
ltx/en_uk_lash/tr.d063:trCO.Ode1C1T.ode	@ltx/en_uk_lash/miscellanea:misc.Ode1
ltx/en_uk_lash/tr.d063:trCO.Ode1C1T.text	
ltx/en_uk_lash/tr.d063:trCO.Ode1C1Tr.incipit	…
ltx/en_uk_lash/tr.d063:trCO.Ode1C1Tr.melody	@ltx/en_uk_lash/he.h.m1:heHE.OdinEpinikion.name
ltx/en_uk_lash/tr.d063:trCO.Ode1C1Tr.mode	@ltx/en_uk_lash/miscellanea:misc.Mode1
ltx/en_uk_lash/tr.d063:trCO.Ode1C1Tr.ode	@ltx/en_uk_lash/miscellanea:misc.Ode1
ltx/en_uk_lash/tr.d063:trCO.Ode1C1Tr.text	
ltx/en_uk_lash/tr.d063:trCO.Ode2C11.incipit	…
ltx/en_uk_lash/tr.d063:trCO.Ode2C11.melody	@ltx/en_uk_lash/he.h.m1:heHE.ProsecheOuraneKaiLaliso.name
ltx/en_uk_lash/tr.d063:trCO.Ode2C11.mode	@ltx/en_uk_lash/miscellanea:misc.Mode1
ltx/en_uk_lash/tr.d063:trCO.Ode2C11.ode	@ltx/en_uk_lash/miscellanea:misc.Ode2
ltx/en_uk_lash/tr.d063:trCO.Ode2C11.text	
ltx/en_uk_lash/tr.d063:trCO.Ode2C12.incipit	…
ltx/en_uk_lash/tr.d063:trCO.Ode2C12.melody	@ltx/en_uk_lash/he.h.m1:heHE.ProsecheOuraneKaiLaliso.name
ltx/en_uk_lash/tr.d063:trCO.Ode2C12.mode	@ltx/en_uk_lash/miscellanea:misc.Mode1
ltx/en_uk_lash/tr.d063:trCO.Ode2C12.ode	@ltx/en_uk_lash/miscellanea:misc.Ode2
ltx/en_uk_lash/tr.d063:trCO.Ode2C12.text	
ltx/en_uk_lash/tr.d063:trCO.Ode2C13.incipit	…
ltx/en_uk_lash/tr.d063:trCO.Ode2C13.melody	@ltx/en_uk_lash/he.h.m1:heHE.ProsecheOuraneKaiLaliso.name
ltx/en_uk_lash/tr.d063:trCO.Ode2C13.mode	@ltx/en_uk_lash/miscellanea:misc.Mode1
ltx/en_uk_lash/tr.d063:trCO.Ode2C13.ode	@ltx/en_uk_lash/miscellanea:misc.Ode2
ltx/en_uk_lash/tr.d063:trCO.Ode2C13.text	
ltx/en_uk_lash/tr.d063:trCO.Ode2C14.incipit	…
ltx/en_uk_lash/tr.d063:trCO.Ode2C14.melody	@ltx/en_uk_lash/he.h.m1:heHE.ProsecheOuraneKaiLaliso.name
ltx/en_uk_lash/tr.d063:trCO.Ode2C14.mode	@ltx/en_uk_lash/miscellanea:misc.Mode1
ltx/en_uk_lash/tr.d063:trCO.Ode2C14.ode	@ltx/en_uk_lash/miscellanea:misc.Ode2
ltx/en_uk_lash/tr.d063:trCO.Ode2C14.text	
ltx/en_uk_lash/tr.d063:trCO.Ode2C15.incipit	…
ltx/en_uk_lash/tr.d063:trCO.Ode2C15.melody	@ltx/en_uk_lash/he.h.m1:heHE.ProsecheOuraneKaiLaliso.name
ltx/en_uk_lash/tr.d063:trCO.Ode2C15.mode	@ltx/en_uk_lash/miscellanea:misc.Mode1
ltx/en_uk_lash/tr.d063:trCO.Ode2C15.ode	@ltx/en_uk_lash/miscellanea:misc.Ode2
ltx/en_uk_lash/tr.d063:trCO.Ode2C15.text	
ltx/en_uk_lash/tr.d063:trCO.Ode2C1H.incipit	@ltx/en_uk_lash/he.h.m1:heHE.ProsecheOuraneKaiLaliso.incipit
ltx/en_uk_lash/tr.d063:trCO.Ode2C1H.melody	@ltx/en_uk_lash/he.h.m1:heHE.ProsecheOuraneKaiLaliso.melody
ltx/en_uk_lash/tr.d063:trCO.Ode2C1H.mode	@ltx/en_uk_lash/miscellanea:misc.Mode1
ltx/en_uk_lash/tr.d063:trCO.Ode2C1H.ode	@ltx/en_uk_lash/miscellanea:misc.Ode2
ltx/en_uk_lash/tr.d063:trCO.Ode2C1H.text	@ltx/en_uk_lash/he.h.m1:heHE.ProsecheOuraneKaiLaliso.text
ltx/en_uk_lash/tr.d063:trCO.Ode2C1T.incipit	…
ltx/en_uk_lash/tr.d063:trCO.Ode2C1T.melody	@ltx/en_uk_lash/he.h.m1:heHE.ProsecheOuraneKaiLaliso.name
ltx/en_uk_lash/tr.d063:trCO.Ode2C1T.mode	@ltx/en_uk_lash/miscellanea:misc.Mode1
ltx/en_uk_lash/tr.d063:trCO.Ode2C1T.ode	@ltx/en_uk_lash/miscellanea:misc.Ode2
ltx/en_uk_lash/tr.d063:trCO.Ode2C1T.text	
ltx/en_uk_lash/tr.d063:trCO.Ode2C1Tr.incipit	…
ltx/en_uk_lash/tr.d063:trCO.Ode2C1Tr.melody	@ltx/en_uk_lash/he.h.m1:heHE.ProsecheOuraneKaiLaliso.name
ltx/en_uk_lash/tr.d063:trCO.Ode2C1Tr.mode	@ltx/en_uk_lash/miscellanea:misc.Mode1
ltx/en_uk_lash/tr.d063:trCO.Ode2C1Tr.ode	@ltx/en_uk_lash/miscellanea:misc.Ode2
ltx/en_uk_lash/tr.d063:trCO.Ode2C1Tr.text	
ltx/en_uk_lash/tr.d063:trCO.Ode3C11.incipit	…
ltx/en_uk_lash/tr.d063:trCO.Ode3C11.melody	@ltx/en_uk_lash/he.h.m1:heHE.LithonOnApedokimasan.name
ltx/en_uk_lash/tr.d063:trCO.Ode3C11.mode	@ltx/en_uk_lash/miscellanea:misc.Mode1
ltx/en_uk_lash/tr.d063:trCO.Ode3C11.ode	@ltx/en_uk_lash/miscellanea:misc.Ode3
ltx/en_uk_lash/tr.d063:trCO.Ode3C11.text	
ltx/en_uk_lash/tr.d063:trCO.Ode3C12.incipit	…
ltx/en_uk_lash/tr.d063:trCO.Ode3C12.melody	@ltx/en_uk_lash/he.h.m1:heHE.LithonOnApedokimasan.name
ltx/en_uk_lash/tr.d063:trCO.Ode3C12.mode	@ltx/en_uk_lash/miscellanea:misc.Mode1
ltx/en_uk_lash/tr.d063:trCO.Ode3C12.ode	@ltx/en_uk_lash/miscellanea:misc.Ode3
ltx/en_uk_lash/tr.d063:trCO.Ode3C12.text	
ltx/en_uk_lash/tr.d063:trCO.Ode3C13.incipit	…
ltx/en_uk_lash/tr.d063:trCO.Ode3C13.melody	@ltx/en_uk_lash/he.h.m1:heHE.LithonOnApedokimasan.name
ltx/en_uk_lash/tr.d063:trCO.Ode3C13.mode	@ltx/en_uk_lash/miscellanea:misc.Mode1
ltx/en_uk_lash/tr.d063:trCO.Ode3C13.ode	@ltx/en_uk_lash/miscellanea:misc.Ode3
ltx/en_uk_lash/tr.d063:trCO.Ode3C13.text	
ltx/en_uk_lash/tr.d063:trCO.Ode3C14.incipit	…
ltx/en_uk_lash/tr.d063:trCO.Ode3C14.melody	@ltx/en_uk_lash/he.h.m1:heHE.LithonOnApedokimasan.name
ltx/en_uk_lash/tr.d063:trCO.Ode3C14.mode	@ltx/en_uk_lash/miscellanea:misc.Mode1
ltx/en_uk_lash/tr.d063:trCO.Ode3C14.ode	@ltx/en_uk_lash/miscellanea:misc.Ode3
ltx/en_uk_lash/tr.d063:trCO.Ode3C14.text	
ltx/en_uk_lash/tr.d063:trCO.Ode3C15.incipit	…
ltx/en_uk_lash/tr.d063:trCO.Ode3C15.melody	@ltx/en_uk_lash/he.h.m1:heHE.LithonOnApedokimasan.name
ltx/en_uk_lash/tr.d063:trCO.Ode3C15.mode	@ltx/en_uk_lash/miscellanea:misc.Mode1
ltx/en_uk_lash/tr.d063:trCO.Ode3C15.ode	@ltx/en_uk_lash/miscellanea:misc.Ode3
ltx/en_uk_lash/tr.d063:trCO.Ode3C15.text	
ltx/en_uk_lash/tr.d063:trCO.Ode3C16.incipit	…
ltx/en_uk_lash/tr.d063:trCO.Ode3C16.melody	@ltx/en_uk_lash/he.h.m1:heHE.LithonOnApedokimasan.name
ltx/en_uk_lash/tr.d063:trCO.Ode3C16.mode	@ltx/en_uk_lash/miscellanea:misc.Mode1
ltx/en_uk_lash/tr.d063:trCO.Ode3C16.ode	@ltx/en_uk_lash/miscellanea:misc.Ode3
ltx/en_uk_lash/tr.d063:trCO.Ode3C16.text	
ltx/en_uk_lash/tr.d063:trCO.Ode3C1H.incipit	@ltx/en_uk_lash/he.h.m1:heHE.LithonOnApedokimasan.incipit
ltx/en_uk_lash/tr.d063:trCO.Ode3C1H.melody	@ltx/en_uk_lash/he.h.m1:heHE.LithonOnApedokimasan.melody
ltx/en_uk_lash/tr.d063:trCO.Ode3C1H.mode	@ltx/en_uk_lash/miscellanea:misc.Mode1
ltx/en_uk_lash/tr.d063:trCO.Ode3C1H.ode	@ltx/en_uk_lash/miscellanea:misc.Ode3
ltx/en_uk_lash/tr.d063:trCO.Ode3C1H.text	@ltx/en_uk_lash/he.h.m1:heHE.LithonOnApedokimasan.text
ltx/en_uk_lash/tr.d063:trCO.Ode3C1T.incipit	…
ltx/en_uk_lash/tr.d063:trCO.Ode3C1T.melody	@ltx/en_uk_lash/he.h.m1:heHE.LithonOnApedokimasan.name
ltx/en_uk_lash/tr.d063:trCO.Ode3C1T.mode	@ltx/en_uk_lash/miscellanea:misc.Mode1
ltx/en_uk_lash/tr.d063:trCO.Ode3C1T.ode	@ltx/en_uk_lash/miscellanea:misc.Ode3
ltx/en_uk_lash/tr.d063:trCO.Ode3C1T.text	
ltx/en_uk_lash/tr.d063:trCO.Ode3C1Tr.incipit	…
ltx/en_uk_lash/tr.d063:trCO.Ode3C1Tr.melody	@ltx/en_uk_lash/he.h.m1:heHE.LithonOnApedokimasan.name
ltx/en_uk_lash/tr.d063:trCO.Ode3C1Tr.mode	@ltx/en_uk_lash/miscellanea:misc.Mode1
ltx/en_uk_lash/tr.d063:trCO.Ode3C1Tr.ode	@ltx/en_uk_lash/miscellanea:misc.Ode3
ltx/en_uk_lash/tr.d063:trCO.Ode3C1Tr.text	
ltx/en_uk_lash/tr.d063:trCO.Ode4C11.incipit	…
ltx/en_uk_lash/tr.d063:trCO.Ode4C11.melody	@ltx/en_uk_lash/he.h.m1:heHE.EpirthiOIlios.name
ltx/en_uk_lash/tr.d063:trCO.Ode4C11.mode	@ltx/en_uk_lash/miscellanea:misc.Mode1
ltx/en_uk_lash/tr.d063:trCO.Ode4C11.ode	@ltx/en_uk_lash/miscellanea:misc.Ode4
ltx/en_uk_lash/tr.d063:trCO.Ode4C11.text	
ltx/en_uk_lash/tr.d063:trCO.Ode4C12.incipit	…
ltx/en_uk_lash/tr.d063:trCO.Ode4C12.melody	@ltx/en_uk_lash/he.h.m1:heHE.EpirthiOIlios.name
ltx/en_uk_lash/tr.d063:trCO.Ode4C12.mode	@ltx/en_uk_lash/miscellanea:misc.Mode1
ltx/en_uk_lash/tr.d063:trCO.Ode4C12.ode	@ltx/en_uk_lash/miscellanea:misc.Ode4
ltx/en_uk_lash/tr.d063:trCO.Ode4C12.text	
ltx/en_uk_lash/tr.d063:trCO.Ode4C13.incipit	…
ltx/en_uk_lash/tr.d063:trCO.Ode4C13.melody	@ltx/en_uk_lash/he.h.m1:heHE.EpirthiOIlios.name
ltx/en_uk_lash/tr.d063:trCO.Ode4C13.mode	@ltx/en_uk_lash/miscellanea:misc.Mode1
ltx/en_uk_lash/tr.d063:trCO.Ode4C13.ode	@ltx/en_uk_lash/miscellanea:misc.Ode4
ltx/en_uk_lash/tr.d063:trCO.Ode4C13.text	
ltx/en_uk_lash/tr.d063:trCO.Ode4C14.incipit	…
ltx/en_uk_lash/tr.d063:trCO.Ode4C14.melody	@ltx/en_uk_lash/he.h.m1:heHE.EpirthiOIlios.name
ltx/en_uk_lash/tr.d063:trCO.Ode4C14.mode	@ltx/en_uk_lash/miscellanea:misc.Mode1
ltx/en_uk_lash/tr.d063:trCO.Ode4C14.ode	@ltx/en_uk_lash/miscellanea:misc.Ode4
ltx/en_uk_lash/tr.d063:trCO.Ode4C14.text	
ltx/en_uk_lash/tr.d063:trCO.Ode4C15.incipit	…
ltx/en_uk_lash/tr.d063:trCO.Ode4C15.melody	@ltx/en_uk_lash/he.h.m1:heHE.EpirthiOIlios.name
ltx/en_uk_lash/tr.d063:trCO.Ode4C15.mode	@ltx/en_uk_lash/miscellanea:misc.Mode1
ltx/en_uk_lash/tr.d063:trCO.Ode4C15.ode	@ltx/en_uk_lash/miscellanea:misc.Ode4
ltx/en_uk_lash/tr.d063:trCO.Ode4C15.text	
ltx/en_uk_lash/tr.d063:trCO.Ode4C16.incipit	…
ltx/en_uk_lash/tr.d063:trCO.Ode4C16.melody	@ltx/en_uk_lash/he.h.m1:heHE.EpirthiOIlios.name
ltx/en_uk_lash/tr.d063:trCO.Ode4C16.mode	@ltx/en_uk_lash/miscellanea:misc.Mode1
ltx/en_uk_lash/tr.d063:trCO.Ode4C16.ode	@ltx/en_uk_lash/miscellanea:misc.Ode4
ltx/en_uk_lash/tr.d063:trCO.Ode4C16.text	
ltx/en_uk_lash/tr.d063:trCO.Ode4C17.incipit	…
ltx/en_uk_lash/tr.d063:trCO.Ode4C17.melody	@ltx/en_uk_lash/he.h.m1:heHE.EpirthiOIlios.name
ltx/en_uk_lash/tr.d063:trCO.Ode4C17.mode	@ltx/en_uk_lash/miscellanea:misc.Mode1
ltx/en_uk_lash/tr.d063:trCO.Ode4C17.ode	@ltx/en_uk_lash/miscellanea:misc.Ode4
ltx/en_uk_lash/tr.d063:trCO.Ode4C17.text	
ltx/en_uk_lash/tr.d063:trCO.Ode4C18.incipit	…
ltx/en_uk_lash/tr.d063:trCO.Ode4C18.melody	@ltx/en_uk_lash/he.h.m1:heHE.EpirthiOIlios.name
ltx/en_uk_lash/tr.d063:trCO.Ode4C18.mode	@ltx/en_uk_lash/miscellanea:misc.Mode1
ltx/en_uk_lash/tr.d063:trCO.Ode4C18.ode	@ltx/en_uk_lash/miscellanea:misc.Ode4
ltx/en_uk_lash/tr.d063:trCO.Ode4C18.text	
ltx/en_uk_lash/tr.d063:trCO.Ode4C19.incipit	…
ltx/en_uk_lash/tr.d063:trCO.Ode4C19.melody	@ltx/en_uk_lash/he.h.m1:heHE.EpirthiOIlios.name
ltx/en_uk_lash/tr.d063:trCO.Ode4C19.mode	@ltx/en_uk_lash/miscellanea:misc.Mode1
ltx/en_uk_lash/tr.d063:trCO.Ode4C19.ode	@ltx/en_uk_lash/miscellanea:misc.Ode4
ltx/en_uk_lash/tr.d063:trCO.Ode4C19.text	
ltx/en_uk_lash/tr.d063:trCO.Ode4C1H.incipit	@ltx/en_uk_lash/he.h.m1:heHE.EpirthiOIlios.incipit
ltx/en_uk_lash/tr.d063:trCO.Ode4C1H.melody	@ltx/en_uk_lash/he.h.m1:heHE.EpirthiOIlios.melody
ltx/en_uk_lash/tr.d063:trCO.Ode4C1H.mode	@ltx/en_uk_lash/miscellanea:misc.Mode1
ltx/en_uk_lash/tr.d063:trCO.Ode4C1H.ode	@ltx/en_uk_lash/miscellanea:misc.Ode4
ltx/en_uk_lash/tr.d063:trCO.Ode4C1H.text	@ltx/en_uk_lash/he.h.m1:heHE.EpirthiOIlios.text
ltx/en_uk_lash/tr.d063:trCO.Ode4C1T.incipit	…
ltx/en_uk_lash/tr.d063:trCO.Ode4C1T.melody	@ltx/en_uk_lash/he.h.m1:heHE.EpirthiOIlios.name
ltx/en_uk_lash/tr.d063:trCO.Ode4C1T.mode	@ltx/en_uk_lash/miscellanea:misc.Mode1
ltx/en_uk_lash/tr.d063:trCO.Ode4C1T.ode	@ltx/en_uk_lash/miscellanea:misc.Ode4
ltx/en_uk_lash/tr.d063:trCO.Ode4C1T.text	
ltx/en_uk_lash/tr.d063:trCO.Ode4C1Tr.incipit	…
ltx/en_uk_lash/tr.d063:trCO.Ode4C1Tr.melody	@ltx/en_uk_lash/he.h.m1:heHE.EpirthiOIlios.name
ltx/en_uk_lash/tr.d063:trCO.Ode4C1Tr.mode	@ltx/en_uk_lash/miscellanea:misc.Mode1
ltx/en_uk_lash/tr.d063:trCO.Ode4C1Tr.ode	@ltx/en_uk_lash/miscellanea:misc.Ode4
ltx/en_uk_lash/tr.d063:trCO.Ode4C1Tr.text	
ltx/en_uk_lash/tr.d063:trCO.Ode5C11.incipit	…
ltx/en_uk_lash/tr.d063:trCO.Ode5C11.melody	@ltx/en_uk_lash/he.h.m1:heHE.TinSinEirinin.name
ltx/en_uk_lash/tr.d063:trCO.Ode5C11.mode	@ltx/en_uk_lash/miscellanea:misc.Mode1
ltx/en_uk_lash/tr.d063:trCO.Ode5C11.ode	@ltx/en_uk_lash/miscellanea:misc.Ode5
ltx/en_uk_lash/tr.d063:trCO.Ode5C11.text	
ltx/en_uk_lash/tr.d063:trCO.Ode5C12.incipit	…
ltx/en_uk_lash/tr.d063:trCO.Ode5C12.melody	@ltx/en_uk_lash/he.h.m1:heHE.TinSinEirinin.name
ltx/en_uk_lash/tr.d063:trCO.Ode5C12.mode	@ltx/en_uk_lash/miscellanea:misc.Mode1
ltx/en_uk_lash/tr.d063:trCO.Ode5C12.ode	@ltx/en_uk_lash/miscellanea:misc.Ode5
ltx/en_uk_lash/tr.d063:trCO.Ode5C12.text	
ltx/en_uk_lash/tr.d063:trCO.Ode5C13.incipit	…
ltx/en_uk_lash/tr.d063:trCO.Ode5C13.melody	@ltx/en_uk_lash/he.h.m1:heHE.TinSinEirinin.name
ltx/en_uk_lash/tr.d063:trCO.Ode5C13.mode	@ltx/en_uk_lash/miscellanea:misc.Mode1
ltx/en_uk_lash/tr.d063:trCO.Ode5C13.ode	@ltx/en_uk_lash/miscellanea:misc.Ode5
ltx/en_uk_lash/tr.d063:trCO.Ode5C13.text	
ltx/en_uk_lash/tr.d063:trCO.Ode5C14.incipit	…
ltx/en_uk_lash/tr.d063:trCO.Ode5C14.melody	@ltx/en_uk_lash/he.h.m1:heHE.TinSinEirinin.name
ltx/en_uk_lash/tr.d063:trCO.Ode5C14.mode	@ltx/en_uk_lash/miscellanea:misc.Mode1
ltx/en_uk_lash/tr.d063:trCO.Ode5C14.ode	@ltx/en_uk_lash/miscellanea:misc.Ode5
ltx/en_uk_lash/tr.d063:trCO.Ode5C14.text	
ltx/en_uk_lash/tr.d063:trCO.Ode5C15.incipit	…
ltx/en_uk_lash/tr.d063:trCO.Ode5C15.melody	@ltx/en_uk_lash/he.h.m1:heHE.TinSinEirinin.name
ltx/en_uk_lash/tr.d063:trCO.Ode5C15.mode	@ltx/en_uk_lash/miscellanea:misc.Mode1
ltx/en_uk_lash/tr.d063:trCO.Ode5C15.ode	@ltx/en_uk_lash/miscellanea:misc.Ode5
ltx/en_uk_lash/tr.d063:trCO.Ode5C15.text	
ltx/en_uk_lash/tr.d063:trCO.Ode5C16.incipit	…
ltx/en_uk_lash/tr.d063:trCO.Ode5C16.melody	@ltx/en_uk_lash/he.h.m1:heHE.TinSinEirinin.name
ltx/en_uk_lash/tr.d063:trCO.Ode5C16.mode	@ltx/en_uk_lash/miscellanea:misc.Mode1
ltx/en_uk_lash/tr.d063:trCO.Ode5C16.ode	@ltx/en_uk_lash/miscellanea:misc.Ode5
ltx/en_uk_lash/tr.d063:trCO.Ode5C16.text	
ltx/en_uk_lash/tr.d063:trCO.Ode5C1H.incipit	@ltx/en_uk_lash/he.h.m1:heHE.TinSinEirinin.incipit
ltx/en_uk_lash/tr.d063:trCO.Ode5C1H.melody	@ltx/en_uk_lash/he.h.m1:heHE.TinSinEirinin.melody
ltx/en_uk_lash/tr.d063:trCO.Ode5C1H.mode	@ltx/en_uk_lash/miscellanea:misc.Mode1
ltx/en_uk_lash/tr.d063:trCO.Ode5C1H.ode	@ltx/en_uk_lash/miscellanea:misc.Ode5
ltx/en_uk_lash/tr.d063:trCO.Ode5C1H.text	@ltx/en_uk_lash/he.h.m1:heHE.TinSinEirinin.text
ltx/en_uk_lash/tr.d063:trCO.Ode5C1T.incipit	…
ltx/en_uk_lash/tr.d063:trCO.Ode5C1T.melody	@ltx/en_uk_lash/he.h.m1:heHE.TinSinEirinin.name
ltx/en_uk_lash/tr.d063:trCO.Ode5C1T.mode	@ltx/en_uk_lash/miscellanea:misc.Mode1
ltx/en_uk_lash/tr.d063:trCO.Ode5C1T.ode	@ltx/en_uk_lash/miscellanea:misc.Ode5
ltx/en_uk_lash/tr.d063:trCO.Ode5C1T.text	
ltx/en_uk_lash/tr.d063:trCO.Ode5C1Tr.incipit	…
ltx/en_uk_lash/tr.d063:trCO.Ode5C1Tr.melody	@ltx/en_uk_lash/he.h.m1:heHE.TinSinEirinin.name
ltx/en_uk_lash/tr.d063:trCO.Ode5C1Tr.mode	@ltx/en_uk_lash/miscellanea:misc.Mode1
ltx/en_uk_lash/tr.d063:trCO.Ode5C1Tr.ode	@ltx/en_uk_lash/miscellanea:misc.Ode5
ltx/en_uk_lash/tr.d063:trCO.Ode5C1Tr.text	
ltx/en_uk_lash/tr.d063:trCO.Ode6C11.incipit	…
ltx/en_uk_lash/tr.d063:trCO.Ode6C11.melody	@ltx/en_uk_lash/he.h.m1:heHE.AperripsasMe.name
ltx/en_uk_lash/tr.d063:trCO.Ode6C11.mode	@ltx/en_uk_lash/miscellanea:misc.Mode1
ltx/en_uk_lash/tr.d063:trCO.Ode6C11.ode	@ltx/en_uk_lash/miscellanea:misc.Ode6
ltx/en_uk_lash/tr.d063:trCO.Ode6C11.text	
ltx/en_uk_lash/tr.d063:trCO.Ode6C12.incipit	…
ltx/en_uk_lash/tr.d063:trCO.Ode6C12.melody	@ltx/en_uk_lash/he.h.m1:heHE.AperripsasMe.name
ltx/en_uk_lash/tr.d063:trCO.Ode6C12.mode	@ltx/en_uk_lash/miscellanea:misc.Mode1
ltx/en_uk_lash/tr.d063:trCO.Ode6C12.ode	@ltx/en_uk_lash/miscellanea:misc.Ode6
ltx/en_uk_lash/tr.d063:trCO.Ode6C12.text	
ltx/en_uk_lash/tr.d063:trCO.Ode6C13.incipit	…
ltx/en_uk_lash/tr.d063:trCO.Ode6C13.melody	@ltx/en_uk_lash/he.h.m1:heHE.AperripsasMe.name
ltx/en_uk_lash/tr.d063:trCO.Ode6C13.mode	@ltx/en_uk_lash/miscellanea:misc.Mode1
ltx/en_uk_lash/tr.d063:trCO.Ode6C13.ode	@ltx/en_uk_lash/miscellanea:misc.Ode6
ltx/en_uk_lash/tr.d063:trCO.Ode6C13.text	
ltx/en_uk_lash/tr.d063:trCO.Ode6C14.incipit	…
ltx/en_uk_lash/tr.d063:trCO.Ode6C14.melody	@ltx/en_uk_lash/he.h.m1:heHE.AperripsasMe.name
ltx/en_uk_lash/tr.d063:trCO.Ode6C14.mode	@ltx/en_uk_lash/miscellanea:misc.Mode1
ltx/en_uk_lash/tr.d063:trCO.Ode6C14.ode	@ltx/en_uk_lash/miscellanea:misc.Ode6
ltx/en_uk_lash/tr.d063:trCO.Ode6C14.text	
ltx/en_uk_lash/tr.d063:trCO.Ode6C15.incipit	…
ltx/en_uk_lash/tr.d063:trCO.Ode6C15.melody	@ltx/en_uk_lash/he.h.m1:heHE.AperripsasMe.name
ltx/en_uk_lash/tr.d063:trCO.Ode6C15.mode	@ltx/en_uk_lash/miscellanea:misc.Mode1
ltx/en_uk_lash/tr.d063:trCO.Ode6C15.ode	@ltx/en_uk_lash/miscellanea:misc.Ode6
ltx/en_uk_lash/tr.d063:trCO.Ode6C15.text	
ltx/en_uk_lash/tr.d063:trCO.Ode6C16.incipit	…
ltx/en_uk_lash/tr.d063:trCO.Ode6C16.melody	@ltx/en_uk_lash/he.h.m1:heHE.AperripsasMe.name
ltx/en_uk_lash/tr.d063:trCO.Ode6C16.mode	@ltx/en_uk_lash/miscellanea:misc.Mode1
ltx/en_uk_lash/tr.d063:trCO.Ode6C16.ode	@ltx/en_uk_lash/miscellanea:misc.Ode6
ltx/en_uk_lash/tr.d063:trCO.Ode6C16.text	
ltx/en_uk_lash/tr.d063:trCO.Ode6C1H.incipit	@ltx/en_uk_lash/he.h.m1:heHE.AperripsasMe.incipit
ltx/en_uk_lash/tr.d063:trCO.Ode6C1H.melody	@ltx/en_uk_lash/he.h.m1:heHE.AperripsasMe.melody
ltx/en_uk_lash/tr.d063:trCO.Ode6C1H.mode	@ltx/en_uk_lash/miscellanea:misc.Mode1
ltx/en_uk_lash/tr.d063:trCO.Ode6C1H.ode	@ltx/en_uk_lash/miscellanea:misc.Ode6
ltx/en_uk_lash/tr.d063:trCO.Ode6C1H.text	@ltx/en_uk_lash/he.h.m1:heHE.AperripsasMe.text
ltx/en_uk_lash/tr.d063:trCO.Ode6C1T.incipit	…
ltx/en_uk_lash/tr.d063:trCO.Ode6C1T.melody	@ltx/en_uk_lash/he.h.m1:heHE.AperripsasMe.name
ltx/en_uk_lash/tr.d063:trCO.Ode6C1T.mode	@ltx/en_uk_lash/miscellanea:misc.Mode1
ltx/en_uk_lash/tr.d063:trCO.Ode6C1T.ode	@ltx/en_uk_lash/miscellanea:misc.Ode6
ltx/en_uk_lash/tr.d063:trCO.Ode6C1T.text	
ltx/en_uk_lash/tr.d063:trCO.Ode6C1Tr.incipit	…
ltx/en_uk_lash/tr.d063:trCO.Ode6C1Tr.melody	@ltx/en_uk_lash/he.h.m1:heHE.AperripsasMe.name
ltx/en_uk_lash/tr.d063:trCO.Ode6C1Tr.mode	@ltx/en_uk_lash/miscellanea:misc.Mode1
ltx/en_uk_lash/tr.d063:trCO.Ode6C1Tr.ode	@ltx/en_uk_lash/miscellanea:misc.Ode6
ltx/en_uk_lash/tr.d063:trCO.Ode6C1Tr.text	
ltx/en_uk_lash/tr.d063:trCO.Ode7C11.incipit	…
ltx/en_uk_lash/tr.d063:trCO.Ode7C11.melody	@ltx/en_uk_lash/he.h.m1:heHE.TousEnKaminoPaidas.name
ltx/en_uk_lash/tr.d063:trCO.Ode7C11.mode	@ltx/en_uk_lash/miscellanea:misc.Mode1
ltx/en_uk_lash/tr.d063:trCO.Ode7C11.ode	@ltx/en_uk_lash/miscellanea:misc.Ode7
ltx/en_uk_lash/tr.d063:trCO.Ode7C11.text	
ltx/en_uk_lash/tr.d063:trCO.Ode7C12.incipit	…
ltx/en_uk_lash/tr.d063:trCO.Ode7C12.melody	@ltx/en_uk_lash/he.h.m1:heHE.TousEnKaminoPaidas.name
ltx/en_uk_lash/tr.d063:trCO.Ode7C12.mode	@ltx/en_uk_lash/miscellanea:misc.Mode1
ltx/en_uk_lash/tr.d063:trCO.Ode7C12.ode	@ltx/en_uk_lash/miscellanea:misc.Ode7
ltx/en_uk_lash/tr.d063:trCO.Ode7C12.text	
ltx/en_uk_lash/tr.d063:trCO.Ode7C13.incipit	…
ltx/en_uk_lash/tr.d063:trCO.Ode7C13.melody	@ltx/en_uk_lash/he.h.m1:heHE.TousEnKaminoPaidas.name
ltx/en_uk_lash/tr.d063:trCO.Ode7C13.mode	@ltx/en_uk_lash/miscellanea:misc.Mode1
ltx/en_uk_lash/tr.d063:trCO.Ode7C13.ode	@ltx/en_uk_lash/miscellanea:misc.Ode7
ltx/en_uk_lash/tr.d063:trCO.Ode7C13.text	
ltx/en_uk_lash/tr.d063:trCO.Ode7C14.incipit	…
ltx/en_uk_lash/tr.d063:trCO.Ode7C14.melody	@ltx/en_uk_lash/he.h.m1:heHE.TousEnKaminoPaidas.name
ltx/en_uk_lash/tr.d063:trCO.Ode7C14.mode	@ltx/en_uk_lash/miscellanea:misc.Mode1
ltx/en_uk_lash/tr.d063:trCO.Ode7C14.ode	@ltx/en_uk_lash/miscellanea:misc.Ode7
ltx/en_uk_lash/tr.d063:trCO.Ode7C14.text	
ltx/en_uk_lash/tr.d063:trCO.Ode7C15.incipit	…
ltx/en_uk_lash/tr.d063:trCO.Ode7C15.melody	@ltx/en_uk_lash/he.h.m1:heHE.TousEnKaminoPaidas.name
ltx/en_uk_lash/tr.d063:trCO.Ode7C15.mode	@ltx/en_uk_lash/miscellanea:misc.Mode1
ltx/en_uk_lash/tr.d063:trCO.Ode7C15.ode	@ltx/en_uk_lash/miscellanea:misc.Ode7
ltx/en_uk_lash/tr.d063:trCO.Ode7C15.text	
ltx/en_uk_lash/tr.d063:trCO.Ode7C16.incipit	…
ltx/en_uk_lash/tr.d063:trCO.Ode7C16.melody	@ltx/en_uk_lash/he.h.m1:heHE.TousEnKaminoPaidas.name
ltx/en_uk_lash/tr.d063:trCO.Ode7C16.mode	@ltx/en_uk_lash/miscellanea:misc.Mode1
ltx/en_uk_lash/tr.d063:trCO.Ode7C16.ode	@ltx/en_uk_lash/miscellanea:misc.Ode7
ltx/en_uk_lash/tr.d063:trCO.Ode7C16.text	
ltx/en_uk_lash/tr.d063:trCO.Ode7C17.incipit	…
ltx/en_uk_lash/tr.d063:trCO.Ode7C17.melody	@ltx/en_uk_lash/he.h.m1:heHE.TousEnKaminoPaidas.name
ltx/en_uk_lash/tr.d063:trCO.Ode7C17.mode	@ltx/en_uk_lash/miscellanea:misc.Mode1
ltx/en_uk_lash/tr.d063:trCO.Ode7C17.ode	@ltx/en_uk_lash/miscellanea:misc.Ode7
ltx/en_uk_lash/tr.d063:trCO.Ode7C17.text	
ltx/en_uk_lash/tr.d063:trCO.Ode7C1H.incipit	@ltx/en_uk_lash/he.h.m1:heHE.TousEnKaminoPaidas.incipit
ltx/en_uk_lash/tr.d063:trCO.Ode7C1H.melody	@ltx/en_uk_lash/he.h.m1:heHE.TousEnKaminoPaidas.melody
ltx/en_uk_lash/tr.d063:trCO.Ode7C1H.mode	@ltx/en_uk_lash/miscellanea:misc.Mode1
ltx/en_uk_lash/tr.d063:trCO.Ode7C1H.ode	@ltx/en_uk_lash/miscellanea:misc.Ode7
ltx/en_uk_lash/tr.d063:trCO.Ode7C1H.text	@ltx/en_uk_lash/he.h.m1:heHE.TousEnKaminoPaidas.text
ltx/en_uk_lash/tr.d063:trCO.Ode7C1T.incipit	…
ltx/en_uk_lash/tr.d063:trCO.Ode7C1T.melody	@ltx/en_uk_lash/he.h.m1:heHE.TousEnKaminoPaidas.name
ltx/en_uk_lash/tr.d063:trCO.Ode7C1T.mode	@ltx/en_uk_lash/miscellanea:misc.Mode1
ltx/en_uk_lash/tr.d063:trCO.Ode7C1T.ode	@ltx/en_uk_lash/miscellanea:misc.Ode7
ltx/en_uk_lash/tr.d063:trCO.Ode7C1T.text	
ltx/en_uk_lash/tr.d063:trCO.Ode7C1Tr.incipit	…
ltx/en_uk_lash/tr.d063:trCO.Ode7C1Tr.melody	@ltx/en_uk_lash/he.h.m1:heHE.TousEnKaminoPaidas.name
ltx/en_uk_lash/tr.d063:trCO.Ode7C1Tr.mode	@ltx/en_uk_lash/miscellanea:misc.Mode1
ltx/en_uk_lash/tr.d063:trCO.Ode7C1Tr.ode	@ltx/en_uk_lash/miscellanea:misc.Ode7
ltx/en_uk_lash/tr.d063:trCO.Ode7C1Tr.text	
ltx/en_uk_lash/tr.d063:trCO.Ode8C11.incipit	…
ltx/en_uk_lash/tr.d063:trCO.Ode8C11.melody	@ltx/en_uk_lash/he.h.m1:heHE.OiOuranoiTonOuranon.name
ltx/en_uk_lash/tr.d063:trCO.Ode8C11.mode	@ltx/en_uk_lash/miscellanea:misc.Mode1
ltx/en_uk_lash/tr.d063:trCO.Ode8C11.ode	@ltx/en_uk_lash/miscellanea:misc.Ode8
ltx/en_uk_lash/tr.d063:trCO.Ode8C11.text	
ltx/en_uk_lash/tr.d063:trCO.Ode8C12.incipit	…
ltx/en_uk_lash/tr.d063:trCO.Ode8C12.melody	@ltx/en_uk_lash/he.h.m1:heHE.OiOuranoiTonOuranon.name
ltx/en_uk_lash/tr.d063:trCO.Ode8C12.mode	@ltx/en_uk_lash/miscellanea:misc.Mode1
ltx/en_uk_lash/tr.d063:trCO.Ode8C12.ode	@ltx/en_uk_lash/miscellanea:misc.Ode8
ltx/en_uk_lash/tr.d063:trCO.Ode8C12.text	
ltx/en_uk_lash/tr.d063:trCO.Ode8C13.incipit	…
ltx/en_uk_lash/tr.d063:trCO.Ode8C13.melody	@ltx/en_uk_lash/he.h.m1:heHE.OiOuranoiTonOuranon.name
ltx/en_uk_lash/tr.d063:trCO.Ode8C13.mode	@ltx/en_uk_lash/miscellanea:misc.Mode1
ltx/en_uk_lash/tr.d063:trCO.Ode8C13.ode	@ltx/en_uk_lash/miscellanea:misc.Ode8
ltx/en_uk_lash/tr.d063:trCO.Ode8C13.text	
ltx/en_uk_lash/tr.d063:trCO.Ode8C14.incipit	…
ltx/en_uk_lash/tr.d063:trCO.Ode8C14.melody	@ltx/en_uk_lash/he.h.m1:heHE.OiOuranoiTonOuranon.name
ltx/en_uk_lash/tr.d063:trCO.Ode8C14.mode	@ltx/en_uk_lash/miscellanea:misc.Mode1
ltx/en_uk_lash/tr.d063:trCO.Ode8C14.ode	@ltx/en_uk_lash/miscellanea:misc.Ode8
ltx/en_uk_lash/tr.d063:trCO.Ode8C14.text	
ltx/en_uk_lash/tr.d063:trCO.Ode8C15.incipit	…
ltx/en_uk_lash/tr.d063:trCO.Ode8C15.melody	@ltx/en_uk_lash/he.h.m1:heHE.OiOuranoiTonOuranon.name
ltx/en_uk_lash/tr.d063:trCO.Ode8C15.mode	@ltx/en_uk_lash/miscellanea:misc.Mode1
ltx/en_uk_lash/tr.d063:trCO.Ode8C15.ode	@ltx/en_uk_lash/miscellanea:misc.Ode8
ltx/en_uk_lash/tr.d063:trCO.Ode8C15.text	
ltx/en_uk_lash/tr.d063:trCO.Ode8C16.incipit	…
ltx/en_uk_lash/tr.d063:trCO.Ode8C16.melody	@ltx/en_uk_lash/he.h.m1:heHE.OiOuranoiTonOuranon.name
ltx/en_uk_lash/tr.d063:trCO.Ode8C16.mode	@ltx/en_uk_lash/miscellanea:misc.Mode1
ltx/en_uk_lash/tr.d063:trCO.Ode8C16.ode	@ltx/en_uk_lash/miscellanea:misc.Ode8
ltx/en_uk_lash/tr.d063:trCO.Ode8C16.text	
ltx/en_uk_lash/tr.d063:trCO.Ode8C1H.incipit	@ltx/en_uk_lash/he.h.m1:heHE.OiOuranoiTonOuranon.incipit
ltx/en_uk_lash/tr.d063:trCO.Ode8C1H.melody	@ltx/en_uk_lash/he.h.m1:heHE.OiOuranoiTonOuranon.melody
ltx/en_uk_lash/tr.d063:trCO.Ode8C1H.mode	@ltx/en_uk_lash/miscellanea:misc.Mode1
ltx/en_uk_lash/tr.d063:trCO.Ode8C1H.ode	@ltx/en_uk_lash/miscellanea:misc.Ode8
ltx/en_uk_lash/tr.d063:trCO.Ode8C1H.text	@ltx/en_uk_lash/he.h.m1:heHE.OiOuranoiTonOuranon.text
ltx/en_uk_lash/tr.d063:trCO.Ode8C1T.incipit	…
ltx/en_uk_lash/tr.d063:trCO.Ode8C1T.melody	@ltx/en_uk_lash/he.h.m1:heHE.OiOuranoiTonOuranon.name
ltx/en_uk_lash/tr.d063:trCO.Ode8C1T.mode	@ltx/en_uk_lash/miscellanea:misc.Mode1
ltx/en_uk_lash/tr.d063:trCO.Ode8C1T.ode	@ltx/en_uk_lash/miscellanea:misc.Ode8
ltx/en_uk_lash/tr.d063:trCO.Ode8C1T.text	
ltx/en_uk_lash/tr.d063:trCO.Ode8C1Tr.incipit	…
ltx/en_uk_lash/tr.d063:trCO.Ode8C1Tr.melody	@ltx/en_uk_lash/he.h.m1:heHE.OiOuranoiTonOuranon.name
ltx/en_uk_lash/tr.d063:trCO.Ode8C1Tr.mode	@ltx/en_uk_lash/miscellanea:misc.Mode1
ltx/en_uk_lash/tr.d063:trCO.Ode8C1Tr.ode	@ltx/en_uk_lash/miscellanea:misc.Ode8
ltx/en_uk_lash/tr.d063:trCO.Ode8C1Tr.text	
ltx/en_uk_lash/tr.d063:trCO.Ode9C11.incipit	…
ltx/en_uk_lash/tr.d063:trCO.Ode9C11.melody	@ltx/en_uk_lash/he.h.m1:heHE.EpoiiseKratos.name
ltx/en_uk_lash/tr.d063:trCO.Ode9C11.mode	@ltx/en_uk_lash/miscellanea:misc.Mode1
ltx/en_uk_lash/tr.d063:trCO.Ode9C11.ode	@ltx/en_uk_lash/miscellanea:misc.Ode9
ltx/en_uk_lash/tr.d063:trCO.Ode9C11.text	
ltx/en_uk_lash/tr.d063:trCO.Ode9C12.incipit	…
ltx/en_uk_lash/tr.d063:trCO.Ode9C12.melody	@ltx/en_uk_lash/he.h.m1:heHE.EpoiiseKratos.name
ltx/en_uk_lash/tr.d063:trCO.Ode9C12.mode	@ltx/en_uk_lash/miscellanea:misc.Mode1
ltx/en_uk_lash/tr.d063:trCO.Ode9C12.ode	@ltx/en_uk_lash/miscellanea:misc.Ode9
ltx/en_uk_lash/tr.d063:trCO.Ode9C12.text	
ltx/en_uk_lash/tr.d063:trCO.Ode9C13.incipit	…
ltx/en_uk_lash/tr.d063:trCO.Ode9C13.melody	@ltx/en_uk_lash/he.h.m1:heHE.EpoiiseKratos.name
ltx/en_uk_lash/tr.d063:trCO.Ode9C13.mode	@ltx/en_uk_lash/miscellanea:misc.Mode1
ltx/en_uk_lash/tr.d063:trCO.Ode9C13.ode	@ltx/en_uk_lash/miscellanea:misc.Ode9
ltx/en_uk_lash/tr.d063:trCO.Ode9C13.text	
ltx/en_uk_lash/tr.d063:trCO.Ode9C14.incipit	…
ltx/en_uk_lash/tr.d063:trCO.Ode9C14.melody	@ltx/en_uk_lash/he.h.m1:heHE.EpoiiseKratos.name
ltx/en_uk_lash/tr.d063:trCO.Ode9C14.mode	@ltx/en_uk_lash/miscellanea:misc.Mode1
ltx/en_uk_lash/tr.d063:trCO.Ode9C14.ode	@ltx/en_uk_lash/miscellanea:misc.Ode9
ltx/en_uk_lash/tr.d063:trCO.Ode9C14.text	
ltx/en_uk_lash/tr.d063:trCO.Ode9C15.incipit	…
ltx/en_uk_lash/tr.d063:trCO.Ode9C15.melody	@ltx/en_uk_lash/he.h.m1:heHE.EpoiiseKratos.name
ltx/en_uk_lash/tr.d063:trCO.Ode9C15.mode	@ltx/en_uk_lash/miscellanea:misc.Mode1
ltx/en_uk_lash/tr.d063:trCO.Ode9C15.ode	@ltx/en_uk_lash/miscellanea:misc.Ode9
ltx/en_uk_lash/tr.d063:trCO.Ode9C15.text	
ltx/en_uk_lash/tr.d063:trCO.Ode9C16.incipit	…
ltx/en_uk_lash/tr.d063:trCO.Ode9C16.melody	@ltx/en_uk_lash/he.h.m1:heHE.EpoiiseKratos.name
ltx/en_uk_lash/tr.d063:trCO.Ode9C16.mode	@ltx/en_uk_lash/miscellanea:misc.Mode1
ltx/en_uk_lash/tr.d063:trCO.Ode9C16.ode	@ltx/en_uk_lash/miscellanea:misc.Ode9
ltx/en_uk_lash/tr.d063:trCO.Ode9C16.text	
ltx/en_uk_lash/tr.d063:trCO.Ode9C17.incipit	…
ltx/en_uk_lash/tr.d063:trCO.Ode9C17.melody	@ltx/en_uk_lash/he.h.m1:heHE.EpoiiseKratos.name
ltx/en_uk_lash/tr.d063:trCO.Ode9C17.mode	@ltx/en_uk_lash/miscellanea:misc.Mode1
ltx/en_uk_lash/tr.d063:trCO.Ode9C17.ode	@ltx/en_uk_lash/miscellanea:misc.Ode9
ltx/en_uk_lash/tr.d063:trCO.Ode9C17.text	
ltx/en_uk_lash/tr.d063:trCO.Ode9C1H.incipit	@ltx/en_uk_lash/he.h.m1:heHE.EpoiiseKratos.incipit
ltx/en_uk_lash/tr.d063:trCO.Ode9C1H.melody	@ltx/en_uk_lash/he.h.m1:heHE.EpoiiseKratos.melody
ltx/en_uk_lash/tr.d063:trCO.Ode9C1H.mode	@ltx/en_uk_lash/miscellanea:misc.Mode1
ltx/en_uk_lash/tr.d063:trCO.Ode9C1H.ode	@ltx/en_uk_lash/miscellanea:misc.Ode9
ltx/en_uk_lash/tr.d063:trCO.Ode9C1H.text	@ltx/en_uk_lash/he.h.m1:heHE.EpoiiseKratos.text
ltx/en_uk_lash/tr.d063:trCO.Ode9C1T.incipit	…
ltx/en_uk_lash/tr.d063:trCO.Ode9C1T.melody	@ltx/en_uk_lash/he.h.m1:heHE.EpoiiseKratos.name
ltx/en_uk_lash/tr.d063:trCO.Ode9C1T.mode	@ltx/en_uk_lash/miscellanea:misc.Mode1
ltx/en_uk_lash/tr.d063:trCO.Ode9C1T.ode	@ltx/en_uk_lash/miscellanea:misc.Ode9
ltx/en_uk_lash/tr.d063:trCO.Ode9C1T.text	
ltx/en_uk_lash/tr.d063:trCO.Ode9C1Tr.incipit	…
ltx/en_uk_lash/tr.d063:trCO.Ode9C1Tr.melody	@ltx/en_uk_lash/he.h.m1:heHE.EpoiiseKratos.name
ltx/en_uk_lash/tr.d063:trCO.Ode9C1Tr.mode	@ltx/en_uk_lash/miscellanea:misc.Mode1
ltx/en_uk_lash/tr.d063:trCO.Ode9C1Tr.ode	@ltx/en_uk_lash/miscellanea:misc.Ode9
ltx/en_uk_lash/tr.d063:trCO.Ode9C1Tr.text	
ltx/en_uk_lash/tr.d063:trCO.header	
ltx/en_uk_lash/tr.d063:trDA.commemoration.full	
ltx/en_uk_lash/tr.d063:trDA.commemoration.short	
ltx/en_uk_lash/tr.d063:trDA.dismissal	@ltx/en_uk_lash/dismissals:dis00.resurrection
ltx/en_uk_lash/tr.d063:trDA.insert1	
ltx/en_uk_lash/tr.d063:trDA.insert2	
ltx/en_uk_lash/tr.d063:trDA.note	
ltx/en_uk_lash/tr.d063:trDA.title	
ltx/en_uk_lash/tr.d063:trHO.commemorations	
ltx/en_uk_lash/tr.d063:trHO.daytitle	
ltx/en_uk_lash/tr.d063:trHO.description1	
ltx/en_uk_lash/tr.d063:trHO.description2	
ltx/en_uk_lash/tr.d063:trHO.note1	
ltx/en_uk_lash/tr.d063:trHO.note2	
ltx/en_uk_lash/tr.d063:trLI.AfterCommunion.incipit	@ltx/en_uk_lash/tr.d063:trVE.Apolytikion1.incipit
ltx/en_uk_lash/tr.d063:trLI.AfterCommunion.mode	@ltx/en_uk_lash/miscellanea:misc.Mode1
ltx/en_uk_lash/tr.d063:trLI.AfterCommunion.text	@ltx/en_uk_lash/tr.d063:trVE.Apolytikion1.text
ltx/en_uk_lash/tr.d063:trLI.Kontakion1.incipit	@ltx/en_uk_lash/tr.d063:trMA.Kontakion1.incipit
ltx/en_uk_lash/tr.d063:trLI.Kontakion1.melody	@ltx/en_uk_lash/tr.d063:trMA.Kontakion1.melody
ltx/en_uk_lash/tr.d063:trLI.Kontakion1.mode	@ltx/en_uk_lash/tr.d063:trMA.Kontakion1.mode
ltx/en_uk_lash/tr.d063:trLI.Kontakion1.text	@ltx/en_uk_lash/tr.d063:trMA.Kontakion1.text
ltx/en_uk_lash/tr.d063:trLI.MM.CommunionHymn.text	@ltx/en_uk_lash/properties:media.key
ltx/en_uk_lash/tr.d063:trLI.Megalynarion.text	
ltx/en_uk_lash/tr.d063:trLI.TheotokosHymn.incipit	@ltx/en_uk_lash/tr.d063:trMA.Ode9C1H.incipit
ltx/en_uk_lash/tr.d063:trLI.TheotokosHymn.mode	@ltx/en_uk_lash/miscellanea:misc.Mode8
ltx/en_uk_lash/tr.d063:trLI.TheotokosHymn.text	@ltx/en_uk_lash/tr.d063:trMA.Ode9C1H.text
ltx/en_uk_lash/tr.d063:trMA.C1.poet	@ltx/en_uk_lash/poets:po.Theofanous
ltx/en_uk_lash/tr.d063:trMA.C1.title	
ltx/en_uk_lash/tr.d063:trMA.C1.verse	
ltx/en_uk_lash/tr.d063:trMA.C2.poet	@ltx/en_uk_lash/poets:po.KosmaMonachou
ltx/en_uk_lash/tr.d063:trMA.C2.title	
ltx/en_uk_lash/tr.d063:trMA.C2.verse	
ltx/en_uk_lash/tr.d063:trMA.C3.poet	@ltx/en_uk_lash/poets:po.KosmaMonachou
ltx/en_uk_lash/tr.d063:trMA.C4.poet	@ltx/en_uk_lash/poets:po.IoannouMonachou
ltx/en_uk_lash/tr.d063:trMA.Exaposteilarion1.greekmelody	@ltx/en_uk_lash/he.a.m3:heAU.EpeskepsatoImas.greekname
ltx/en_uk_lash/tr.d063:trMA.Exaposteilarion1.incipit	…
ltx/en_uk_lash/tr.d063:trMA.Exaposteilarion1.melody	@ltx/en_uk_lash/he.a.m3:heAU.EpeskepsatoImas.notmetered
ltx/en_uk_lash/tr.d063:trMA.Exaposteilarion1.mode	@ltx/en_uk_lash/miscellanea:misc.Mode3
ltx/en_uk_lash/tr.d063:trMA.Exaposteilarion1.text	
ltx/en_uk_lash/tr.d063:trMA.Exaposteilarion2.greekmelody	@ltx/en_uk_lash/he.a.m3:heAU.EpeskepsatoImas.greekname
ltx/en_uk_lash/tr.d063:trMA.Exaposteilarion2.incipit	…
ltx/en_uk_lash/tr.d063:trMA.Exaposteilarion2.melody	@ltx/en_uk_lash/he.a.m3:heAU.EpeskepsatoImas.notmetered
ltx/en_uk_lash/tr.d063:trMA.Exaposteilarion2.mode	@ltx/en_uk_lash/miscellanea:misc.Mode3
ltx/en_uk_lash/tr.d063:trMA.Exaposteilarion2.text	
ltx/en_uk_lash/tr.d063:trMA.Kathisma11.greekmelody	@ltx/en_uk_lash/he.a.m1:heAU.TouLithouSfragisthentos.greekname
ltx/en_uk_lash/tr.d063:trMA.Kathisma11.incipit	…
ltx/en_uk_lash/tr.d063:trMA.Kathisma11.melody	@ltx/en_uk_lash/he.a.m1:heAU.TouLithouSfragisthentos.notmetered
ltx/en_uk_lash/tr.d063:trMA.Kathisma11.mode	@ltx/en_uk_lash/miscellanea:misc.Mode1
ltx/en_uk_lash/tr.d063:trMA.Kathisma11.text	
ltx/en_uk_lash/tr.d063:trMA.Kathisma21.greekmelody	@ltx/en_uk_lash/he.a.m5:heAU.TonSynanarchonLogon.greekname
ltx/en_uk_lash/tr.d063:trMA.Kathisma21.incipit	…
ltx/en_uk_lash/tr.d063:trMA.Kathisma21.melody	@ltx/en_uk_lash/he.a.m5:heAU.TonSynanarchonLogon.notmetered
ltx/en_uk_lash/tr.d063:trMA.Kathisma21.mode	@ltx/en_uk_lash/miscellanea:misc.Mode5
ltx/en_uk_lash/tr.d063:trMA.Kathisma21.text	
ltx/en_uk_lash/tr.d063:trMA.Kontakion1.incipit	…
ltx/en_uk_lash/tr.d063:trMA.Kontakion1.melody	@ltx/en_uk_lash/he.a.m2:heAU.TaAnoZiton.notmetered
ltx/en_uk_lash/tr.d063:trMA.Kontakion1.mode	@ltx/en_uk_lash/miscellanea:misc.Mode2
ltx/en_uk_lash/tr.d063:trMA.Kontakion1.text	
ltx/en_uk_lash/tr.d063:trMA.Lauds1.incipit	…
ltx/en_uk_lash/tr.d063:trMA.Lauds1.melody	@ltx/en_uk_lash/miscellanea:misc.Idiomelon
ltx/en_uk_lash/tr.d063:trMA.Lauds1.mode	@ltx/en_uk_lash/miscellanea:misc.Mode1
ltx/en_uk_lash/tr.d063:trMA.Lauds1.text	
ltx/en_uk_lash/tr.d063:trMA.Lauds2.incipit	…
ltx/en_uk_lash/tr.d063:trMA.Lauds2.melody	@ltx/en_uk_lash/miscellanea:misc.Idiomelon
ltx/en_uk_lash/tr.d063:trMA.Lauds2.mode	@ltx/en_uk_lash/miscellanea:misc.Mode1
ltx/en_uk_lash/tr.d063:trMA.Lauds2.text	
ltx/en_uk_lash/tr.d063:trMA.Lauds3.incipit	…
ltx/en_uk_lash/tr.d063:trMA.Lauds3.melody	@ltx/en_uk_lash/miscellanea:misc.Idiomelon
ltx/en_uk_lash/tr.d063:trMA.Lauds3.mode	@ltx/en_uk_lash/miscellanea:misc.Mode1
ltx/en_uk_lash/tr.d063:trMA.Lauds3.text	
ltx/en_uk_lash/tr.d063:trMA.Lauds4.incipit	…
ltx/en_uk_lash/tr.d063:trMA.Lauds4.melody	@ltx/en_uk_lash/miscellanea:misc.Idiomelon
ltx/en_uk_lash/tr.d063:trMA.Lauds4.mode	@ltx/en_uk_lash/miscellanea:misc.Mode1
ltx/en_uk_lash/tr.d063:trMA.Lauds4.text	
ltx/en_uk_lash/tr.d063:trMA.Lauds5.incipit	…
ltx/en_uk_lash/tr.d063:trMA.Lauds5.melody	@ltx/en_uk_lash/miscellanea:misc.Idiomelon
ltx/en_uk_lash/tr.d063:trMA.Lauds5.mode	@ltx/en_uk_lash/miscellanea:misc.Mode4
ltx/en_uk_lash/tr.d063:trMA.Lauds5.text	
ltx/en_uk_lash/tr.d063:trMA.Lauds6.incipit	…
ltx/en_uk_lash/tr.d063:trMA.Lauds6.melody	@ltx/en_uk_lash/miscellanea:misc.Idiomelon
ltx/en_uk_lash/tr.d063:trMA.Lauds6.mode	@ltx/en_uk_lash/miscellanea:misc.Mode4
ltx/en_uk_lash/tr.d063:trMA.Lauds6.text	
ltx/en_uk_lash/tr.d063:trMA.Lauds7.incipit	…
ltx/en_uk_lash/tr.d063:trMA.Lauds7.melody	@ltx/en_uk_lash/miscellanea:misc.Idiomelon
ltx/en_uk_lash/tr.d063:trMA.Lauds7.mode	@ltx/en_uk_lash/miscellanea:misc.Mode8
ltx/en_uk_lash/tr.d063:trMA.Lauds7.text	
ltx/en_uk_lash/tr.d063:trMA.Lauds8.incipit	…
ltx/en_uk_lash/tr.d063:trMA.Lauds8.melody	@ltx/en_uk_lash/miscellanea:misc.Idiomelon
ltx/en_uk_lash/tr.d063:trMA.Lauds8.mode	@ltx/en_uk_lash/miscellanea:misc.Mode8
ltx/en_uk_lash/tr.d063:trMA.Lauds8.text	
ltx/en_uk_lash/tr.d063:trMA.LaudsGlory.incipit	…
ltx/en_uk_lash/tr.d063:trMA.LaudsGlory.melody	@ltx/en_uk_lash/miscellanea:misc.Idiomelon
ltx/en_uk_lash/tr.d063:trMA.LaudsGlory.mode	@ltx/en_uk_lash/miscellanea:misc.Mode2
ltx/en_uk_lash/tr.d063:trMA.LaudsGlory.text	
ltx/en_uk_lash/tr.d063:trMA.LaudsTheotokion.incipit	@ltx/en_uk_lash/oc.m2.d1:ocMA.Kathisma23.incipit
ltx/en_uk_lash/tr.d063:trMA.LaudsTheotokion.melody	
ltx/en_uk_lash/tr.d063:trMA.LaudsTheotokion.mode	@ltx/en_uk_lash/miscellanea:misc.Mode2
ltx/en_uk_lash/tr.d063:trMA.LaudsTheotokion.text	@ltx/en_uk_lash/oc.m2.d1:ocMA.Kathisma23.text
ltx/en_uk_lash/tr.d063:trMA.Ode1C11.greekmelody	@ltx/en_uk_lash/he.h.m8:heHE.AsomenToKyrio.greekname
ltx/en_uk_lash/tr.d063:trMA.Ode1C11.incipit	…
ltx/en_uk_lash/tr.d063:trMA.Ode1C11.melody	@ltx/en_uk_lash/he.h.m8:heHE.AsomenToKyrio.name
ltx/en_uk_lash/tr.d063:trMA.Ode1C11.mode	@ltx/en_uk_lash/miscellanea:misc.Mode8
ltx/en_uk_lash/tr.d063:trMA.Ode1C11.ode	@ltx/en_uk_lash/miscellanea:misc.Ode1
ltx/en_uk_lash/tr.d063:trMA.Ode1C11.text	
ltx/en_uk_lash/tr.d063:trMA.Ode1C12.incipit	…
ltx/en_uk_lash/tr.d063:trMA.Ode1C12.melody	@ltx/en_uk_lash/he.h.m8:heHE.AsomenToKyrio.name
ltx/en_uk_lash/tr.d063:trMA.Ode1C12.mode	@ltx/en_uk_lash/miscellanea:misc.Mode8
ltx/en_uk_lash/tr.d063:trMA.Ode1C12.ode	@ltx/en_uk_lash/miscellanea:misc.Ode1
ltx/en_uk_lash/tr.d063:trMA.Ode1C12.text	
ltx/en_uk_lash/tr.d063:trMA.Ode1C13.incipit	…
ltx/en_uk_lash/tr.d063:trMA.Ode1C13.melody	@ltx/en_uk_lash/he.h.m8:heHE.AsomenToKyrio.name
ltx/en_uk_lash/tr.d063:trMA.Ode1C13.mode	@ltx/en_uk_lash/miscellanea:misc.Mode8
ltx/en_uk_lash/tr.d063:trMA.Ode1C13.ode	@ltx/en_uk_lash/miscellanea:misc.Ode1
ltx/en_uk_lash/tr.d063:trMA.Ode1C13.text	
ltx/en_uk_lash/tr.d063:trMA.Ode1C14.incipit	…
ltx/en_uk_lash/tr.d063:trMA.Ode1C14.melody	@ltx/en_uk_lash/he.h.m8:heHE.AsomenToKyrio.name
ltx/en_uk_lash/tr.d063:trMA.Ode1C14.mode	@ltx/en_uk_lash/miscellanea:misc.Mode8
ltx/en_uk_lash/tr.d063:trMA.Ode1C14.ode	@ltx/en_uk_lash/miscellanea:misc.Ode1
ltx/en_uk_lash/tr.d063:trMA.Ode1C14.text	
ltx/en_uk_lash/tr.d063:trMA.Ode1C1H.greekmelody	@ltx/en_uk_lash/he.h.m8:heHE.AsomenToKyrio.greekname
ltx/en_uk_lash/tr.d063:trMA.Ode1C1H.incipit	@ltx/en_uk_lash/he.h.m8:heHE.AsomenToKyrio.incipit
ltx/en_uk_lash/tr.d063:trMA.Ode1C1H.melody	@ltx/en_uk_lash/he.h.m8:heHE.AsomenToKyrio.melody
ltx/en_uk_lash/tr.d063:trMA.Ode1C1H.mode	@ltx/en_uk_lash/miscellanea:misc.Mode8
ltx/en_uk_lash/tr.d063:trMA.Ode1C1H.ode	@ltx/en_uk_lash/miscellanea:misc.Ode1
ltx/en_uk_lash/tr.d063:trMA.Ode1C1H.text	@ltx/en_uk_lash/he.h.m8:heHE.AsomenToKyrio.text
ltx/en_uk_lash/tr.d063:trMA.Ode1C21.greekmelody	@ltx/en_uk_lash/he.h.m8:heHE.YgranDiodefsas.greekname
ltx/en_uk_lash/tr.d063:trMA.Ode1C21.incipit	…
ltx/en_uk_lash/tr.d063:trMA.Ode1C21.melody	@ltx/en_uk_lash/he.h.m8:heHE.YgranDiodefsas.name
ltx/en_uk_lash/tr.d063:trMA.Ode1C21.mode	@ltx/en_uk_lash/miscellanea:misc.Mode8
ltx/en_uk_lash/tr.d063:trMA.Ode1C21.ode	@ltx/en_uk_lash/miscellanea:misc.Ode1
ltx/en_uk_lash/tr.d063:trMA.Ode1C21.text	
ltx/en_uk_lash/tr.d063:trMA.Ode1C22.incipit	…
ltx/en_uk_lash/tr.d063:trMA.Ode1C22.melody	@ltx/en_uk_lash/he.h.m8:heHE.YgranDiodefsas.name
ltx/en_uk_lash/tr.d063:trMA.Ode1C22.mode	@ltx/en_uk_lash/miscellanea:misc.Mode8
ltx/en_uk_lash/tr.d063:trMA.Ode1C22.ode	@ltx/en_uk_lash/miscellanea:misc.Ode1
ltx/en_uk_lash/tr.d063:trMA.Ode1C22.text	
ltx/en_uk_lash/tr.d063:trMA.Ode1C23.incipit	…
ltx/en_uk_lash/tr.d063:trMA.Ode1C23.melody	@ltx/en_uk_lash/he.h.m8:heHE.YgranDiodefsas.name
ltx/en_uk_lash/tr.d063:trMA.Ode1C23.mode	@ltx/en_uk_lash/miscellanea:misc.Mode8
ltx/en_uk_lash/tr.d063:trMA.Ode1C23.ode	@ltx/en_uk_lash/miscellanea:misc.Ode1
ltx/en_uk_lash/tr.d063:trMA.Ode1C23.text	
ltx/en_uk_lash/tr.d063:trMA.Ode1C2T.incipit	…
ltx/en_uk_lash/tr.d063:trMA.Ode1C2T.melody	@ltx/en_uk_lash/he.h.m8:heHE.YgranDiodefsas.name
ltx/en_uk_lash/tr.d063:trMA.Ode1C2T.mode	@ltx/en_uk_lash/miscellanea:misc.Mode8
ltx/en_uk_lash/tr.d063:trMA.Ode1C2T.ode	@ltx/en_uk_lash/miscellanea:misc.Ode1
ltx/en_uk_lash/tr.d063:trMA.Ode1C2T.text	
ltx/en_uk_lash/tr.d063:trMA.Ode1K.incipit	@ltx/en_uk_lash/he.h.m8:heHE.YgranDiodefsas.incipit
ltx/en_uk_lash/tr.d063:trMA.Ode1K.melody	@ltx/en_uk_lash/he.h.m8:heHE.YgranDiodefsas.melody
ltx/en_uk_lash/tr.d063:trMA.Ode1K.mode	@ltx/en_uk_lash/miscellanea:misc.Mode8
ltx/en_uk_lash/tr.d063:trMA.Ode1K.ode	@ltx/en_uk_lash/miscellanea:misc.Ode1
ltx/en_uk_lash/tr.d063:trMA.Ode1K.text	@ltx/en_uk_lash/he.h.m8:heHE.YgranDiodefsas.text
ltx/en_uk_lash/tr.d063:trMA.Ode3C11.greekmelody	@ltx/en_uk_lash/he.h.m8:heHE.SyEiToStereoma.greekname
ltx/en_uk_lash/tr.d063:trMA.Ode3C11.incipit	…
ltx/en_uk_lash/tr.d063:trMA.Ode3C11.melody	@ltx/en_uk_lash/he.h.m8:heHE.SyEiToStereoma.name
ltx/en_uk_lash/tr.d063:trMA.Ode3C11.mode	@ltx/en_uk_lash/miscellanea:misc.Mode8
ltx/en_uk_lash/tr.d063:trMA.Ode3C11.ode	@ltx/en_uk_lash/miscellanea:misc.Ode3
ltx/en_uk_lash/tr.d063:trMA.Ode3C11.text	
ltx/en_uk_lash/tr.d063:trMA.Ode3C12.incipit	…
ltx/en_uk_lash/tr.d063:trMA.Ode3C12.melody	@ltx/en_uk_lash/he.h.m8:heHE.SyEiToStereoma.name
ltx/en_uk_lash/tr.d063:trMA.Ode3C12.mode	@ltx/en_uk_lash/miscellanea:misc.Mode8
ltx/en_uk_lash/tr.d063:trMA.Ode3C12.ode	@ltx/en_uk_lash/miscellanea:misc.Ode3
ltx/en_uk_lash/tr.d063:trMA.Ode3C12.text	
ltx/en_uk_lash/tr.d063:trMA.Ode3C13.incipit	…
ltx/en_uk_lash/tr.d063:trMA.Ode3C13.melody	@ltx/en_uk_lash/he.h.m8:heHE.SyEiToStereoma.name
ltx/en_uk_lash/tr.d063:trMA.Ode3C13.mode	@ltx/en_uk_lash/miscellanea:misc.Mode8
ltx/en_uk_lash/tr.d063:trMA.Ode3C13.ode	@ltx/en_uk_lash/miscellanea:misc.Ode3
ltx/en_uk_lash/tr.d063:trMA.Ode3C13.text	
ltx/en_uk_lash/tr.d063:trMA.Ode3C14.incipit	…
ltx/en_uk_lash/tr.d063:trMA.Ode3C14.melody	@ltx/en_uk_lash/he.h.m8:heHE.SyEiToStereoma.name
ltx/en_uk_lash/tr.d063:trMA.Ode3C14.mode	@ltx/en_uk_lash/miscellanea:misc.Mode8
ltx/en_uk_lash/tr.d063:trMA.Ode3C14.ode	@ltx/en_uk_lash/miscellanea:misc.Ode3
ltx/en_uk_lash/tr.d063:trMA.Ode3C14.text	
ltx/en_uk_lash/tr.d063:trMA.Ode3C1H.greekmelody	@ltx/en_uk_lash/he.h.m8:heHE.SyEiToStereoma.greekname
ltx/en_uk_lash/tr.d063:trMA.Ode3C1H.incipit	@ltx/en_uk_lash/he.h.m8:heHE.SyEiToStereoma.incipit
ltx/en_uk_lash/tr.d063:trMA.Ode3C1H.melody	@ltx/en_uk_lash/he.h.m8:heHE.SyEiToStereoma.melody
ltx/en_uk_lash/tr.d063:trMA.Ode3C1H.mode	@ltx/en_uk_lash/miscellanea:misc.Mode8
ltx/en_uk_lash/tr.d063:trMA.Ode3C1H.ode	@ltx/en_uk_lash/miscellanea:misc.Ode3
ltx/en_uk_lash/tr.d063:trMA.Ode3C1H.text	@ltx/en_uk_lash/he.h.m8:heHE.SyEiToStereoma.text
ltx/en_uk_lash/tr.d063:trMA.Ode3C21.greekmelody	@ltx/en_uk_lash/he.h.m8:heHE.OuraniasApsidos.greekname
ltx/en_uk_lash/tr.d063:trMA.Ode3C21.incipit	…
ltx/en_uk_lash/tr.d063:trMA.Ode3C21.melody	@ltx/en_uk_lash/he.h.m8:heHE.OuraniasApsidos.name
ltx/en_uk_lash/tr.d063:trMA.Ode3C21.mode	@ltx/en_uk_lash/miscellanea:misc.Mode8
ltx/en_uk_lash/tr.d063:trMA.Ode3C21.ode	@ltx/en_uk_lash/miscellanea:misc.Ode3
ltx/en_uk_lash/tr.d063:trMA.Ode3C21.text	
ltx/en_uk_lash/tr.d063:trMA.Ode3C22.incipit	…
ltx/en_uk_lash/tr.d063:trMA.Ode3C22.melody	@ltx/en_uk_lash/he.h.m8:heHE.OuraniasApsidos.name
ltx/en_uk_lash/tr.d063:trMA.Ode3C22.mode	@ltx/en_uk_lash/miscellanea:misc.Mode8
ltx/en_uk_lash/tr.d063:trMA.Ode3C22.ode	@ltx/en_uk_lash/miscellanea:misc.Ode3
ltx/en_uk_lash/tr.d063:trMA.Ode3C22.text	
ltx/en_uk_lash/tr.d063:trMA.Ode3C23.incipit	…
ltx/en_uk_lash/tr.d063:trMA.Ode3C23.melody	@ltx/en_uk_lash/he.h.m8:heHE.OuraniasApsidos.name
ltx/en_uk_lash/tr.d063:trMA.Ode3C23.mode	@ltx/en_uk_lash/miscellanea:misc.Mode8
ltx/en_uk_lash/tr.d063:trMA.Ode3C23.ode	@ltx/en_uk_lash/miscellanea:misc.Ode3
ltx/en_uk_lash/tr.d063:trMA.Ode3C23.text	
ltx/en_uk_lash/tr.d063:trMA.Ode3C2T.incipit	…
ltx/en_uk_lash/tr.d063:trMA.Ode3C2T.melody	@ltx/en_uk_lash/he.h.m8:heHE.OuraniasApsidos.name
ltx/en_uk_lash/tr.d063:trMA.Ode3C2T.mode	@ltx/en_uk_lash/miscellanea:misc.Mode8
ltx/en_uk_lash/tr.d063:trMA.Ode3C2T.ode	@ltx/en_uk_lash/miscellanea:misc.Ode3
ltx/en_uk_lash/tr.d063:trMA.Ode3C2T.text	
ltx/en_uk_lash/tr.d063:trMA.Ode3K.incipit	@ltx/en_uk_lash/he.h.m8:heHE.OuraniasApsidos.incipit
ltx/en_uk_lash/tr.d063:trMA.Ode3K.melody	@ltx/en_uk_lash/he.h.m8:heHE.OuraniasApsidos.melody
ltx/en_uk_lash/tr.d063:trMA.Ode3K.mode	@ltx/en_uk_lash/miscellanea:misc.Mode8
ltx/en_uk_lash/tr.d063:trMA.Ode3K.ode	@ltx/en_uk_lash/miscellanea:misc.Ode3
ltx/en_uk_lash/tr.d063:trMA.Ode3K.text	@ltx/en_uk_lash/he.h.m8:heHE.OuraniasApsidos.text
ltx/en_uk_lash/tr.d063:trMA.Ode3Kathisma1.greekmelody	@ltx/en_uk_lash/he.a.m4:heAU.KateplagiIosif.greekname
ltx/en_uk_lash/tr.d063:trMA.Ode3Kathisma1.incipit	…
ltx/en_uk_lash/tr.d063:trMA.Ode3Kathisma1.melody	@ltx/en_uk_lash/he.a.m4:heAU.KateplagiIosif.notmetered
ltx/en_uk_lash/tr.d063:trMA.Ode3Kathisma1.mode	@ltx/en_uk_lash/miscellanea:misc.Mode4
ltx/en_uk_lash/tr.d063:trMA.Ode3Kathisma1.text	
ltx/en_uk_lash/tr.d063:trMA.Ode3Kathisma2.greekmelody	@ltx/en_uk_lash/he.a.m8:heAU.TinSofianKaiLogon.greekname
ltx/en_uk_lash/tr.d063:trMA.Ode3Kathisma2.incipit	…
ltx/en_uk_lash/tr.d063:trMA.Ode3Kathisma2.melody	@ltx/en_uk_lash/he.a.m8:heAU.TinSofianKaiLogon.notmetered
ltx/en_uk_lash/tr.d063:trMA.Ode3Kathisma2.mode	@ltx/en_uk_lash/miscellanea:misc.Mode8
ltx/en_uk_lash/tr.d063:trMA.Ode3Kathisma2.text	
ltx/en_uk_lash/tr.d063:trMA.Ode4C11.greekmelody	@ltx/en_uk_lash/he.h.m8:heHE.EisakikoaKyrie.greekname
ltx/en_uk_lash/tr.d063:trMA.Ode4C11.incipit	…
ltx/en_uk_lash/tr.d063:trMA.Ode4C11.melody	@ltx/en_uk_lash/he.h.m8:heHE.EisakikoaKyrie.name
ltx/en_uk_lash/tr.d063:trMA.Ode4C11.mode	@ltx/en_uk_lash/miscellanea:misc.Mode8
ltx/en_uk_lash/tr.d063:trMA.Ode4C11.ode	@ltx/en_uk_lash/miscellanea:misc.Ode4
ltx/en_uk_lash/tr.d063:trMA.Ode4C11.text	
ltx/en_uk_lash/tr.d063:trMA.Ode4C12.incipit	…
ltx/en_uk_lash/tr.d063:trMA.Ode4C12.melody	@ltx/en_uk_lash/he.h.m8:heHE.EisakikoaKyrie.name
ltx/en_uk_lash/tr.d063:trMA.Ode4C12.mode	@ltx/en_uk_lash/miscellanea:misc.Mode8
ltx/en_uk_lash/tr.d063:trMA.Ode4C12.ode	@ltx/en_uk_lash/miscellanea:misc.Ode4
ltx/en_uk_lash/tr.d063:trMA.Ode4C12.text	
ltx/en_uk_lash/tr.d063:trMA.Ode4C13.incipit	…
ltx/en_uk_lash/tr.d063:trMA.Ode4C13.melody	@ltx/en_uk_lash/he.h.m8:heHE.EisakikoaKyrie.name
ltx/en_uk_lash/tr.d063:trMA.Ode4C13.mode	@ltx/en_uk_lash/miscellanea:misc.Mode8
ltx/en_uk_lash/tr.d063:trMA.Ode4C13.ode	@ltx/en_uk_lash/miscellanea:misc.Ode4
ltx/en_uk_lash/tr.d063:trMA.Ode4C13.text	
ltx/en_uk_lash/tr.d063:trMA.Ode4C1H.greekmelody	@ltx/en_uk_lash/he.h.m8:heHE.EisakikoaKyrie.greekname
ltx/en_uk_lash/tr.d063:trMA.Ode4C1H.incipit	@ltx/en_uk_lash/he.h.m8:heHE.EisakikoaKyrie.incipit
ltx/en_uk_lash/tr.d063:trMA.Ode4C1H.melody	@ltx/en_uk_lash/he.h.m8:heHE.EisakikoaKyrie.melody
ltx/en_uk_lash/tr.d063:trMA.Ode4C1H.mode	@ltx/en_uk_lash/miscellanea:misc.Mode8
ltx/en_uk_lash/tr.d063:trMA.Ode4C1H.ode	@ltx/en_uk_lash/miscellanea:misc.Ode4
ltx/en_uk_lash/tr.d063:trMA.Ode4C1H.text	@ltx/en_uk_lash/he.h.m8:heHE.EisakikoaKyrie.text
ltx/en_uk_lash/tr.d063:trMA.Ode4C1T.incipit	…
ltx/en_uk_lash/tr.d063:trMA.Ode4C1T.melody	@ltx/en_uk_lash/he.h.m8:heHE.EisakikoaKyrie.name
ltx/en_uk_lash/tr.d063:trMA.Ode4C1T.mode	@ltx/en_uk_lash/miscellanea:misc.Mode8
ltx/en_uk_lash/tr.d063:trMA.Ode4C1T.ode	@ltx/en_uk_lash/miscellanea:misc.Ode4
ltx/en_uk_lash/tr.d063:trMA.Ode4C1T.text	
ltx/en_uk_lash/tr.d063:trMA.Ode4C21.greekmelody	@ltx/en_uk_lash/he.h.m8:heHE.SyMouIschys.greekname
ltx/en_uk_lash/tr.d063:trMA.Ode4C21.incipit	…
ltx/en_uk_lash/tr.d063:trMA.Ode4C21.melody	@ltx/en_uk_lash/he.h.m8:heHE.SyMouIschys.name
ltx/en_uk_lash/tr.d063:trMA.Ode4C21.mode	@ltx/en_uk_lash/miscellanea:misc.Mode8
ltx/en_uk_lash/tr.d063:trMA.Ode4C21.ode	@ltx/en_uk_lash/miscellanea:misc.Ode4
ltx/en_uk_lash/tr.d063:trMA.Ode4C21.text	
ltx/en_uk_lash/tr.d063:trMA.Ode4C22.incipit	…
ltx/en_uk_lash/tr.d063:trMA.Ode4C22.melody	@ltx/en_uk_lash/he.h.m8:heHE.SyMouIschys.name
ltx/en_uk_lash/tr.d063:trMA.Ode4C22.mode	@ltx/en_uk_lash/miscellanea:misc.Mode8
ltx/en_uk_lash/tr.d063:trMA.Ode4C22.ode	@ltx/en_uk_lash/miscellanea:misc.Ode4
ltx/en_uk_lash/tr.d063:trMA.Ode4C22.text	
ltx/en_uk_lash/tr.d063:trMA.Ode4C23.incipit	…
ltx/en_uk_lash/tr.d063:trMA.Ode4C23.melody	@ltx/en_uk_lash/he.h.m8:heHE.SyMouIschys.name
ltx/en_uk_lash/tr.d063:trMA.Ode4C23.mode	@ltx/en_uk_lash/miscellanea:misc.Mode8
ltx/en_uk_lash/tr.d063:trMA.Ode4C23.ode	@ltx/en_uk_lash/miscellanea:misc.Ode4
ltx/en_uk_lash/tr.d063:trMA.Ode4C23.text	
ltx/en_uk_lash/tr.d063:trMA.Ode4C2T.incipit	…
ltx/en_uk_lash/tr.d063:trMA.Ode4C2T.melody	@ltx/en_uk_lash/he.h.m8:heHE.SyMouIschys.name
ltx/en_uk_lash/tr.d063:trMA.Ode4C2T.mode	@ltx/en_uk_lash/miscellanea:misc.Mode8
ltx/en_uk_lash/tr.d063:trMA.Ode4C2T.ode	@ltx/en_uk_lash/miscellanea:misc.Ode4
ltx/en_uk_lash/tr.d063:trMA.Ode4C2T.text	
ltx/en_uk_lash/tr.d063:trMA.Ode4K.incipit	@ltx/en_uk_lash/he.h.m8:heHE.SyMouIschys.incipit
ltx/en_uk_lash/tr.d063:trMA.Ode4K.melody	@ltx/en_uk_lash/he.h.m8:heHE.SyMouIschys.melody
ltx/en_uk_lash/tr.d063:trMA.Ode4K.mode	@ltx/en_uk_lash/miscellanea:misc.Mode8
ltx/en_uk_lash/tr.d063:trMA.Ode4K.ode	@ltx/en_uk_lash/miscellanea:misc.Ode4
ltx/en_uk_lash/tr.d063:trMA.Ode4K.text	@ltx/en_uk_lash/he.h.m8:heHE.SyMouIschys.text
ltx/en_uk_lash/tr.d063:trMA.Ode5C11.greekmelody	@ltx/en_uk_lash/he.h.m8:heHE.InaTiMeAposo.greekname
ltx/en_uk_lash/tr.d063:trMA.Ode5C11.incipit	…
ltx/en_uk_lash/tr.d063:trMA.Ode5C11.melody	@ltx/en_uk_lash/he.h.m8:heHE.InaTiMeAposo.name
ltx/en_uk_lash/tr.d063:trMA.Ode5C11.mode	@ltx/en_uk_lash/miscellanea:misc.Mode8
ltx/en_uk_lash/tr.d063:trMA.Ode5C11.ode	@ltx/en_uk_lash/miscellanea:misc.Ode5
ltx/en_uk_lash/tr.d063:trMA.Ode5C11.text	
ltx/en_uk_lash/tr.d063:trMA.Ode5C12.incipit	…
ltx/en_uk_lash/tr.d063:trMA.Ode5C12.melody	@ltx/en_uk_lash/he.h.m8:heHE.InaTiMeAposo.name
ltx/en_uk_lash/tr.d063:trMA.Ode5C12.mode	@ltx/en_uk_lash/miscellanea:misc.Mode8
ltx/en_uk_lash/tr.d063:trMA.Ode5C12.ode	@ltx/en_uk_lash/miscellanea:misc.Ode5
ltx/en_uk_lash/tr.d063:trMA.Ode5C12.text	
ltx/en_uk_lash/tr.d063:trMA.Ode5C13.incipit	…
ltx/en_uk_lash/tr.d063:trMA.Ode5C13.melody	@ltx/en_uk_lash/he.h.m8:heHE.InaTiMeAposo.name
ltx/en_uk_lash/tr.d063:trMA.Ode5C13.mode	@ltx/en_uk_lash/miscellanea:misc.Mode8
ltx/en_uk_lash/tr.d063:trMA.Ode5C13.ode	@ltx/en_uk_lash/miscellanea:misc.Ode5
ltx/en_uk_lash/tr.d063:trMA.Ode5C13.text	
ltx/en_uk_lash/tr.d063:trMA.Ode5C1H.greekmelody	@ltx/en_uk_lash/he.h.m8:heHE.InaTiMeAposo.greekname
ltx/en_uk_lash/tr.d063:trMA.Ode5C1H.incipit	@ltx/en_uk_lash/he.h.m8:heHE.InaTiMeAposo.incipit
ltx/en_uk_lash/tr.d063:trMA.Ode5C1H.melody	@ltx/en_uk_lash/he.h.m8:heHE.InaTiMeAposo.melody
ltx/en_uk_lash/tr.d063:trMA.Ode5C1H.mode	@ltx/en_uk_lash/miscellanea:misc.Mode8
ltx/en_uk_lash/tr.d063:trMA.Ode5C1H.ode	@ltx/en_uk_lash/miscellanea:misc.Ode5
ltx/en_uk_lash/tr.d063:trMA.Ode5C1H.text	@ltx/en_uk_lash/he.h.m8:heHE.InaTiMeAposo.text
ltx/en_uk_lash/tr.d063:trMA.Ode5C21.greekmelody	@ltx/en_uk_lash/he.h.m8:heHE.InaTiMeAposo.greekname
ltx/en_uk_lash/tr.d063:trMA.Ode5C21.incipit	…
ltx/en_uk_lash/tr.d063:trMA.Ode5C21.melody	@ltx/en_uk_lash/he.h.m8:heHE.InaTiMeAposo.name
ltx/en_uk_lash/tr.d063:trMA.Ode5C21.mode	@ltx/en_uk_lash/miscellanea:misc.Mode8
ltx/en_uk_lash/tr.d063:trMA.Ode5C21.ode	@ltx/en_uk_lash/miscellanea:misc.Ode5
ltx/en_uk_lash/tr.d063:trMA.Ode5C21.text	
ltx/en_uk_lash/tr.d063:trMA.Ode5C22.incipit	…
ltx/en_uk_lash/tr.d063:trMA.Ode5C22.melody	@ltx/en_uk_lash/he.h.m8:heHE.InaTiMeAposo.name
ltx/en_uk_lash/tr.d063:trMA.Ode5C22.mode	@ltx/en_uk_lash/miscellanea:misc.Mode8
ltx/en_uk_lash/tr.d063:trMA.Ode5C22.ode	@ltx/en_uk_lash/miscellanea:misc.Ode5
ltx/en_uk_lash/tr.d063:trMA.Ode5C22.text	
ltx/en_uk_lash/tr.d063:trMA.Ode5C23.incipit	…
ltx/en_uk_lash/tr.d063:trMA.Ode5C23.melody	@ltx/en_uk_lash/he.h.m8:heHE.InaTiMeAposo.name
ltx/en_uk_lash/tr.d063:trMA.Ode5C23.mode	@ltx/en_uk_lash/miscellanea:misc.Mode8
ltx/en_uk_lash/tr.d063:trMA.Ode5C23.ode	@ltx/en_uk_lash/miscellanea:misc.Ode5
ltx/en_uk_lash/tr.d063:trMA.Ode5C23.text	
ltx/en_uk_lash/tr.d063:trMA.Ode5C2T.incipit	…
ltx/en_uk_lash/tr.d063:trMA.Ode5C2T.melody	@ltx/en_uk_lash/he.h.m8:heHE.InaTiMeAposo.name
ltx/en_uk_lash/tr.d063:trMA.Ode5C2T.mode	@ltx/en_uk_lash/miscellanea:misc.Mode8
ltx/en_uk_lash/tr.d063:trMA.Ode5C2T.ode	@ltx/en_uk_lash/miscellanea:misc.Ode5
ltx/en_uk_lash/tr.d063:trMA.Ode5C2T.text	
ltx/en_uk_lash/tr.d063:trMA.Ode5K.incipit	@ltx/en_uk_lash/he.h.m8:heHE.InaTiMeAposo.incipit
ltx/en_uk_lash/tr.d063:trMA.Ode5K.melody	@ltx/en_uk_lash/he.h.m8:heHE.InaTiMeAposo.melody
ltx/en_uk_lash/tr.d063:trMA.Ode5K.mode	@ltx/en_uk_lash/miscellanea:misc.Mode8
ltx/en_uk_lash/tr.d063:trMA.Ode5K.ode	@ltx/en_uk_lash/miscellanea:misc.Ode5
ltx/en_uk_lash/tr.d063:trMA.Ode5K.text	@ltx/en_uk_lash/he.h.m8:heHE.InaTiMeAposo.text
ltx/en_uk_lash/tr.d063:trMA.Ode6C11.greekmelody	@ltx/en_uk_lash/he.h.m8:heHE.TonIonanEnToKitei.greekname
ltx/en_uk_lash/tr.d063:trMA.Ode6C11.incipit	…
ltx/en_uk_lash/tr.d063:trMA.Ode6C11.melody	@ltx/en_uk_lash/he.h.m8:heHE.TonIonanEnToKitei.name
ltx/en_uk_lash/tr.d063:trMA.Ode6C11.mode	@ltx/en_uk_lash/miscellanea:misc.Mode8
ltx/en_uk_lash/tr.d063:trMA.Ode6C11.ode	@ltx/en_uk_lash/miscellanea:misc.Ode6
ltx/en_uk_lash/tr.d063:trMA.Ode6C11.text	
ltx/en_uk_lash/tr.d063:trMA.Ode6C12.incipit	…
ltx/en_uk_lash/tr.d063:trMA.Ode6C12.melody	@ltx/en_uk_lash/he.h.m8:heHE.TonIonanEnToKitei.name
ltx/en_uk_lash/tr.d063:trMA.Ode6C12.mode	@ltx/en_uk_lash/miscellanea:misc.Mode8
ltx/en_uk_lash/tr.d063:trMA.Ode6C12.ode	@ltx/en_uk_lash/miscellanea:misc.Ode6
ltx/en_uk_lash/tr.d063:trMA.Ode6C12.text	
ltx/en_uk_lash/tr.d063:trMA.Ode6C1H.greekmelody	@ltx/en_uk_lash/he.h.m8:heHE.TonIonanEnToKitei.greekname
ltx/en_uk_lash/tr.d063:trMA.Ode6C1H.incipit	@ltx/en_uk_lash/he.h.m8:heHE.TonIonanEnToKitei.incipit
ltx/en_uk_lash/tr.d063:trMA.Ode6C1H.melody	@ltx/en_uk_lash/he.h.m8:heHE.TonIonanEnToKitei.melody
ltx/en_uk_lash/tr.d063:trMA.Ode6C1H.mode	@ltx/en_uk_lash/miscellanea:misc.Mode8
ltx/en_uk_lash/tr.d063:trMA.Ode6C1H.ode	@ltx/en_uk_lash/miscellanea:misc.Ode6
ltx/en_uk_lash/tr.d063:trMA.Ode6C1H.text	@ltx/en_uk_lash/he.h.m8:heHE.TonIonanEnToKitei.text
ltx/en_uk_lash/tr.d063:trMA.Ode6C21.greekmelody	@ltx/en_uk_lash/he.h.m8:heHE.IlasthitiMoiSotir.greekname
ltx/en_uk_lash/tr.d063:trMA.Ode6C21.incipit	…
ltx/en_uk_lash/tr.d063:trMA.Ode6C21.melody	@ltx/en_uk_lash/he.h.m8:heHE.IlasthitiMoiSotir.name
ltx/en_uk_lash/tr.d063:trMA.Ode6C21.mode	@ltx/en_uk_lash/miscellanea:misc.Mode8
ltx/en_uk_lash/tr.d063:trMA.Ode6C21.ode	@ltx/en_uk_lash/miscellanea:misc.Ode6
ltx/en_uk_lash/tr.d063:trMA.Ode6C21.text	
ltx/en_uk_lash/tr.d063:trMA.Ode6C22.incipit	…
ltx/en_uk_lash/tr.d063:trMA.Ode6C22.melody	@ltx/en_uk_lash/he.h.m8:heHE.IlasthitiMoiSotir.name
ltx/en_uk_lash/tr.d063:trMA.Ode6C22.mode	@ltx/en_uk_lash/miscellanea:misc.Mode8
ltx/en_uk_lash/tr.d063:trMA.Ode6C22.ode	@ltx/en_uk_lash/miscellanea:misc.Ode6
ltx/en_uk_lash/tr.d063:trMA.Ode6C22.text	
ltx/en_uk_lash/tr.d063:trMA.Ode6K.incipit	@ltx/en_uk_lash/he.h.m8:heHE.IlasthitiMoiSotir.incipit
ltx/en_uk_lash/tr.d063:trMA.Ode6K.melody	@ltx/en_uk_lash/he.h.m8:heHE.IlasthitiMoiSotir.melody
ltx/en_uk_lash/tr.d063:trMA.Ode6K.mode	@ltx/en_uk_lash/miscellanea:misc.Mode8
ltx/en_uk_lash/tr.d063:trMA.Ode6K.ode	@ltx/en_uk_lash/miscellanea:misc.Ode6
ltx/en_uk_lash/tr.d063:trMA.Ode6K.text	@ltx/en_uk_lash/he.h.m8:heHE.IlasthitiMoiSotir.text
ltx/en_uk_lash/tr.d063:trMA.Ode7C11.greekmelody	@ltx/en_uk_lash/he.h.m8:heHE.PaidesEvraion.greekname
ltx/en_uk_lash/tr.d063:trMA.Ode7C11.incipit	…
ltx/en_uk_lash/tr.d063:trMA.Ode7C11.melody	@ltx/en_uk_lash/he.h.m8:heHE.PaidesEvraion.name
ltx/en_uk_lash/tr.d063:trMA.Ode7C11.mode	@ltx/en_uk_lash/miscellanea:misc.Mode8
ltx/en_uk_lash/tr.d063:trMA.Ode7C11.ode	@ltx/en_uk_lash/miscellanea:misc.Ode7
ltx/en_uk_lash/tr.d063:trMA.Ode7C11.text	
ltx/en_uk_lash/tr.d063:trMA.Ode7C12.incipit	…
ltx/en_uk_lash/tr.d063:trMA.Ode7C12.melody	@ltx/en_uk_lash/he.h.m8:heHE.PaidesEvraion.name
ltx/en_uk_lash/tr.d063:trMA.Ode7C12.mode	@ltx/en_uk_lash/miscellanea:misc.Mode8
ltx/en_uk_lash/tr.d063:trMA.Ode7C12.ode	@ltx/en_uk_lash/miscellanea:misc.Ode7
ltx/en_uk_lash/tr.d063:trMA.Ode7C12.text	
ltx/en_uk_lash/tr.d063:trMA.Ode7C1H.greekmelody	@ltx/en_uk_lash/he.h.m8:heHE.PaidesEvraion.greekname
ltx/en_uk_lash/tr.d063:trMA.Ode7C1H.incipit	@ltx/en_uk_lash/he.h.m8:heHE.PaidesEvraion.incipit
ltx/en_uk_lash/tr.d063:trMA.Ode7C1H.melody	@ltx/en_uk_lash/he.h.m8:heHE.PaidesEvraion.melody
ltx/en_uk_lash/tr.d063:trMA.Ode7C1H.mode	@ltx/en_uk_lash/miscellanea:misc.Mode8
ltx/en_uk_lash/tr.d063:trMA.Ode7C1H.ode	@ltx/en_uk_lash/miscellanea:misc.Ode7
ltx/en_uk_lash/tr.d063:trMA.Ode7C1H.text	@ltx/en_uk_lash/he.h.m8:heHE.PaidesEvraion.text
ltx/en_uk_lash/tr.d063:trMA.Ode7C21.greekmelody	@ltx/en_uk_lash/he.h.m8:heHE.OiEkTisIoudaias.greekname
ltx/en_uk_lash/tr.d063:trMA.Ode7C21.incipit	…
ltx/en_uk_lash/tr.d063:trMA.Ode7C21.melody	@ltx/en_uk_lash/he.h.m8:heHE.OiEkTisIoudaias.name
ltx/en_uk_lash/tr.d063:trMA.Ode7C21.mode	@ltx/en_uk_lash/miscellanea:misc.Mode8
ltx/en_uk_lash/tr.d063:trMA.Ode7C21.ode	@ltx/en_uk_lash/miscellanea:misc.Ode7
ltx/en_uk_lash/tr.d063:trMA.Ode7C21.text	
ltx/en_uk_lash/tr.d063:trMA.Ode7C22.incipit	…
ltx/en_uk_lash/tr.d063:trMA.Ode7C22.melody	@ltx/en_uk_lash/he.h.m8:heHE.OiEkTisIoudaias.name
ltx/en_uk_lash/tr.d063:trMA.Ode7C22.mode	@ltx/en_uk_lash/miscellanea:misc.Mode8
ltx/en_uk_lash/tr.d063:trMA.Ode7C22.ode	@ltx/en_uk_lash/miscellanea:misc.Ode7
ltx/en_uk_lash/tr.d063:trMA.Ode7C22.text	
ltx/en_uk_lash/tr.d063:trMA.Ode7C23.incipit	…
ltx/en_uk_lash/tr.d063:trMA.Ode7C23.melody	@ltx/en_uk_lash/he.h.m8:heHE.OiEkTisIoudaias.name
ltx/en_uk_lash/tr.d063:trMA.Ode7C23.mode	@ltx/en_uk_lash/miscellanea:misc.Mode8
ltx/en_uk_lash/tr.d063:trMA.Ode7C23.ode	@ltx/en_uk_lash/miscellanea:misc.Ode7
ltx/en_uk_lash/tr.d063:trMA.Ode7C23.text	
ltx/en_uk_lash/tr.d063:trMA.Ode7K.incipit	@ltx/en_uk_lash/he.h.m8:heHE.OiEkTisIoudaias.incipit
ltx/en_uk_lash/tr.d063:trMA.Ode7K.melody	@ltx/en_uk_lash/he.h.m8:heHE.OiEkTisIoudaias.melody
ltx/en_uk_lash/tr.d063:trMA.Ode7K.mode	@ltx/en_uk_lash/miscellanea:misc.Mode8
ltx/en_uk_lash/tr.d063:trMA.Ode7K.ode	@ltx/en_uk_lash/miscellanea:misc.Ode7
ltx/en_uk_lash/tr.d063:trMA.Ode7K.text	@ltx/en_uk_lash/he.h.m8:heHE.OiEkTisIoudaias.text
ltx/en_uk_lash/tr.d063:trMA.Ode8C11.greekmelody	@ltx/en_uk_lash/he.h.m8:heHE.MousikonOrganon.greekname
ltx/en_uk_lash/tr.d063:trMA.Ode8C11.incipit	…
ltx/en_uk_lash/tr.d063:trMA.Ode8C11.melody	@ltx/en_uk_lash/he.h.m8:heHE.MousikonOrganon.name
ltx/en_uk_lash/tr.d063:trMA.Ode8C11.mode	@ltx/en_uk_lash/miscellanea:misc.Mode8
ltx/en_uk_lash/tr.d063:trMA.Ode8C11.ode	@ltx/en_uk_lash/miscellanea:misc.Ode8
ltx/en_uk_lash/tr.d063:trMA.Ode8C11.text	
ltx/en_uk_lash/tr.d063:trMA.Ode8C12.incipit	…
ltx/en_uk_lash/tr.d063:trMA.Ode8C12.melody	@ltx/en_uk_lash/he.h.m8:heHE.MousikonOrganon.name
ltx/en_uk_lash/tr.d063:trMA.Ode8C12.mode	@ltx/en_uk_lash/miscellanea:misc.Mode8
ltx/en_uk_lash/tr.d063:trMA.Ode8C12.ode	@ltx/en_uk_lash/miscellanea:misc.Ode8
ltx/en_uk_lash/tr.d063:trMA.Ode8C12.text	
ltx/en_uk_lash/tr.d063:trMA.Ode8C1H.greekmelody	@ltx/en_uk_lash/he.h.m8:heHE.MousikonOrganon.greekname
ltx/en_uk_lash/tr.d063:trMA.Ode8C1H.incipit	@ltx/en_uk_lash/he.h.m8:heHE.MousikonOrganon.incipit
ltx/en_uk_lash/tr.d063:trMA.Ode8C1H.melody	@ltx/en_uk_lash/he.h.m8:heHE.MousikonOrganon.melody
ltx/en_uk_lash/tr.d063:trMA.Ode8C1H.mode	@ltx/en_uk_lash/miscellanea:misc.Mode8
ltx/en_uk_lash/tr.d063:trMA.Ode8C1H.ode	@ltx/en_uk_lash/miscellanea:misc.Ode8
ltx/en_uk_lash/tr.d063:trMA.Ode8C1H.text	@ltx/en_uk_lash/he.h.m8:heHE.MousikonOrganon.text
ltx/en_uk_lash/tr.d063:trMA.Ode8C21.greekmelody	@ltx/en_uk_lash/he.h.m8:heHE.TonVasileaTonOuranon.greekname
ltx/en_uk_lash/tr.d063:trMA.Ode8C21.incipit	…
ltx/en_uk_lash/tr.d063:trMA.Ode8C21.melody	@ltx/en_uk_lash/he.h.m8:heHE.TonVasileaTonOuranon.name
ltx/en_uk_lash/tr.d063:trMA.Ode8C21.mode	@ltx/en_uk_lash/miscellanea:misc.Mode8
ltx/en_uk_lash/tr.d063:trMA.Ode8C21.ode	@ltx/en_uk_lash/miscellanea:misc.Ode8
ltx/en_uk_lash/tr.d063:trMA.Ode8C21.text	
ltx/en_uk_lash/tr.d063:trMA.Ode8C22.incipit	…
ltx/en_uk_lash/tr.d063:trMA.Ode8C22.melody	@ltx/en_uk_lash/he.h.m8:heHE.TonVasileaTonOuranon.name
ltx/en_uk_lash/tr.d063:trMA.Ode8C22.mode	@ltx/en_uk_lash/miscellanea:misc.Mode8
ltx/en_uk_lash/tr.d063:trMA.Ode8C22.ode	@ltx/en_uk_lash/miscellanea:misc.Ode8
ltx/en_uk_lash/tr.d063:trMA.Ode8C22.text	
ltx/en_uk_lash/tr.d063:trMA.Ode8C23.incipit	…
ltx/en_uk_lash/tr.d063:trMA.Ode8C23.melody	@ltx/en_uk_lash/he.h.m8:heHE.TonVasileaTonOuranon.name
ltx/en_uk_lash/tr.d063:trMA.Ode8C23.mode	@ltx/en_uk_lash/miscellanea:misc.Mode8
ltx/en_uk_lash/tr.d063:trMA.Ode8C23.ode	@ltx/en_uk_lash/miscellanea:misc.Ode8
ltx/en_uk_lash/tr.d063:trMA.Ode8C23.text	
ltx/en_uk_lash/tr.d063:trMA.Ode8K.incipit	@ltx/en_uk_lash/he.h.m8:heHE.TonVasileaTonOuranon.incipit
ltx/en_uk_lash/tr.d063:trMA.Ode8K.melody	
ltx/en_uk_lash/tr.d063:trMA.Ode8K.mode	@ltx/en_uk_lash/miscellanea:misc.Mode8
ltx/en_uk_lash/tr.d063:trMA.Ode8K.ode	@ltx/en_uk_lash/miscellanea:misc.Ode8
ltx/en_uk_lash/tr.d063:trMA.Ode8K.text	@ltx/en_uk_lash/he.h.m8:heHE.TonVasileaTonOuranon.text
ltx/en_uk_lash/tr.d063:trMA.Ode9C11.greekmelody	@ltx/en_uk_lash/he.h.m8:heHE.TinAgninEndoxos.greekname
ltx/en_uk_lash/tr.d063:trMA.Ode9C11.incipit	…
ltx/en_uk_lash/tr.d063:trMA.Ode9C11.melody	@ltx/en_uk_lash/he.h.m8:heHE.TinAgninEndoxos.name
ltx/en_uk_lash/tr.d063:trMA.Ode9C11.mode	@ltx/en_uk_lash/miscellanea:misc.Mode8
ltx/en_uk_lash/tr.d063:trMA.Ode9C11.ode	@ltx/en_uk_lash/miscellanea:misc.Ode9
ltx/en_uk_lash/tr.d063:trMA.Ode9C11.text	
ltx/en_uk_lash/tr.d063:trMA.Ode9C12.incipit	…
ltx/en_uk_lash/tr.d063:trMA.Ode9C12.melody	@ltx/en_uk_lash/he.h.m8:heHE.TinAgninEndoxos.name
ltx/en_uk_lash/tr.d063:trMA.Ode9C12.mode	@ltx/en_uk_lash/miscellanea:misc.Mode8
ltx/en_uk_lash/tr.d063:trMA.Ode9C12.ode	@ltx/en_uk_lash/miscellanea:misc.Ode9
ltx/en_uk_lash/tr.d063:trMA.Ode9C12.text	
ltx/en_uk_lash/tr.d063:trMA.Ode9C1H.greekmelody	@ltx/en_uk_lash/he.h.m8:heHE.TinAgninEndoxos.greekname
ltx/en_uk_lash/tr.d063:trMA.Ode9C1H.incipit	@ltx/en_uk_lash/he.h.m8:heHE.TinAgninEndoxos.incipit
ltx/en_uk_lash/tr.d063:trMA.Ode9C1H.melody	@ltx/en_uk_lash/he.h.m8:heHE.TinAgninEndoxos.melody
ltx/en_uk_lash/tr.d063:trMA.Ode9C1H.mode	@ltx/en_uk_lash/miscellanea:misc.Mode8
ltx/en_uk_lash/tr.d063:trMA.Ode9C1H.ode	@ltx/en_uk_lash/miscellanea:misc.Ode9
ltx/en_uk_lash/tr.d063:trMA.Ode9C1H.text	@ltx/en_uk_lash/he.h.m8:heHE.TinAgninEndoxos.text
ltx/en_uk_lash/tr.d063:trMA.Ode9C21.greekmelody	@ltx/en_uk_lash/he.h.m8:heHE.KyriosTheotokon.greekname
ltx/en_uk_lash/tr.d063:trMA.Ode9C21.incipit	…
ltx/en_uk_lash/tr.d063:trMA.Ode9C21.melody	@ltx/en_uk_lash/he.h.m8:heHE.KyriosTheotokon.name
ltx/en_uk_lash/tr.d063:trMA.Ode9C21.mode	@ltx/en_uk_lash/miscellanea:misc.Mode8
ltx/en_uk_lash/tr.d063:trMA.Ode9C21.ode	@ltx/en_uk_lash/miscellanea:misc.Ode9
ltx/en_uk_lash/tr.d063:trMA.Ode9C21.text	
ltx/en_uk_lash/tr.d063:trMA.Ode9C22.incipit	…
ltx/en_uk_lash/tr.d063:trMA.Ode9C22.melody	@ltx/en_uk_lash/he.h.m8:heHE.KyriosTheotokon.name
ltx/en_uk_lash/tr.d063:trMA.Ode9C22.mode	@ltx/en_uk_lash/miscellanea:misc.Mode8
ltx/en_uk_lash/tr.d063:trMA.Ode9C22.ode	@ltx/en_uk_lash/miscellanea:misc.Ode9
ltx/en_uk_lash/tr.d063:trMA.Ode9C22.text	
ltx/en_uk_lash/tr.d063:trMA.Ode9C23.incipit	…
ltx/en_uk_lash/tr.d063:trMA.Ode9C23.melody	@ltx/en_uk_lash/he.h.m8:heHE.KyriosTheotokon.name
ltx/en_uk_lash/tr.d063:trMA.Ode9C23.mode	@ltx/en_uk_lash/miscellanea:misc.Mode8
ltx/en_uk_lash/tr.d063:trMA.Ode9C23.ode	@ltx/en_uk_lash/miscellanea:misc.Ode9
ltx/en_uk_lash/tr.d063:trMA.Ode9C23.text	
ltx/en_uk_lash/tr.d063:trMA.Ode9C24.incipit	…
ltx/en_uk_lash/tr.d063:trMA.Ode9C24.melody	@ltx/en_uk_lash/he.h.m8:heHE.KyriosTheotokon.name
ltx/en_uk_lash/tr.d063:trMA.Ode9C24.mode	@ltx/en_uk_lash/miscellanea:misc.Mode8
ltx/en_uk_lash/tr.d063:trMA.Ode9C24.ode	@ltx/en_uk_lash/miscellanea:misc.Ode9
ltx/en_uk_lash/tr.d063:trMA.Ode9C24.text	
ltx/en_uk_lash/tr.d063:trMA.Ode9K.incipit	@ltx/en_uk_lash/he.h.m8:heHE.KyriosTheotokon.incipit
ltx/en_uk_lash/tr.d063:trMA.Ode9K.melody	@ltx/en_uk_lash/he.h.m8:heHE.KyriosTheotokon.melody
ltx/en_uk_lash/tr.d063:trMA.Ode9K.mode	@ltx/en_uk_lash/miscellanea:misc.Mode8
ltx/en_uk_lash/tr.d063:trMA.Ode9K.ode	@ltx/en_uk_lash/miscellanea:misc.Ode9
ltx/en_uk_lash/tr.d063:trMA.Ode9K.text	@ltx/en_uk_lash/he.h.m8:heHE.KyriosTheotokon.text
ltx/en_uk_lash/tr.d063:trMA.Oikos1.text	
ltx/en_uk_lash/tr.d063:trSY.commemoration.couplet1.title	
ltx/en_uk_lash/tr.d063:trSY.commemoration.couplet1.verse1	
ltx/en_uk_lash/tr.d063:trSY.commemoration.couplet1.verse2	
ltx/en_uk_lash/tr.d063:trSY.commemoration.narration.p01	
ltx/en_uk_lash/tr.d063:trSY.commemoration.narration.p02	
ltx/en_uk_lash/tr.d063:trSY.commemoration.narration.p03	
ltx/en_uk_lash/tr.d063:trSY.commemoration.narration.p04	
ltx/en_uk_lash/tr.d063:trSY.commemoration.narration.p05	
ltx/en_uk_lash/tr.d063:trSY.commemoration.narration.p06	
ltx/en_uk_lash/tr.d063:trSY.commemoration.narration.p07	
ltx/en_uk_lash/tr.d063:trSY.commemoration.text	
ltx/en_uk_lash/tr.d063:trSY.lastline	
ltx/en_uk_lash/tr.d063:trVE.Apolytikion1.incipit	Assuring us before your Passion…
ltx/en_uk_lash/tr.d063:trVE.Apolytikion1.melody	
ltx/en_uk_lash/tr.d063:trVE.Apolytikion1.mode	@ltx/en_uk_lash/miscellanea:misc.Mode1
ltx/en_uk_lash/tr.d063:trVE.Apolytikion1.text	Assuring us before your Passion of the general resurrection, you raised Lazarus from the dead, O Christ God. Therefore, like the Children, we also carry tokens of victory, and we cry to you, the Conqueror of death: Hosanna in the highest! Blessed is he who comes in the name of the Lord.
ltx/en_uk_lash/tr.d063:trVE.AposIdiomelon1.incipit	…
ltx/en_uk_lash/tr.d063:trVE.AposIdiomelon1.melody	@ltx/en_uk_lash/miscellanea:misc.Idiomelon
ltx/en_uk_lash/tr.d063:trVE.AposIdiomelon1.mode	@ltx/en_uk_lash/miscellanea:misc.Mode8
ltx/en_uk_lash/tr.d063:trVE.AposIdiomelon1.text	
ltx/en_uk_lash/tr.d063:trVE.AposMartyric.incipit	@ltx/en_uk_lash/oc.m8.d3:ocVE.Aposticha3.incipit
ltx/en_uk_lash/tr.d063:trVE.AposMartyric.melody	
ltx/en_uk_lash/tr.d063:trVE.AposMartyric.mode	@ltx/en_uk_lash/miscellanea:misc.Mode8
ltx/en_uk_lash/tr.d063:trVE.AposMartyric.text	@ltx/en_uk_lash/oc.m8.d3:ocVE.Aposticha3.text
ltx/en_uk_lash/tr.d063:trVE.SticBoth.incipit	…
ltx/en_uk_lash/tr.d063:trVE.SticBoth.melody	@ltx/en_uk_lash/miscellanea:misc.Idiomelon
ltx/en_uk_lash/tr.d063:trVE.SticBoth.mode	@ltx/en_uk_lash/miscellanea:misc.Mode8
ltx/en_uk_lash/tr.d063:trVE.SticBoth.poet	@ltx/en_uk_lash/poets:po.AndreouTyflou
ltx/en_uk_lash/tr.d063:trVE.SticBoth.text	
ltx/en_uk_lash/tr.d063:trVE.SticGlory.incipit	…
ltx/en_uk_lash/tr.d063:trVE.SticGlory.melody	@ltx/en_uk_lash/miscellanea:misc.Idiomelon
ltx/en_uk_lash/tr.d063:trVE.SticGlory.mode	@ltx/en_uk_lash/miscellanea:misc.Mode8
ltx/en_uk_lash/tr.d063:trVE.SticGlory.text	
ltx/en_uk_lash/tr.d063:trVE.Stichera01.incipit	…
ltx/en_uk_lash/tr.d063:trVE.Stichera01.melody	@ltx/en_uk_lash/miscellanea:misc.Idiomelon
ltx/en_uk_lash/tr.d063:trVE.Stichera01.mode	@ltx/en_uk_lash/miscellanea:misc.Mode6
ltx/en_uk_lash/tr.d063:trVE.Stichera01.poet	@ltx/en_uk_lash/poets:po.LeontosTouVasileos
ltx/en_uk_lash/tr.d063:trVE.Stichera01.text	
ltx/en_uk_lash/tr.d063:trVE.Stichera02.incipit	…
ltx/en_uk_lash/tr.d063:trVE.Stichera02.melody	@ltx/en_uk_lash/miscellanea:misc.Idiomelon
ltx/en_uk_lash/tr.d063:trVE.Stichera02.mode	@ltx/en_uk_lash/miscellanea:misc.Mode6
ltx/en_uk_lash/tr.d063:trVE.Stichera02.text	
ltx/en_uk_lash/tr.d063:trVE.Stichera03.incipit	…
ltx/en_uk_lash/tr.d063:trVE.Stichera03.melody	@ltx/en_uk_lash/miscellanea:misc.Idiomelon
ltx/en_uk_lash/tr.d063:trVE.Stichera03.mode	@ltx/en_uk_lash/miscellanea:misc.Mode6
ltx/en_uk_lash/tr.d063:trVE.Stichera03.text	
ltx/en_uk_lash/tr.d063:trVE.Stichera04.incipit	…
ltx/en_uk_lash/tr.d063:trVE.Stichera04.melody	@ltx/en_uk_lash/miscellanea:misc.Idiomelon
ltx/en_uk_lash/tr.d063:trVE.Stichera04.mode	@ltx/en_uk_lash/miscellanea:misc.Mode6
ltx/en_uk_lash/tr.d063:trVE.Stichera04.text	
ltx/en_uk_lash/tr.d063:trVE.Stichera05.incipit	…
ltx/en_uk_lash/tr.d063:trVE.Stichera05.melody	@ltx/en_uk_lash/miscellanea:misc.Idiomelon
ltx/en_uk_lash/tr.d063:trVE.Stichera05.mode	@ltx/en_uk_lash/miscellanea:misc.Mode6
ltx/en_uk_lash/tr.d063:trVE.Stichera05.text	
ltx/en_uk_lash/tr.d063:trVL.header	
