ltx/en_uk_lash/oc.m3.d5:ocBK.ModeNaked	@ltx/en_uk_lash/miscellanea:misc.Mode3.naked
ltx/en_uk_lash/oc.m3.d5:ocLI.Beatitudes1.incipit	@ltx/en_uk_lash/oc.m3.d1:ocLI.Beatitudes1.incipit
ltx/en_uk_lash/oc.m3.d5:ocLI.Beatitudes1.melody	
ltx/en_uk_lash/oc.m3.d5:ocLI.Beatitudes1.mode	@ltx/en_uk_lash/miscellanea:misc.Mode3
ltx/en_uk_lash/oc.m3.d5:ocLI.Beatitudes1.text	@ltx/en_uk_lash/oc.m3.d1:ocLI.Beatitudes1.text
ltx/en_uk_lash/oc.m3.d5:ocLI.Beatitudes2.incipit	…
ltx/en_uk_lash/oc.m3.d5:ocLI.Beatitudes2.melody	
ltx/en_uk_lash/oc.m3.d5:ocLI.Beatitudes2.mode	@ltx/en_uk_lash/miscellanea:misc.Mode3
ltx/en_uk_lash/oc.m3.d5:ocLI.Beatitudes2.text	
ltx/en_uk_lash/oc.m3.d5:ocLI.Beatitudes3.incipit	…
ltx/en_uk_lash/oc.m3.d5:ocLI.Beatitudes3.melody	
ltx/en_uk_lash/oc.m3.d5:ocLI.Beatitudes3.mode	@ltx/en_uk_lash/miscellanea:misc.Mode3
ltx/en_uk_lash/oc.m3.d5:ocLI.Beatitudes3.text	
ltx/en_uk_lash/oc.m3.d5:ocLI.Beatitudes4.incipit	…
ltx/en_uk_lash/oc.m3.d5:ocLI.Beatitudes4.melody	
ltx/en_uk_lash/oc.m3.d5:ocLI.Beatitudes4.mode	@ltx/en_uk_lash/miscellanea:misc.Mode3
ltx/en_uk_lash/oc.m3.d5:ocLI.Beatitudes4.text	
ltx/en_uk_lash/oc.m3.d5:ocLI.BeatitudesT.incipit	…
ltx/en_uk_lash/oc.m3.d5:ocLI.BeatitudesT.melody	
ltx/en_uk_lash/oc.m3.d5:ocLI.BeatitudesT.mode	@ltx/en_uk_lash/miscellanea:misc.Mode3
ltx/en_uk_lash/oc.m3.d5:ocLI.BeatitudesT.text	
ltx/en_uk_lash/oc.m3.d5:ocLI.BeatitudesTr.incipit	…
ltx/en_uk_lash/oc.m3.d5:ocLI.BeatitudesTr.melody	
ltx/en_uk_lash/oc.m3.d5:ocLI.BeatitudesTr.mode	@ltx/en_uk_lash/miscellanea:misc.Mode3
ltx/en_uk_lash/oc.m3.d5:ocLI.BeatitudesTr.text	
ltx/en_uk_lash/oc.m3.d5:ocLI.MM.Beatitudes1234TrTas78910GB.text	@ltx/en_uk_lash/properties:media.key
ltx/en_uk_lash/oc.m3.d5:ocMA.ApolTheotokion.incipit	@ltx/en_uk_lash/oc.m3.d3:ocMA.Kathisma33.incipit
ltx/en_uk_lash/oc.m3.d5:ocMA.ApolTheotokion.melody	
ltx/en_uk_lash/oc.m3.d5:ocMA.ApolTheotokion.mode	@ltx/en_uk_lash/miscellanea:misc.Mode3
ltx/en_uk_lash/oc.m3.d5:ocMA.ApolTheotokion.text	@ltx/en_uk_lash/oc.m3.d3:ocMA.Kathisma33.text
ltx/en_uk_lash/oc.m3.d5:ocMA.AposTheotokion.incipit	@ltx/en_uk_lash/oc.m3.d2:ocVE.AposTheotokion.incipit
ltx/en_uk_lash/oc.m3.d5:ocMA.AposTheotokion.melody	
ltx/en_uk_lash/oc.m3.d5:ocMA.AposTheotokion.mode	@ltx/en_uk_lash/miscellanea:misc.Mode3
ltx/en_uk_lash/oc.m3.d5:ocMA.AposTheotokion.text	@ltx/en_uk_lash/oc.m3.d2:ocVE.AposTheotokion.text
ltx/en_uk_lash/oc.m3.d5:ocMA.Aposticha1.incipit	@ltx/en_uk_lash/oc.m3.d5:ocVE.Aposticha1.incipit
ltx/en_uk_lash/oc.m3.d5:ocMA.Aposticha1.melody	
ltx/en_uk_lash/oc.m3.d5:ocMA.Aposticha1.mode	@ltx/en_uk_lash/miscellanea:misc.Mode3
ltx/en_uk_lash/oc.m3.d5:ocMA.Aposticha1.text	@ltx/en_uk_lash/oc.m3.d5:ocVE.Aposticha1.text
ltx/en_uk_lash/oc.m3.d5:ocMA.Aposticha2.incipit	@ltx/en_uk_lash/oc.m3.d5:ocVE.Aposticha2.incipit
ltx/en_uk_lash/oc.m3.d5:ocMA.Aposticha2.melody	
ltx/en_uk_lash/oc.m3.d5:ocMA.Aposticha2.mode	@ltx/en_uk_lash/miscellanea:misc.Mode3
ltx/en_uk_lash/oc.m3.d5:ocMA.Aposticha2.text	@ltx/en_uk_lash/oc.m3.d5:ocVE.Aposticha2.text
ltx/en_uk_lash/oc.m3.d5:ocMA.Aposticha3.incipit	The powers of the holy…
ltx/en_uk_lash/oc.m3.d5:ocMA.Aposticha3.melody	
ltx/en_uk_lash/oc.m3.d5:ocMA.Aposticha3.mode	@ltx/en_uk_lash/miscellanea:misc.Mode3
ltx/en_uk_lash/oc.m3.d5:ocMA.Aposticha3.text	The powers of the holy Angels marvelled at the contests of the Martyrs; for clothed in a mortal body they despised tortures and became imitators of the passion of our Saviour, and they intercede for our souls.
ltx/en_uk_lash/oc.m3.d5:ocMA.C2.acrostic.notice1	
ltx/en_uk_lash/oc.m3.d5:ocMA.C2.acrostic.text	
ltx/en_uk_lash/oc.m3.d5:ocMA.C2.acrostic.title	
ltx/en_uk_lash/oc.m3.d5:ocMA.Kathisma11.greekmelody	@ltx/en_uk_lash/he.a.m3:heAU.TinOraiotita.greekname
ltx/en_uk_lash/oc.m3.d5:ocMA.Kathisma11.incipit	As All-powerful you have made…
ltx/en_uk_lash/oc.m3.d5:ocMA.Kathisma11.melody	@ltx/en_uk_lash/he.a.m3:heAU.TinOraiotita.notmetered
ltx/en_uk_lash/oc.m3.d5:ocMA.Kathisma11.mode	@ltx/en_uk_lash/miscellanea:misc.Mode3
ltx/en_uk_lash/oc.m3.d5:ocMA.Kathisma11.text	As All-powerful you have made the memory of your Apostles radiantly bright, Lord, for you gave them strength to imitate your sufferings; bravely they conquered the power of Beliar; therefore they have received gifts of healings. At their supplications, O Merciful, grant peace to your people.
ltx/en_uk_lash/oc.m3.d5:ocMA.Kathisma12.greekmelody	@ltx/en_uk_lash/he.a.m3:heAU.TheiasPisteos.greekname
ltx/en_uk_lash/oc.m3.d5:ocMA.Kathisma12.incipit	The Apostles of God the…
ltx/en_uk_lash/oc.m3.d5:ocMA.Kathisma12.melody	@ltx/en_uk_lash/he.a.m3:heAU.TheiasPisteos.notmetered
ltx/en_uk_lash/oc.m3.d5:ocMA.Kathisma12.mode	@ltx/en_uk_lash/miscellanea:misc.Mode3
ltx/en_uk_lash/oc.m3.d5:ocMA.Kathisma12.text	The Apostles of God the Word watered the earth with streams, and the ear of grain of the Faith sprouted and filled the ends of the earth, for they cut down all the cockle; therefore they brought all to Christ God, baptising them into the uncreated Trinity.
ltx/en_uk_lash/oc.m3.d5:ocMA.Kathisma13.greekmelody	@ltx/en_uk_lash/he.a.m3:heAU.TinOraiotita.greekname
ltx/en_uk_lash/oc.m3.d5:ocMA.Kathisma13.incipit	As I called to mind…
ltx/en_uk_lash/oc.m3.d5:ocMA.Kathisma13.melody	@ltx/en_uk_lash/he.a.m3:heAU.TinOraiotita.notmetered
ltx/en_uk_lash/oc.m3.d5:ocMA.Kathisma13.mode	@ltx/en_uk_lash/miscellanea:misc.Mode3
ltx/en_uk_lash/oc.m3.d5:ocMA.Kathisma13.text	As I called to mind the measureless wealth of your sympathy and the invincible might of your power, beset by trouble and in dread despair, I ran to your protection; crying with tears from the depths of my heart, I cry to you Virgin Mother of God, ''Save me, save the unworthy!''
ltx/en_uk_lash/oc.m3.d5:ocMA.Kathisma21.greekmelody	@ltx/en_uk_lash/he.a.m3:heAU.TheiasPisteos.greekname
ltx/en_uk_lash/oc.m3.d5:ocMA.Kathisma21.incipit	Come, let us all praise…
ltx/en_uk_lash/oc.m3.d5:ocMA.Kathisma21.melody	@ltx/en_uk_lash/he.a.m3:heAU.TheiasPisteos.notmetered
ltx/en_uk_lash/oc.m3.d5:ocMA.Kathisma21.mode	@ltx/en_uk_lash/miscellanea:misc.Mode3
ltx/en_uk_lash/oc.m3.d5:ocMA.Kathisma21.text	Come, let us all praise the Apostles with godly songs, for by drowning the error of idols they led mortals to divine light and taught them to believe in the Trinity; therefore as today we devoutly honour them, let us glorify Christ our God.
ltx/en_uk_lash/oc.m3.d5:ocMA.Kathisma22.greekmelody	@ltx/en_uk_lash/he.a.m3:heAU.TheiasPisteos.greekname
ltx/en_uk_lash/oc.m3.d5:ocMA.Kathisma22.incipit	The far-famed and god-bearing Apostles…
ltx/en_uk_lash/oc.m3.d5:ocMA.Kathisma22.melody	@ltx/en_uk_lash/he.a.m3:heAU.TheiasPisteos.notmetered
ltx/en_uk_lash/oc.m3.d5:ocMA.Kathisma22.mode	@ltx/en_uk_lash/miscellanea:misc.Mode3
ltx/en_uk_lash/oc.m3.d5:ocMA.Kathisma22.text	The far-famed and god-bearing Apostles, shining with deeds of right belief, quenched the error of false belief; enriching the world with true religion they radiantly adorned the Churches as they ask Christ God to grant peace to the faithful and his great mercy.
ltx/en_uk_lash/oc.m3.d5:ocMA.Kathisma23.greekmelody	@ltx/en_uk_lash/he.a.m3:heAU.TheiasPisteos.greekname
ltx/en_uk_lash/oc.m3.d5:ocMA.Kathisma23.incipit	Drowning in a sea of…
ltx/en_uk_lash/oc.m3.d5:ocMA.Kathisma23.melody	@ltx/en_uk_lash/he.a.m3:heAU.TheiasPisteos.notmetered
ltx/en_uk_lash/oc.m3.d5:ocMA.Kathisma23.mode	@ltx/en_uk_lash/miscellanea:misc.Mode3
ltx/en_uk_lash/oc.m3.d5:ocMA.Kathisma23.text	Drowning in a sea of passions I flee to the ocean of your pities, Mother of God, help me; stretch out your right hand to me your servant, All-Immaculate, save me as once your Son saved Peter; have mercy on a soul foundering in the billows of many offences.
ltx/en_uk_lash/oc.m3.d5:ocMA.Kathisma31.greekmelody	@ltx/en_uk_lash/he.a.m3:heAU.TheiasPisteos.greekname
ltx/en_uk_lash/oc.m3.d5:ocMA.Kathisma31.incipit	In praise we hymn you…
ltx/en_uk_lash/oc.m3.d5:ocMA.Kathisma31.melody	@ltx/en_uk_lash/he.a.m3:heAU.TheiasPisteos.notmetered
ltx/en_uk_lash/oc.m3.d5:ocMA.Kathisma31.mode	@ltx/en_uk_lash/miscellanea:misc.Mode3
ltx/en_uk_lash/oc.m3.d5:ocMA.Kathisma31.text	In praise we hymn you, Nicholas, as herald of the truth and radiant beacon of the world, and as we ask in faith we cry out, ''As you snatched the innocent from death, so rescue us, O Holy one, from dangers, affliction and every dread trouble.
ltx/en_uk_lash/oc.m3.d5:ocMA.Kathisma32.incipit	Holy, all-praised Champions, through the…
ltx/en_uk_lash/oc.m3.d5:ocMA.Kathisma32.melody	
ltx/en_uk_lash/oc.m3.d5:ocMA.Kathisma32.mode	@ltx/en_uk_lash/miscellanea:misc.Mode3
ltx/en_uk_lash/oc.m3.d5:ocMA.Kathisma32.text	Holy, all-praised Champions, through the faith you shone out as radiant beacons, physicians of the weak; for you were not cowed by the torments of tyrants but cast down the blasphemies of idols, having as an invincible trophy the Cross of the truth.
ltx/en_uk_lash/oc.m3.d5:ocMA.Kathisma33.greekmelody	@ltx/en_uk_lash/he.a.m3:heAU.TheiasPisteos.greekname
ltx/en_uk_lash/oc.m3.d5:ocMA.Kathisma33.incipit	All-Immaculate Mother of God, you…
ltx/en_uk_lash/oc.m3.d5:ocMA.Kathisma33.melody	@ltx/en_uk_lash/he.a.m3:heAU.TheiasPisteos.notmetered
ltx/en_uk_lash/oc.m3.d5:ocMA.Kathisma33.mode	@ltx/en_uk_lash/miscellanea:misc.Mode3
ltx/en_uk_lash/oc.m3.d5:ocMA.Kathisma33.text	All-Immaculate Mother of God, you have been revealed as the all golden throne of the King and Paradise that flowers again; for you carried God in your womb and make us fragrant with divine graces; therefore we all ever proclaim you as truly Mother of God and we magnify you.
ltx/en_uk_lash/oc.m3.d5:ocMA.OdeW1C11.incipit	Come let us bless the…
ltx/en_uk_lash/oc.m3.d5:ocMA.OdeW1C11.melody	@ltx/en_uk_lash/he.h.m3:heHE.OTaYdata.name
ltx/en_uk_lash/oc.m3.d5:ocMA.OdeW1C11.mode	@ltx/en_uk_lash/miscellanea:misc.Mode3
ltx/en_uk_lash/oc.m3.d5:ocMA.OdeW1C11.ode	@ltx/en_uk_lash/miscellanea:misc.Ode1
ltx/en_uk_lash/oc.m3.d5:ocMA.OdeW1C11.text	Come let us bless the Church''s towers, devoutly built on the foundation of the faith and who establish all believers, the sacred Apostles, that by their supplications we may be saved.
ltx/en_uk_lash/oc.m3.d5:ocMA.OdeW1C12.incipit	Unshakeable pillars of true religion…
ltx/en_uk_lash/oc.m3.d5:ocMA.OdeW1C12.melody	@ltx/en_uk_lash/he.h.m3:heHE.OTaYdata.name
ltx/en_uk_lash/oc.m3.d5:ocMA.OdeW1C12.mode	@ltx/en_uk_lash/miscellanea:misc.Mode3
ltx/en_uk_lash/oc.m3.d5:ocMA.OdeW1C12.ode	@ltx/en_uk_lash/miscellanea:misc.Ode1
ltx/en_uk_lash/oc.m3.d5:ocMA.OdeW1C12.text	Unshakeable pillars of true religion, I have been toppled by the error of the foe, I lie on the ground, I am in danger, I am at a loss. Set me upright that I may find forgiveness of the things by which I have offended.
ltx/en_uk_lash/oc.m3.d5:ocMA.OdeW1C13.incipit	Fearful before the sentence, O…
ltx/en_uk_lash/oc.m3.d5:ocMA.OdeW1C13.melody	@ltx/en_uk_lash/he.h.m3:heHE.OTaYdata.name
ltx/en_uk_lash/oc.m3.d5:ocMA.OdeW1C13.mode	@ltx/en_uk_lash/miscellanea:misc.Mode3
ltx/en_uk_lash/oc.m3.d5:ocMA.OdeW1C13.ode	@ltx/en_uk_lash/miscellanea:misc.Ode1
ltx/en_uk_lash/oc.m3.d5:ocMA.OdeW1C13.text	Fearful before the sentence, O Just Judge, I, a prodigal, condemn myself, for I have amassed unnumbered evil works; therefore I implore you, save me in my despair, at the godly entreaties of your Apostles.
ltx/en_uk_lash/oc.m3.d5:ocMA.OdeW1C1H.greekmelody	@ltx/en_uk_lash/he.h.m3:heHE.OTaYdata.greekname
ltx/en_uk_lash/oc.m3.d5:ocMA.OdeW1C1H.incipit	@ltx/en_uk_lash/he.h.m3:heHE.OTaYdata.incipit
ltx/en_uk_lash/oc.m3.d5:ocMA.OdeW1C1H.melody	@ltx/en_uk_lash/he.h.m3:heHE.OTaYdata.melody
ltx/en_uk_lash/oc.m3.d5:ocMA.OdeW1C1H.mode	@ltx/en_uk_lash/miscellanea:misc.Mode3
ltx/en_uk_lash/oc.m3.d5:ocMA.OdeW1C1H.ode	@ltx/en_uk_lash/miscellanea:misc.Ode1
ltx/en_uk_lash/oc.m3.d5:ocMA.OdeW1C1H.text	@ltx/en_uk_lash/he.h.m3:heHE.OTaYdata.text
ltx/en_uk_lash/oc.m3.d5:ocMA.OdeW1C1T.incipit	With holy Prophets, with Apostles…
ltx/en_uk_lash/oc.m3.d5:ocMA.OdeW1C1T.melody	@ltx/en_uk_lash/he.h.m3:heHE.OTaYdata.name
ltx/en_uk_lash/oc.m3.d5:ocMA.OdeW1C1T.mode	@ltx/en_uk_lash/miscellanea:misc.Mode3
ltx/en_uk_lash/oc.m3.d5:ocMA.OdeW1C1T.ode	@ltx/en_uk_lash/miscellanea:misc.Ode1
ltx/en_uk_lash/oc.m3.d5:ocMA.OdeW1C1T.text	With holy Prophets, with Apostles, with Martyrs, insistently implore the Lord who was incarnate from you, Pure Virgin, to slay all the passions of our flesh and to bestow on us eternal life.
ltx/en_uk_lash/oc.m3.d5:ocMA.OdeW1C21.greekmelody	@ltx/en_uk_lash/he.h.m3:heHE.AsomenToKyrio.greekname
ltx/en_uk_lash/oc.m3.d5:ocMA.OdeW1C21.incipit	Let us honour and with…
ltx/en_uk_lash/oc.m3.d5:ocMA.OdeW1C21.melody	@ltx/en_uk_lash/he.h.m3:heHE.AsomenToKyrio.name
ltx/en_uk_lash/oc.m3.d5:ocMA.OdeW1C21.mode	@ltx/en_uk_lash/miscellanea:misc.Mode3
ltx/en_uk_lash/oc.m3.d5:ocMA.OdeW1C21.ode	@ltx/en_uk_lash/miscellanea:misc.Ode1
ltx/en_uk_lash/oc.m3.d5:ocMA.OdeW1C21.text	Let us honour and with love call blessed, Nicholas, the shining lamp and unsleeping torch upon earth, who ever embarks towards godly havens those storm-tossed by the waves of life.
ltx/en_uk_lash/oc.m3.d5:ocMA.OdeW1C22.incipit	Empowered by God''s strength, O…
ltx/en_uk_lash/oc.m3.d5:ocMA.OdeW1C22.melody	@ltx/en_uk_lash/he.h.m3:heHE.AsomenToKyrio.name
ltx/en_uk_lash/oc.m3.d5:ocMA.OdeW1C22.mode	@ltx/en_uk_lash/miscellanea:misc.Mode3
ltx/en_uk_lash/oc.m3.d5:ocMA.OdeW1C22.ode	@ltx/en_uk_lash/miscellanea:misc.Ode1
ltx/en_uk_lash/oc.m3.d5:ocMA.OdeW1C22.text	Empowered by God''s strength, O All-blessed, you obtained zeal in accordance with the knowledge of true religion; therefore you rescued those about to die unjustly; and so we implore you, deliver us from every wickedness of the unjust foe.
ltx/en_uk_lash/oc.m3.d5:ocMA.OdeW1C23.incipit	Bring, Father, to the Lord…
ltx/en_uk_lash/oc.m3.d5:ocMA.OdeW1C23.melody	@ltx/en_uk_lash/he.h.m3:heHE.AsomenToKyrio.name
ltx/en_uk_lash/oc.m3.d5:ocMA.OdeW1C23.mode	@ltx/en_uk_lash/miscellanea:misc.Mode3
ltx/en_uk_lash/oc.m3.d5:ocMA.OdeW1C23.ode	@ltx/en_uk_lash/miscellanea:misc.Ode1
ltx/en_uk_lash/oc.m3.d5:ocMA.OdeW1C23.text	Bring, Father, to the Lord a plea that never ceases, that he may deliver us from sins, from the flame of everlasting punishment, from temptations and troubles, as he alone is supremely good.
ltx/en_uk_lash/oc.m3.d5:ocMA.OdeW1C2T.incipit	Let us now in harmony…
ltx/en_uk_lash/oc.m3.d5:ocMA.OdeW1C2T.melody	@ltx/en_uk_lash/he.h.m3:heHE.AsomenToKyrio.name
ltx/en_uk_lash/oc.m3.d5:ocMA.OdeW1C2T.mode	@ltx/en_uk_lash/miscellanea:misc.Mode3
ltx/en_uk_lash/oc.m3.d5:ocMA.OdeW1C2T.ode	@ltx/en_uk_lash/miscellanea:misc.Ode1
ltx/en_uk_lash/oc.m3.d5:ocMA.OdeW1C2T.text	Let us now in harmony call Mary, the all-immaculate, blessed, the divine Ark who contained the Giver of the law, who takes away all our iniquities through his divine compassion, the unfathomable sea.
ltx/en_uk_lash/oc.m3.d5:ocMA.OdeW3C11.incipit	You filled all the corners…
ltx/en_uk_lash/oc.m3.d5:ocMA.OdeW3C11.melody	@ltx/en_uk_lash/he.h.m3:heHE.OEkMiOnton.name
ltx/en_uk_lash/oc.m3.d5:ocMA.OdeW3C11.mode	@ltx/en_uk_lash/miscellanea:misc.Mode3
ltx/en_uk_lash/oc.m3.d5:ocMA.OdeW3C11.ode	@ltx/en_uk_lash/miscellanea:misc.Ode3
ltx/en_uk_lash/oc.m3.d5:ocMA.OdeW3C11.text	You filled all the corners of the world with your inspired teaching; fill my soul with right actions and good thoughts, eye-witnesses of Christ.
ltx/en_uk_lash/oc.m3.d5:ocMA.OdeW3C12.incipit	From ten thousand stumbling blocks…
ltx/en_uk_lash/oc.m3.d5:ocMA.OdeW3C12.melody	@ltx/en_uk_lash/he.h.m3:heHE.OEkMiOnton.name
ltx/en_uk_lash/oc.m3.d5:ocMA.OdeW3C12.mode	@ltx/en_uk_lash/miscellanea:misc.Mode3
ltx/en_uk_lash/oc.m3.d5:ocMA.OdeW3C12.ode	@ltx/en_uk_lash/miscellanea:misc.Ode3
ltx/en_uk_lash/oc.m3.d5:ocMA.OdeW3C12.text	From ten thousand stumbling blocks of the evil one, from every trouble, every compulsion, from distress, rescue me, Disciples of Christ.
ltx/en_uk_lash/oc.m3.d5:ocMA.OdeW3C13.incipit	Alas, my wretched and lowly…
ltx/en_uk_lash/oc.m3.d5:ocMA.OdeW3C13.melody	@ltx/en_uk_lash/he.h.m3:heHE.OEkMiOnton.name
ltx/en_uk_lash/oc.m3.d5:ocMA.OdeW3C13.mode	@ltx/en_uk_lash/miscellanea:misc.Mode3
ltx/en_uk_lash/oc.m3.d5:ocMA.OdeW3C13.ode	@ltx/en_uk_lash/miscellanea:misc.Ode3
ltx/en_uk_lash/oc.m3.d5:ocMA.OdeW3C13.text	Alas, my wretched and lowly soul, continually sinning and angering God, how can you ask for pardon, for you never make a break from wickedness?
ltx/en_uk_lash/oc.m3.d5:ocMA.OdeW3C1H.greekmelody	@ltx/en_uk_lash/he.h.m3:heHE.OEkMiOnton.greekname
ltx/en_uk_lash/oc.m3.d5:ocMA.OdeW3C1H.incipit	@ltx/en_uk_lash/he.h.m3:heHE.OEkMiOnton.incipit
ltx/en_uk_lash/oc.m3.d5:ocMA.OdeW3C1H.melody	@ltx/en_uk_lash/he.h.m3:heHE.OEkMiOnton.melody
ltx/en_uk_lash/oc.m3.d5:ocMA.OdeW3C1H.mode	@ltx/en_uk_lash/miscellanea:misc.Mode3
ltx/en_uk_lash/oc.m3.d5:ocMA.OdeW3C1H.ode	@ltx/en_uk_lash/miscellanea:misc.Ode3
ltx/en_uk_lash/oc.m3.d5:ocMA.OdeW3C1H.text	@ltx/en_uk_lash/he.h.m3:heHE.OEkMiOnton.text
ltx/en_uk_lash/oc.m3.d5:ocMA.OdeW3C1T.incipit	Divine ladder, which Jacob saw…
ltx/en_uk_lash/oc.m3.d5:ocMA.OdeW3C1T.melody	@ltx/en_uk_lash/he.h.m3:heHE.OEkMiOnton.name
ltx/en_uk_lash/oc.m3.d5:ocMA.OdeW3C1T.mode	@ltx/en_uk_lash/miscellanea:misc.Mode3
ltx/en_uk_lash/oc.m3.d5:ocMA.OdeW3C1T.ode	@ltx/en_uk_lash/miscellanea:misc.Ode3
ltx/en_uk_lash/oc.m3.d5:ocMA.OdeW3C1T.text	Divine ladder, which Jacob saw, by which God came down and exalted us, with the Apostles insistently implore that he take pity on us.
ltx/en_uk_lash/oc.m3.d5:ocMA.OdeW3C21.greekmelody	@ltx/en_uk_lash/he.h.m3:heHE.SteiraPsychi.greekname
ltx/en_uk_lash/oc.m3.d5:ocMA.OdeW3C21.incipit	You appeared as a sharpened…
ltx/en_uk_lash/oc.m3.d5:ocMA.OdeW3C21.melody	@ltx/en_uk_lash/he.h.m3:heHE.SteiraPsychi.name
ltx/en_uk_lash/oc.m3.d5:ocMA.OdeW3C21.mode	@ltx/en_uk_lash/miscellanea:misc.Mode3
ltx/en_uk_lash/oc.m3.d5:ocMA.OdeW3C21.ode	@ltx/en_uk_lash/miscellanea:misc.Ode3
ltx/en_uk_lash/oc.m3.d5:ocMA.OdeW3C21.text	You appeared as a sharpened sword of the Spirit, cutting off the evil tares of heretics, and smoothing a path of salvation for the faithful, wise father Nicholas.
ltx/en_uk_lash/oc.m3.d5:ocMA.OdeW3C22.incipit	O Saint, we entreat you…
ltx/en_uk_lash/oc.m3.d5:ocMA.OdeW3C22.melody	@ltx/en_uk_lash/he.h.m3:heHE.SteiraPsychi.name
ltx/en_uk_lash/oc.m3.d5:ocMA.OdeW3C22.mode	@ltx/en_uk_lash/miscellanea:misc.Mode3
ltx/en_uk_lash/oc.m3.d5:ocMA.OdeW3C22.ode	@ltx/en_uk_lash/miscellanea:misc.Ode3
ltx/en_uk_lash/oc.m3.d5:ocMA.OdeW3C22.text	O Saint, we entreat you as a source pouring forth springs of healings, dispel by your prayers the miry passions of us all, rescuing us from dangers and troubles.
ltx/en_uk_lash/oc.m3.d5:ocMA.OdeW3C23.incipit	By your valiant toils you…
ltx/en_uk_lash/oc.m3.d5:ocMA.OdeW3C23.melody	@ltx/en_uk_lash/he.h.m3:heHE.SteiraPsychi.name
ltx/en_uk_lash/oc.m3.d5:ocMA.OdeW3C23.mode	@ltx/en_uk_lash/miscellanea:misc.Mode3
ltx/en_uk_lash/oc.m3.d5:ocMA.OdeW3C23.ode	@ltx/en_uk_lash/miscellanea:misc.Ode3
ltx/en_uk_lash/oc.m3.d5:ocMA.OdeW3C23.text	By your valiant toils you cast down the foe; now too, by your holy prayers, Father Nicholas, strengthen against him our thoughts, grown weak with the floods of passions.
ltx/en_uk_lash/oc.m3.d5:ocMA.OdeW3C2T.incipit	Mind cannot conceive the Offspring…
ltx/en_uk_lash/oc.m3.d5:ocMA.OdeW3C2T.melody	@ltx/en_uk_lash/he.h.m3:heHE.SteiraPsychi.name
ltx/en_uk_lash/oc.m3.d5:ocMA.OdeW3C2T.mode	@ltx/en_uk_lash/miscellanea:misc.Mode3
ltx/en_uk_lash/oc.m3.d5:ocMA.OdeW3C2T.ode	@ltx/en_uk_lash/miscellanea:misc.Ode3
ltx/en_uk_lash/oc.m3.d5:ocMA.OdeW3C2T.text	Mind cannot conceive the Offspring beyond mind of your wondrous child-bearing. Virgin Mother, who gave birth to God; and so I implore you give my mind the grace to glorify you always.
ltx/en_uk_lash/oc.m3.d5:ocMA.OdeW4C11.incipit	Unsetting Sun, unfurling your Apostles…
ltx/en_uk_lash/oc.m3.d5:ocMA.OdeW4C11.melody	@ltx/en_uk_lash/he.h.m3:heHE.EthouProsImas.name
ltx/en_uk_lash/oc.m3.d5:ocMA.OdeW4C11.mode	@ltx/en_uk_lash/miscellanea:misc.Mode3
ltx/en_uk_lash/oc.m3.d5:ocMA.OdeW4C11.ode	@ltx/en_uk_lash/miscellanea:misc.Ode4
ltx/en_uk_lash/oc.m3.d5:ocMA.OdeW4C11.text	Unsetting Sun, unfurling your Apostles like beams, like rays, you brought light to all the corners of the world, O Word, and you dispelled the gloom of ignorance.
ltx/en_uk_lash/oc.m3.d5:ocMA.OdeW4C12.incipit	A sea of dreadful sin…
ltx/en_uk_lash/oc.m3.d5:ocMA.OdeW4C12.melody	@ltx/en_uk_lash/he.h.m3:heHE.EthouProsImas.name
ltx/en_uk_lash/oc.m3.d5:ocMA.OdeW4C12.mode	@ltx/en_uk_lash/miscellanea:misc.Mode3
ltx/en_uk_lash/oc.m3.d5:ocMA.OdeW4C12.ode	@ltx/en_uk_lash/miscellanea:misc.Ode4
ltx/en_uk_lash/oc.m3.d5:ocMA.OdeW4C12.text	A sea of dreadful sin rages round me, O Word, waves of disordered thoughts trouble my lowly soul. O Lord and Helmsman, save me at the supplications of your Disciples.
ltx/en_uk_lash/oc.m3.d5:ocMA.OdeW4C13.incipit	I quake with fear when…
ltx/en_uk_lash/oc.m3.d5:ocMA.OdeW4C13.melody	@ltx/en_uk_lash/he.h.m3:heHE.EthouProsImas.name
ltx/en_uk_lash/oc.m3.d5:ocMA.OdeW4C13.mode	@ltx/en_uk_lash/miscellanea:misc.Mode3
ltx/en_uk_lash/oc.m3.d5:ocMA.OdeW4C13.ode	@ltx/en_uk_lash/miscellanea:misc.Ode4
ltx/en_uk_lash/oc.m3.d5:ocMA.OdeW4C13.text	I quake with fear when I think on your fearful coming, Master; for before sentence I have within me my conscience to accuse me, and to torment my insensitivity before the torment.
ltx/en_uk_lash/oc.m3.d5:ocMA.OdeW4C1H.greekmelody	@ltx/en_uk_lash/he.h.m3:heHE.EthouProsImas.greekname
ltx/en_uk_lash/oc.m3.d5:ocMA.OdeW4C1H.incipit	@ltx/en_uk_lash/he.h.m3:heHE.EthouProsImas.incipit
ltx/en_uk_lash/oc.m3.d5:ocMA.OdeW4C1H.melody	@ltx/en_uk_lash/he.h.m3:heHE.EthouProsImas.melody
ltx/en_uk_lash/oc.m3.d5:ocMA.OdeW4C1H.mode	@ltx/en_uk_lash/miscellanea:misc.Mode3
ltx/en_uk_lash/oc.m3.d5:ocMA.OdeW4C1H.ode	@ltx/en_uk_lash/miscellanea:misc.Ode4
ltx/en_uk_lash/oc.m3.d5:ocMA.OdeW4C1H.text	@ltx/en_uk_lash/he.h.m3:heHE.EthouProsImas.text
ltx/en_uk_lash/oc.m3.d5:ocMA.OdeW4C1T.incipit	Word of God, born from…
ltx/en_uk_lash/oc.m3.d5:ocMA.OdeW4C1T.melody	@ltx/en_uk_lash/he.h.m3:heHE.EthouProsImas.name
ltx/en_uk_lash/oc.m3.d5:ocMA.OdeW4C1T.mode	@ltx/en_uk_lash/miscellanea:misc.Mode3
ltx/en_uk_lash/oc.m3.d5:ocMA.OdeW4C1T.ode	@ltx/en_uk_lash/miscellanea:misc.Ode4
ltx/en_uk_lash/oc.m3.d5:ocMA.OdeW4C1T.text	Word of God, born from a Maiden, Child of God, at her holy mediation and those of your wise Apostles, rescue your servants from every distress, every constraint.
ltx/en_uk_lash/oc.m3.d5:ocMA.OdeW4C21.greekmelody	@ltx/en_uk_lash/he.h.m3:heHE.ToKataskionOros.greekname
ltx/en_uk_lash/oc.m3.d5:ocMA.OdeW4C21.incipit	Every believer advances you each…
ltx/en_uk_lash/oc.m3.d5:ocMA.OdeW4C21.melody	@ltx/en_uk_lash/he.h.m3:heHE.ToKataskionOros.name
ltx/en_uk_lash/oc.m3.d5:ocMA.OdeW4C21.mode	@ltx/en_uk_lash/miscellanea:misc.Mode3
ltx/en_uk_lash/oc.m3.d5:ocMA.OdeW4C21.ode	@ltx/en_uk_lash/miscellanea:misc.Ode4
ltx/en_uk_lash/oc.m3.d5:ocMA.OdeW4C21.text	Every believer advances you each day, Nicholas, as a mediator with God; and so we implore you, Father, rescue us from harsh distress and from falling into sins.
ltx/en_uk_lash/oc.m3.d5:ocMA.OdeW4C22.incipit	You have the grace of…
ltx/en_uk_lash/oc.m3.d5:ocMA.OdeW4C22.melody	@ltx/en_uk_lash/he.h.m3:heHE.ToKataskionOros.name
ltx/en_uk_lash/oc.m3.d5:ocMA.OdeW4C22.mode	@ltx/en_uk_lash/miscellanea:misc.Mode3
ltx/en_uk_lash/oc.m3.d5:ocMA.OdeW4C22.ode	@ltx/en_uk_lash/miscellanea:misc.Ode4
ltx/en_uk_lash/oc.m3.d5:ocMA.OdeW4C22.text	You have the grace of the Lord as a living stream in your heart, O wise, all-blessed Father, and you unceasingly bedew those who are miserably endangered by the heat of troubles and the wasteland of sins.
ltx/en_uk_lash/oc.m3.d5:ocMA.OdeW4C23.incipit	Of old, All-blessed, you delivered…
ltx/en_uk_lash/oc.m3.d5:ocMA.OdeW4C23.melody	@ltx/en_uk_lash/he.h.m3:heHE.ToKataskionOros.name
ltx/en_uk_lash/oc.m3.d5:ocMA.OdeW4C23.mode	@ltx/en_uk_lash/miscellanea:misc.Mode3
ltx/en_uk_lash/oc.m3.d5:ocMA.OdeW4C23.ode	@ltx/en_uk_lash/miscellanea:misc.Ode4
ltx/en_uk_lash/oc.m3.d5:ocMA.OdeW4C23.text	Of old, All-blessed, you delivered one who was being led to an undeserved death, so now too save us from the persecution of destructive men and from every deception of the demons.
ltx/en_uk_lash/oc.m3.d5:ocMA.OdeW4C2T.incipit	Ineffably you bore the Word…
ltx/en_uk_lash/oc.m3.d5:ocMA.OdeW4C2T.melody	@ltx/en_uk_lash/he.h.m3:heHE.ToKataskionOros.name
ltx/en_uk_lash/oc.m3.d5:ocMA.OdeW4C2T.mode	@ltx/en_uk_lash/miscellanea:misc.Mode3
ltx/en_uk_lash/oc.m3.d5:ocMA.OdeW4C2T.ode	@ltx/en_uk_lash/miscellanea:misc.Ode4
ltx/en_uk_lash/oc.m3.d5:ocMA.OdeW4C2T.text	Ineffably you bore the Word, incarnate through the abundance of his compassion. Beseech him, O Immaculate, to rescue us all from carnal defilements and all the troubles of life.
ltx/en_uk_lash/oc.m3.d5:ocMA.OdeW5C11.incipit	Incarnate upon earth, you fashioned…
ltx/en_uk_lash/oc.m3.d5:ocMA.OdeW5C11.melody	@ltx/en_uk_lash/he.h.m3:heHE.EpiTisGis.name
ltx/en_uk_lash/oc.m3.d5:ocMA.OdeW5C11.mode	@ltx/en_uk_lash/miscellanea:misc.Mode3
ltx/en_uk_lash/oc.m3.d5:ocMA.OdeW5C11.ode	@ltx/en_uk_lash/miscellanea:misc.Ode5
ltx/en_uk_lash/oc.m3.d5:ocMA.OdeW5C11.text	Incarnate upon earth, you fashioned your Disciples into heavens which proclaimed your glory, O Christ; therefore through them, Lord, have mercy on our souls.
ltx/en_uk_lash/oc.m3.d5:ocMA.OdeW5C12.incipit	From passions, from every constraint…
ltx/en_uk_lash/oc.m3.d5:ocMA.OdeW5C12.melody	@ltx/en_uk_lash/he.h.m3:heHE.EpiTisGis.name
ltx/en_uk_lash/oc.m3.d5:ocMA.OdeW5C12.mode	@ltx/en_uk_lash/miscellanea:misc.Mode3
ltx/en_uk_lash/oc.m3.d5:ocMA.OdeW5C12.ode	@ltx/en_uk_lash/miscellanea:misc.Ode5
ltx/en_uk_lash/oc.m3.d5:ocMA.OdeW5C12.text	From passions, from every constraint, from dire distress deliver your servants, O Word, at the acceptable entreaties of your Apostles.
ltx/en_uk_lash/oc.m3.d5:ocMA.OdeW5C13.incipit	Alas, my wretched soul, how…
ltx/en_uk_lash/oc.m3.d5:ocMA.OdeW5C13.melody	@ltx/en_uk_lash/he.h.m3:heHE.EpiTisGis.name
ltx/en_uk_lash/oc.m3.d5:ocMA.OdeW5C13.mode	@ltx/en_uk_lash/miscellanea:misc.Mode3
ltx/en_uk_lash/oc.m3.d5:ocMA.OdeW5C13.ode	@ltx/en_uk_lash/miscellanea:misc.Ode5
ltx/en_uk_lash/oc.m3.d5:ocMA.OdeW5C13.text	Alas, my wretched soul, how are you, who remain fruitless, going to stand before the fearful Judge? Hasten, repent by sprouting fruits of virtues.
ltx/en_uk_lash/oc.m3.d5:ocMA.OdeW5C1H.greekmelody	@ltx/en_uk_lash/he.h.m3:heHE.EpiTisGis.greekname
ltx/en_uk_lash/oc.m3.d5:ocMA.OdeW5C1H.incipit	@ltx/en_uk_lash/he.h.m3:heHE.EpiTisGis.incipit
ltx/en_uk_lash/oc.m3.d5:ocMA.OdeW5C1H.melody	@ltx/en_uk_lash/he.h.m3:heHE.EpiTisGis.melody
ltx/en_uk_lash/oc.m3.d5:ocMA.OdeW5C1H.mode	@ltx/en_uk_lash/miscellanea:misc.Mode3
ltx/en_uk_lash/oc.m3.d5:ocMA.OdeW5C1H.ode	@ltx/en_uk_lash/miscellanea:misc.Ode5
ltx/en_uk_lash/oc.m3.d5:ocMA.OdeW5C1H.text	@ltx/en_uk_lash/he.h.m3:heHE.EpiTisGis.text
ltx/en_uk_lash/oc.m3.d5:ocMA.OdeW5C1T.incipit	Pure Virgin, implore him who…
ltx/en_uk_lash/oc.m3.d5:ocMA.OdeW5C1T.melody	@ltx/en_uk_lash/he.h.m3:heHE.EpiTisGis.name
ltx/en_uk_lash/oc.m3.d5:ocMA.OdeW5C1T.mode	@ltx/en_uk_lash/miscellanea:misc.Mode3
ltx/en_uk_lash/oc.m3.d5:ocMA.OdeW5C1T.ode	@ltx/en_uk_lash/miscellanea:misc.Ode5
ltx/en_uk_lash/oc.m3.d5:ocMA.OdeW5C1T.text	Pure Virgin, implore him who appeared ineffably on earth in flesh from your pure blood, as he remains ever your Son, to bestow pardon on us.
ltx/en_uk_lash/oc.m3.d5:ocMA.OdeW5C21.greekmelody	@ltx/en_uk_lash/he.h.m3:heHE.ToFosSouToAnesperon.greekname
ltx/en_uk_lash/oc.m3.d5:ocMA.OdeW5C21.incipit	Standing in the pure light…
ltx/en_uk_lash/oc.m3.d5:ocMA.OdeW5C21.melody	@ltx/en_uk_lash/he.h.m3:heHE.ToFosSouToAnesperon.name
ltx/en_uk_lash/oc.m3.d5:ocMA.OdeW5C21.mode	@ltx/en_uk_lash/miscellanea:misc.Mode3
ltx/en_uk_lash/oc.m3.d5:ocMA.OdeW5C21.ode	@ltx/en_uk_lash/miscellanea:misc.Ode5
ltx/en_uk_lash/oc.m3.d5:ocMA.OdeW5C21.text	Standing in the pure light and on fire with the rays that ever flood from it, Father, ask enlightenment and peace for all.
ltx/en_uk_lash/oc.m3.d5:ocMA.OdeW5C22.incipit	O supremely good, at the…
ltx/en_uk_lash/oc.m3.d5:ocMA.OdeW5C22.melody	@ltx/en_uk_lash/he.h.m3:heHE.ToFosSouToAnesperon.name
ltx/en_uk_lash/oc.m3.d5:ocMA.OdeW5C22.mode	@ltx/en_uk_lash/miscellanea:misc.Mode3
ltx/en_uk_lash/oc.m3.d5:ocMA.OdeW5C22.ode	@ltx/en_uk_lash/miscellanea:misc.Ode5
ltx/en_uk_lash/oc.m3.d5:ocMA.OdeW5C22.text	O supremely good, at the fervent prayers of Nicholas take pity on me who with my unfeeling mind have always angered you more than all mortals.
ltx/en_uk_lash/oc.m3.d5:ocMA.OdeW5C23.incipit	I have squandered my life…
ltx/en_uk_lash/oc.m3.d5:ocMA.OdeW5C23.melody	@ltx/en_uk_lash/he.h.m3:heHE.ToFosSouToAnesperon.name
ltx/en_uk_lash/oc.m3.d5:ocMA.OdeW5C23.mode	@ltx/en_uk_lash/miscellanea:misc.Mode3
ltx/en_uk_lash/oc.m3.d5:ocMA.OdeW5C23.ode	@ltx/en_uk_lash/miscellanea:misc.Ode5
ltx/en_uk_lash/oc.m3.d5:ocMA.OdeW5C23.text	I have squandered my life in sloth and so I beseech you, Father Nicholas, rouse my soiled thought to repentance.
ltx/en_uk_lash/oc.m3.d5:ocMA.OdeW5C2T.incipit	As only joy of the…
ltx/en_uk_lash/oc.m3.d5:ocMA.OdeW5C2T.melody	@ltx/en_uk_lash/he.h.m3:heHE.ToFosSouToAnesperon.name
ltx/en_uk_lash/oc.m3.d5:ocMA.OdeW5C2T.mode	@ltx/en_uk_lash/miscellanea:misc.Mode3
ltx/en_uk_lash/oc.m3.d5:ocMA.OdeW5C2T.ode	@ltx/en_uk_lash/miscellanea:misc.Ode5
ltx/en_uk_lash/oc.m3.d5:ocMA.OdeW5C2T.text	As only joy of the Angels, O Full of God''s grace, fill with joy my sullen mind, sunk deep in indifference.
ltx/en_uk_lash/oc.m3.d5:ocMA.OdeW6C11.incipit	The company of the Apostles…
ltx/en_uk_lash/oc.m3.d5:ocMA.OdeW6C11.melody	@ltx/en_uk_lash/he.h.m3:heHE.AvyssosEschati.name
ltx/en_uk_lash/oc.m3.d5:ocMA.OdeW6C11.mode	@ltx/en_uk_lash/miscellanea:misc.Mode3
ltx/en_uk_lash/oc.m3.d5:ocMA.OdeW6C11.ode	@ltx/en_uk_lash/miscellanea:misc.Ode6
ltx/en_uk_lash/oc.m3.d5:ocMA.OdeW6C11.text	The company of the Apostles having drawn from the source an abyss of spiritual wisdom, dried up all the streams of this world''s wisdom and watered all the assemblies of the devout.
ltx/en_uk_lash/oc.m3.d5:ocMA.OdeW6C12.incipit	Groan and weep, my lowly…
ltx/en_uk_lash/oc.m3.d5:ocMA.OdeW6C12.melody	@ltx/en_uk_lash/he.h.m3:heHE.AvyssosEschati.name
ltx/en_uk_lash/oc.m3.d5:ocMA.OdeW6C12.mode	@ltx/en_uk_lash/miscellanea:misc.Mode3
ltx/en_uk_lash/oc.m3.d5:ocMA.OdeW6C12.ode	@ltx/en_uk_lash/miscellanea:misc.Ode6
ltx/en_uk_lash/oc.m3.d5:ocMA.OdeW6C12.text	Groan and weep, my lowly soul, and cry out to the Lord, saying, ''I have sinned against you, compassionate Master, be merciful to me at the supplications of your Apostles''.
ltx/en_uk_lash/oc.m3.d5:ocMA.OdeW6C13.incipit	Flowing torrents of passions have…
ltx/en_uk_lash/oc.m3.d5:ocMA.OdeW6C13.melody	@ltx/en_uk_lash/he.h.m3:heHE.AvyssosEschati.name
ltx/en_uk_lash/oc.m3.d5:ocMA.OdeW6C13.mode	@ltx/en_uk_lash/miscellanea:misc.Mode3
ltx/en_uk_lash/oc.m3.d5:ocMA.OdeW6C13.ode	@ltx/en_uk_lash/miscellanea:misc.Ode6
ltx/en_uk_lash/oc.m3.d5:ocMA.OdeW6C13.text	Flowing torrents of passions have brought about the fall of the house of my heart. O Apostles, the rivers of the Spirit, I have been crushed; refashion me into life.
ltx/en_uk_lash/oc.m3.d5:ocMA.OdeW6C1H.greekmelody	@ltx/en_uk_lash/he.h.m3:heHE.AvyssosEschati.greekname
ltx/en_uk_lash/oc.m3.d5:ocMA.OdeW6C1H.incipit	@ltx/en_uk_lash/he.h.m3:heHE.AvyssosEschati.incipit
ltx/en_uk_lash/oc.m3.d5:ocMA.OdeW6C1H.melody	@ltx/en_uk_lash/he.h.m3:heHE.AvyssosEschati.melody
ltx/en_uk_lash/oc.m3.d5:ocMA.OdeW6C1H.mode	@ltx/en_uk_lash/miscellanea:misc.Mode3
ltx/en_uk_lash/oc.m3.d5:ocMA.OdeW6C1H.ode	@ltx/en_uk_lash/miscellanea:misc.Ode6
ltx/en_uk_lash/oc.m3.d5:ocMA.OdeW6C1H.text	@ltx/en_uk_lash/he.h.m3:heHE.AvyssosEschati.text
ltx/en_uk_lash/oc.m3.d5:ocMA.OdeW6C1T.incipit	The band of the Apostles…
ltx/en_uk_lash/oc.m3.d5:ocMA.OdeW6C1T.melody	@ltx/en_uk_lash/he.h.m3:heHE.AvyssosEschati.name
ltx/en_uk_lash/oc.m3.d5:ocMA.OdeW6C1T.mode	@ltx/en_uk_lash/miscellanea:misc.Mode3
ltx/en_uk_lash/oc.m3.d5:ocMA.OdeW6C1T.ode	@ltx/en_uk_lash/miscellanea:misc.Ode6
ltx/en_uk_lash/oc.m3.d5:ocMA.OdeW6C1T.text	The band of the Apostles, with her who bore you, entreats you, O Christ, ''Send down pardon and peace to your servants, as you are God who love mankind and long to be reconciled.
ltx/en_uk_lash/oc.m3.d5:ocMA.OdeW6C21.greekmelody	@ltx/en_uk_lash/he.h.m3:heHE.VythosMoiTonPathon.greekname
ltx/en_uk_lash/oc.m3.d5:ocMA.OdeW6C21.incipit	Having slain your members by…
ltx/en_uk_lash/oc.m3.d5:ocMA.OdeW6C21.melody	@ltx/en_uk_lash/he.h.m3:heHE.VythosMoiTonPathon.name
ltx/en_uk_lash/oc.m3.d5:ocMA.OdeW6C21.mode	@ltx/en_uk_lash/miscellanea:misc.Mode3
ltx/en_uk_lash/oc.m3.d5:ocMA.OdeW6C21.ode	@ltx/en_uk_lash/miscellanea:misc.Ode6
ltx/en_uk_lash/oc.m3.d5:ocMA.OdeW6C21.text	Having slain your members by self-mastery you gained the life which does not age; make us sharers in it too, wise Father, by your prayers, by flight from the work of evil.
ltx/en_uk_lash/oc.m3.d5:ocMA.OdeW6C22.incipit	With the sail of your…
ltx/en_uk_lash/oc.m3.d5:ocMA.OdeW6C22.melody	@ltx/en_uk_lash/he.h.m3:heHE.VythosMoiTonPathon.name
ltx/en_uk_lash/oc.m3.d5:ocMA.OdeW6C22.mode	@ltx/en_uk_lash/miscellanea:misc.Mode3
ltx/en_uk_lash/oc.m3.d5:ocMA.OdeW6C22.ode	@ltx/en_uk_lash/miscellanea:misc.Ode6
ltx/en_uk_lash/oc.m3.d5:ocMA.OdeW6C22.text	With the sail of your sacred prayers deliver us from sea of many dangers and the deep of sin, embarking us for the roadstead of life, wise Hierarch.
ltx/en_uk_lash/oc.m3.d5:ocMA.OdeW6C23.incipit	Adorning the throne of Myra…
ltx/en_uk_lash/oc.m3.d5:ocMA.OdeW6C23.melody	@ltx/en_uk_lash/he.h.m3:heHE.VythosMoiTonPathon.name
ltx/en_uk_lash/oc.m3.d5:ocMA.OdeW6C23.mode	@ltx/en_uk_lash/miscellanea:misc.Mode3
ltx/en_uk_lash/oc.m3.d5:ocMA.OdeW6C23.ode	@ltx/en_uk_lash/miscellanea:misc.Ode6
ltx/en_uk_lash/oc.m3.d5:ocMA.OdeW6C23.text	Adorning the throne of Myra, you were revealed as an ornament of High Priests; but by your prayers save us from the world''s temptations, blameless Hierarch.
ltx/en_uk_lash/oc.m3.d5:ocMA.OdeW6C2T.incipit	The Word by dwelling in…
ltx/en_uk_lash/oc.m3.d5:ocMA.OdeW6C2T.melody	@ltx/en_uk_lash/he.h.m3:heHE.VythosMoiTonPathon.name
ltx/en_uk_lash/oc.m3.d5:ocMA.OdeW6C2T.mode	@ltx/en_uk_lash/miscellanea:misc.Mode3
ltx/en_uk_lash/oc.m3.d5:ocMA.OdeW6C2T.ode	@ltx/en_uk_lash/miscellanea:misc.Ode6
ltx/en_uk_lash/oc.m3.d5:ocMA.OdeW6C2T.text	The Word by dwelling in your womb, pure Mother, through his compassionate mercy drove into exile the corruption that through transgression had of old made its dwelling among men.
ltx/en_uk_lash/oc.m3.d5:ocMA.OdeW7C11.incipit	Christ, the light of the…
ltx/en_uk_lash/oc.m3.d5:ocMA.OdeW7C11.melody	@ltx/en_uk_lash/he.h.m3:heHE.ToPrinEikoni.name
ltx/en_uk_lash/oc.m3.d5:ocMA.OdeW7C11.mode	@ltx/en_uk_lash/miscellanea:misc.Mode3
ltx/en_uk_lash/oc.m3.d5:ocMA.OdeW7C11.ode	@ltx/en_uk_lash/miscellanea:misc.Ode7
ltx/en_uk_lash/oc.m3.d5:ocMA.OdeW7C11.text	Christ, the light of the world, revealed you, light-bearing Apostles, to be a light that ends the darkness of deception and enlightens the minds of believers.
ltx/en_uk_lash/oc.m3.d5:ocMA.OdeW7C12.incipit	Smash the snares which the…
ltx/en_uk_lash/oc.m3.d5:ocMA.OdeW7C12.melody	@ltx/en_uk_lash/he.h.m3:heHE.ToPrinEikoni.name
ltx/en_uk_lash/oc.m3.d5:ocMA.OdeW7C12.mode	@ltx/en_uk_lash/miscellanea:misc.Mode3
ltx/en_uk_lash/oc.m3.d5:ocMA.OdeW7C12.ode	@ltx/en_uk_lash/miscellanea:misc.Ode7
ltx/en_uk_lash/oc.m3.d5:ocMA.OdeW7C12.text	Smash the snares which the malignant one has set for us, light-bearing Apostles, and level out for us, who have recourse to you, paths of repentance.
ltx/en_uk_lash/oc.m3.d5:ocMA.OdeW7C13.incipit	Inspired Apostles of the Lord…
ltx/en_uk_lash/oc.m3.d5:ocMA.OdeW7C13.melody	@ltx/en_uk_lash/he.h.m3:heHE.ToPrinEikoni.name
ltx/en_uk_lash/oc.m3.d5:ocMA.OdeW7C13.mode	@ltx/en_uk_lash/miscellanea:misc.Mode3
ltx/en_uk_lash/oc.m3.d5:ocMA.OdeW7C13.ode	@ltx/en_uk_lash/miscellanea:misc.Ode7
ltx/en_uk_lash/oc.m3.d5:ocMA.OdeW7C13.text	Inspired Apostles of the Lord, you are divine salt; purify my soul, which through passions of the flesh has lost its savour, and bring believers back to life.
ltx/en_uk_lash/oc.m3.d5:ocMA.OdeW7C1H.greekmelody	@ltx/en_uk_lash/he.h.m3:heHE.ToPrinEikoni.greekname
ltx/en_uk_lash/oc.m3.d5:ocMA.OdeW7C1H.incipit	@ltx/en_uk_lash/he.h.m3:heHE.ToPrinEikoni.incipit
ltx/en_uk_lash/oc.m3.d5:ocMA.OdeW7C1H.melody	@ltx/en_uk_lash/he.h.m3:heHE.ToPrinEikoni.melody
ltx/en_uk_lash/oc.m3.d5:ocMA.OdeW7C1H.mode	@ltx/en_uk_lash/miscellanea:misc.Mode3
ltx/en_uk_lash/oc.m3.d5:ocMA.OdeW7C1H.ode	@ltx/en_uk_lash/miscellanea:misc.Ode7
ltx/en_uk_lash/oc.m3.d5:ocMA.OdeW7C1H.text	@ltx/en_uk_lash/he.h.m3:heHE.ToPrinEikoni.text
ltx/en_uk_lash/oc.m3.d5:ocMA.OdeW7C1T.incipit	Beauty of Jacob, make my…
ltx/en_uk_lash/oc.m3.d5:ocMA.OdeW7C1T.melody	@ltx/en_uk_lash/he.h.m3:heHE.ToPrinEikoni.name
ltx/en_uk_lash/oc.m3.d5:ocMA.OdeW7C1T.mode	@ltx/en_uk_lash/miscellanea:misc.Mode3
ltx/en_uk_lash/oc.m3.d5:ocMA.OdeW7C1T.ode	@ltx/en_uk_lash/miscellanea:misc.Ode7
ltx/en_uk_lash/oc.m3.d5:ocMA.OdeW7C1T.text	Beauty of Jacob, make my soul radiant with forms of beauty, I beg, as with the Apostles you now entreat the One who was born from your pure blood.
ltx/en_uk_lash/oc.m3.d5:ocMA.OdeW7C21.greekmelody	@ltx/en_uk_lash/he.h.m3:heHE.TreisPaidesEnKamino.greekname
ltx/en_uk_lash/oc.m3.d5:ocMA.OdeW7C21.incipit	When Arius the madman was…
ltx/en_uk_lash/oc.m3.d5:ocMA.OdeW7C21.melody	@ltx/en_uk_lash/he.h.m3:heHE.TreisPaidesEnKamino.name
ltx/en_uk_lash/oc.m3.d5:ocMA.OdeW7C21.mode	@ltx/en_uk_lash/miscellanea:misc.Mode3
ltx/en_uk_lash/oc.m3.d5:ocMA.OdeW7C21.ode	@ltx/en_uk_lash/miscellanea:misc.Ode7
ltx/en_uk_lash/oc.m3.d5:ocMA.OdeW7C21.text	When Arius the madman was once ravaging the Lord''s people, you throttled him with the cords of your words as a true chief shepherd, Father Nicholas.
ltx/en_uk_lash/oc.m3.d5:ocMA.OdeW7C22.incipit	In holiness you reached the…
ltx/en_uk_lash/oc.m3.d5:ocMA.OdeW7C22.melody	@ltx/en_uk_lash/he.h.m3:heHE.TreisPaidesEnKamino.name
ltx/en_uk_lash/oc.m3.d5:ocMA.OdeW7C22.mode	@ltx/en_uk_lash/miscellanea:misc.Mode3
ltx/en_uk_lash/oc.m3.d5:ocMA.OdeW7C22.ode	@ltx/en_uk_lash/miscellanea:misc.Ode7
ltx/en_uk_lash/oc.m3.d5:ocMA.OdeW7C22.text	In holiness you reached the end of your life and you dwell with the Apostles, Father Nicholas, and you send hallowing and enlightenment to those who devoutly call you blessed.
ltx/en_uk_lash/oc.m3.d5:ocMA.OdeW7C23.incipit	We ever call upon you…
ltx/en_uk_lash/oc.m3.d5:ocMA.OdeW7C23.melody	@ltx/en_uk_lash/he.h.m3:heHE.TreisPaidesEnKamino.name
ltx/en_uk_lash/oc.m3.d5:ocMA.OdeW7C23.mode	@ltx/en_uk_lash/miscellanea:misc.Mode3
ltx/en_uk_lash/oc.m3.d5:ocMA.OdeW7C23.ode	@ltx/en_uk_lash/miscellanea:misc.Ode7
ltx/en_uk_lash/oc.m3.d5:ocMA.OdeW7C23.text	We ever call upon you, Father Nicholas, as a ready deliverer, as fervent helper, to deliver us from the passions and from unexpected temptations which assail us.
ltx/en_uk_lash/oc.m3.d5:ocMA.OdeW7C2T.incipit	Pure Virgin, lead me to…
ltx/en_uk_lash/oc.m3.d5:ocMA.OdeW7C2T.melody	@ltx/en_uk_lash/he.h.m3:heHE.TreisPaidesEnKamino.name
ltx/en_uk_lash/oc.m3.d5:ocMA.OdeW7C2T.mode	@ltx/en_uk_lash/miscellanea:misc.Mode3
ltx/en_uk_lash/oc.m3.d5:ocMA.OdeW7C2T.ode	@ltx/en_uk_lash/miscellanea:misc.Ode7
ltx/en_uk_lash/oc.m3.d5:ocMA.OdeW7C2T.text	Pure Virgin, lead me to the light, who am darkened in soul by indifference, kindling again the lamp of my heart with good zeal, that I may glorify you.
ltx/en_uk_lash/oc.m3.d5:ocMA.OdeW8C11.incipit	I have been cut by…
ltx/en_uk_lash/oc.m3.d5:ocMA.OdeW8C11.melody	@ltx/en_uk_lash/he.h.m3:heHE.AstektoPyri.name
ltx/en_uk_lash/oc.m3.d5:ocMA.OdeW8C11.mode	@ltx/en_uk_lash/miscellanea:misc.Mode3
ltx/en_uk_lash/oc.m3.d5:ocMA.OdeW8C11.ode	@ltx/en_uk_lash/miscellanea:misc.Ode8
ltx/en_uk_lash/oc.m3.d5:ocMA.OdeW8C11.text	I have been cut by the sword of passions and I have been wounded in heart by the madness of the creator of wickedness; glorious Apostles, heal me who am wholly without resource, for you are physicians of souls and bodies.
ltx/en_uk_lash/oc.m3.d5:ocMA.OdeW8C12.incipit	The divine sound of the…
ltx/en_uk_lash/oc.m3.d5:ocMA.OdeW8C12.melody	@ltx/en_uk_lash/he.h.m3:heHE.AstektoPyri.name
ltx/en_uk_lash/oc.m3.d5:ocMA.OdeW8C12.mode	@ltx/en_uk_lash/miscellanea:misc.Mode3
ltx/en_uk_lash/oc.m3.d5:ocMA.OdeW8C12.ode	@ltx/en_uk_lash/miscellanea:misc.Ode8
ltx/en_uk_lash/oc.m3.d5:ocMA.OdeW8C12.text	The divine sound of the Heralds has been poured out into all the earth, wonderfully teaching it to reverence one being, one nature, truly one lordship, one kingship of the Trinity to all the ages.
ltx/en_uk_lash/oc.m3.d5:ocMA.OdeW8C13.incipit	I have fallen many times…
ltx/en_uk_lash/oc.m3.d5:ocMA.OdeW8C13.melody	@ltx/en_uk_lash/he.h.m3:heHE.AstektoPyri.name
ltx/en_uk_lash/oc.m3.d5:ocMA.OdeW8C13.mode	@ltx/en_uk_lash/miscellanea:misc.Mode3
ltx/en_uk_lash/oc.m3.d5:ocMA.OdeW8C13.ode	@ltx/en_uk_lash/miscellanea:misc.Ode8
ltx/en_uk_lash/oc.m3.d5:ocMA.OdeW8C13.text	I have fallen many times and have squandered your long-suffering by my ever-present folly; turn me back, Master, Word, who know my great weakness, my sloth and my foolishness.
ltx/en_uk_lash/oc.m3.d5:ocMA.OdeW8C1H.greekmelody	@ltx/en_uk_lash/he.h.m3:heHE.AstektoPyri.greekname
ltx/en_uk_lash/oc.m3.d5:ocMA.OdeW8C1H.incipit	@ltx/en_uk_lash/he.h.m3:heHE.AstektoPyri.incipit
ltx/en_uk_lash/oc.m3.d5:ocMA.OdeW8C1H.melody	@ltx/en_uk_lash/he.h.m3:heHE.AstektoPyri.melody
ltx/en_uk_lash/oc.m3.d5:ocMA.OdeW8C1H.mode	@ltx/en_uk_lash/miscellanea:misc.Mode3
ltx/en_uk_lash/oc.m3.d5:ocMA.OdeW8C1H.ode	@ltx/en_uk_lash/miscellanea:misc.Ode8
ltx/en_uk_lash/oc.m3.d5:ocMA.OdeW8C1H.text	@ltx/en_uk_lash/he.h.m3:heHE.AstektoPyri.text
ltx/en_uk_lash/oc.m3.d5:ocMA.OdeW8C1T.incipit	All-holy Mother of God, divine…
ltx/en_uk_lash/oc.m3.d5:ocMA.OdeW8C1T.melody	@ltx/en_uk_lash/he.h.m3:heHE.AstektoPyri.name
ltx/en_uk_lash/oc.m3.d5:ocMA.OdeW8C1T.mode	@ltx/en_uk_lash/miscellanea:misc.Mode3
ltx/en_uk_lash/oc.m3.d5:ocMA.OdeW8C1T.ode	@ltx/en_uk_lash/miscellanea:misc.Ode8
ltx/en_uk_lash/oc.m3.d5:ocMA.OdeW8C1T.text	All-holy Mother of God, divine tongs, which ineffably held the divine coal, quench the burning coals of my passions with the dew of your consolations and of the all-glorious and divine Apostles.
ltx/en_uk_lash/oc.m3.d5:ocMA.OdeW8C21.greekmelody	@ltx/en_uk_lash/he.h.m3:heHE.TonYpAngelon.greekname
ltx/en_uk_lash/oc.m3.d5:ocMA.OdeW8C21.incipit	Venerable Father, by becoming meek…
ltx/en_uk_lash/oc.m3.d5:ocMA.OdeW8C21.melody	@ltx/en_uk_lash/he.h.m3:heHE.TonYpAngelon.name
ltx/en_uk_lash/oc.m3.d5:ocMA.OdeW8C21.mode	@ltx/en_uk_lash/miscellanea:misc.Mode3
ltx/en_uk_lash/oc.m3.d5:ocMA.OdeW8C21.ode	@ltx/en_uk_lash/miscellanea:misc.Ode8
ltx/en_uk_lash/oc.m3.d5:ocMA.OdeW8C21.text	Venerable Father, by becoming meek you have inherited the land of the meek; and so with faith I beg you, by your prayers calm the storms of the evil one that incessantly rise against me.
ltx/en_uk_lash/oc.m3.d5:ocMA.OdeW8C22.incipit	As you rescued the generals…
ltx/en_uk_lash/oc.m3.d5:ocMA.OdeW8C22.melody	@ltx/en_uk_lash/he.h.m3:heHE.TonYpAngelon.name
ltx/en_uk_lash/oc.m3.d5:ocMA.OdeW8C22.mode	@ltx/en_uk_lash/miscellanea:misc.Mode3
ltx/en_uk_lash/oc.m3.d5:ocMA.OdeW8C22.ode	@ltx/en_uk_lash/miscellanea:misc.Ode8
ltx/en_uk_lash/oc.m3.d5:ocMA.OdeW8C22.text	As you rescued the generals who were about to die unjustly, so rescue us from the wickedness of evil men and from every assault of the demons, Nicholas, as you implore the Saviour.
ltx/en_uk_lash/oc.m3.d5:ocMA.OdeW8C23.incipit	You showed mankind a even…
ltx/en_uk_lash/oc.m3.d5:ocMA.OdeW8C23.melody	@ltx/en_uk_lash/he.h.m3:heHE.TonYpAngelon.name
ltx/en_uk_lash/oc.m3.d5:ocMA.OdeW8C23.mode	@ltx/en_uk_lash/miscellanea:misc.Mode3
ltx/en_uk_lash/oc.m3.d5:ocMA.OdeW8C23.ode	@ltx/en_uk_lash/miscellanea:misc.Ode8
ltx/en_uk_lash/oc.m3.d5:ocMA.OdeW8C23.text	You showed mankind a even and saving road, guide us in it as we journey on the road of life, thrice-blessed Nicholas, that together we may enter the city of life.
ltx/en_uk_lash/oc.m3.d5:ocMA.OdeW8C2T.incipit	Strength and song is he…
ltx/en_uk_lash/oc.m3.d5:ocMA.OdeW8C2T.melody	@ltx/en_uk_lash/he.h.m3:heHE.TonYpAngelon.name
ltx/en_uk_lash/oc.m3.d5:ocMA.OdeW8C2T.mode	@ltx/en_uk_lash/miscellanea:misc.Mode3
ltx/en_uk_lash/oc.m3.d5:ocMA.OdeW8C2T.ode	@ltx/en_uk_lash/miscellanea:misc.Ode8
ltx/en_uk_lash/oc.m3.d5:ocMA.OdeW8C2T.text	Strength and song is he who was born of you, All-blameless Virgin; beseech him insistently, to give me, who am paralysed by the passions, strength to fulfil his saving commands.
ltx/en_uk_lash/oc.m3.d5:ocMA.OdeW9C11.incipit	The word of your Disciples…
ltx/en_uk_lash/oc.m3.d5:ocMA.OdeW9C11.melody	@ltx/en_uk_lash/he.h.m3:heHE.EnNomoSkia.name
ltx/en_uk_lash/oc.m3.d5:ocMA.OdeW9C11.mode	@ltx/en_uk_lash/miscellanea:misc.Mode3
ltx/en_uk_lash/oc.m3.d5:ocMA.OdeW9C11.ode	@ltx/en_uk_lash/miscellanea:misc.Ode9
ltx/en_uk_lash/oc.m3.d5:ocMA.OdeW9C11.text	The word of your Disciples has established the ends of the earth, O Word of the Father without beginning; at their supplications take pity on me who have slipped irrationally towards the passions and been gripped by the deception of the demons.
ltx/en_uk_lash/oc.m3.d5:ocMA.OdeW9C12.incipit	My soul, enslaved to assaults…
ltx/en_uk_lash/oc.m3.d5:ocMA.OdeW9C12.melody	@ltx/en_uk_lash/he.h.m3:heHE.EnNomoSkia.name
ltx/en_uk_lash/oc.m3.d5:ocMA.OdeW9C12.mode	@ltx/en_uk_lash/miscellanea:misc.Mode3
ltx/en_uk_lash/oc.m3.d5:ocMA.OdeW9C12.ode	@ltx/en_uk_lash/miscellanea:misc.Ode9
ltx/en_uk_lash/oc.m3.d5:ocMA.OdeW9C12.text	My soul, enslaved to assaults of passions, bring supplications to him who suffered the Passion for your sake, that he may deliver you from passions; as his sacred Disciples, who imitated the sufferings of his passion in the flesh, openly intercede.
ltx/en_uk_lash/oc.m3.d5:ocMA.OdeW9C13.incipit	Disciples of Christ, when you…
ltx/en_uk_lash/oc.m3.d5:ocMA.OdeW9C13.melody	@ltx/en_uk_lash/he.h.m3:heHE.EnNomoSkia.name
ltx/en_uk_lash/oc.m3.d5:ocMA.OdeW9C13.mode	@ltx/en_uk_lash/miscellanea:misc.Mode3
ltx/en_uk_lash/oc.m3.d5:ocMA.OdeW9C13.ode	@ltx/en_uk_lash/miscellanea:misc.Ode9
ltx/en_uk_lash/oc.m3.d5:ocMA.OdeW9C13.text	Disciples of Christ, when you sit with him to judge those who are subject to judgement, establish my soul, befouled by unnatural works, uncondemned, for you are my good protectors, helpers of the world.
ltx/en_uk_lash/oc.m3.d5:ocMA.OdeW9C1H.greekmelody	@ltx/en_uk_lash/he.h.m3:heHE.EnNomoSkia.greekname
ltx/en_uk_lash/oc.m3.d5:ocMA.OdeW9C1H.incipit	@ltx/en_uk_lash/he.h.m3:heHE.EnNomoSkia.incipit
ltx/en_uk_lash/oc.m3.d5:ocMA.OdeW9C1H.melody	@ltx/en_uk_lash/he.h.m3:heHE.EnNomoSkia.melody
ltx/en_uk_lash/oc.m3.d5:ocMA.OdeW9C1H.mode	@ltx/en_uk_lash/miscellanea:misc.Mode3
ltx/en_uk_lash/oc.m3.d5:ocMA.OdeW9C1H.ode	@ltx/en_uk_lash/miscellanea:misc.Ode9
ltx/en_uk_lash/oc.m3.d5:ocMA.OdeW9C1H.text	@ltx/en_uk_lash/he.h.m3:heHE.EnNomoSkia.text
ltx/en_uk_lash/oc.m3.d5:ocMA.OdeW9C1T.incipit	Chaste Virgin, pure palace of…
ltx/en_uk_lash/oc.m3.d5:ocMA.OdeW9C1T.melody	@ltx/en_uk_lash/he.h.m3:heHE.EnNomoSkia.name
ltx/en_uk_lash/oc.m3.d5:ocMA.OdeW9C1T.mode	@ltx/en_uk_lash/miscellanea:misc.Mode3
ltx/en_uk_lash/oc.m3.d5:ocMA.OdeW9C1T.ode	@ltx/en_uk_lash/miscellanea:misc.Ode9
ltx/en_uk_lash/oc.m3.d5:ocMA.OdeW9C1T.text	Chaste Virgin, pure palace of Christ, Virgin all-holy of holies, who bore the Holy God beyond explanation and reason, with the holy Apostles intercede on behalf of all.
ltx/en_uk_lash/oc.m3.d5:ocMA.OdeW9C21.greekmelody	@ltx/en_uk_lash/he.h.m3:heHE.EnSinaioToOrei.greekname
ltx/en_uk_lash/oc.m3.d5:ocMA.OdeW9C21.incipit	The whole round world has…
ltx/en_uk_lash/oc.m3.d5:ocMA.OdeW9C21.melody	@ltx/en_uk_lash/he.h.m3:heHE.EnSinaioToOrei.name
ltx/en_uk_lash/oc.m3.d5:ocMA.OdeW9C21.mode	@ltx/en_uk_lash/miscellanea:misc.Mode3
ltx/en_uk_lash/oc.m3.d5:ocMA.OdeW9C21.ode	@ltx/en_uk_lash/miscellanea:misc.Ode9
ltx/en_uk_lash/oc.m3.d5:ocMA.OdeW9C21.text	The whole round world has found in you a divine stronghold and fortress and fair refuge, who by your mediations ever rescue it from every pressure of temptations, Father Nicholas; and so in praise it faithfully calls you blessed.
ltx/en_uk_lash/oc.m3.d5:ocMA.OdeW9C22.incipit	Hemmed in by many disasters…
ltx/en_uk_lash/oc.m3.d5:ocMA.OdeW9C22.melody	@ltx/en_uk_lash/he.h.m3:heHE.EnSinaioToOrei.name
ltx/en_uk_lash/oc.m3.d5:ocMA.OdeW9C22.mode	@ltx/en_uk_lash/miscellanea:misc.Mode3
ltx/en_uk_lash/oc.m3.d5:ocMA.OdeW9C22.ode	@ltx/en_uk_lash/miscellanea:misc.Ode9
ltx/en_uk_lash/oc.m3.d5:ocMA.OdeW9C22.text	Hemmed in by many disasters, I flee, All-blessed, to the wide plain of your prayer. ''Transform the toil of my soul, I cry, calm the waves of despair and bring peace to my troubled mind''.
ltx/en_uk_lash/oc.m3.d5:ocMA.OdeW9C23.incipit	The coming of the Creator…
ltx/en_uk_lash/oc.m3.d5:ocMA.OdeW9C23.melody	@ltx/en_uk_lash/he.h.m3:heHE.EnSinaioToOrei.name
ltx/en_uk_lash/oc.m3.d5:ocMA.OdeW9C23.mode	@ltx/en_uk_lash/miscellanea:misc.Mode3
ltx/en_uk_lash/oc.m3.d5:ocMA.OdeW9C23.ode	@ltx/en_uk_lash/miscellanea:misc.Ode9
ltx/en_uk_lash/oc.m3.d5:ocMA.OdeW9C23.text	The coming of the Creator is at hand to judge the whole earth, and I, accursed, am not prepared; I shudder when I consider the multitude of my offences; take pity on me, long-suffering Lord, and save me at the godly prayers of your holy Nicholas.
ltx/en_uk_lash/oc.m3.d5:ocMA.OdeW9C2T.incipit	Appear to me as a…
ltx/en_uk_lash/oc.m3.d5:ocMA.OdeW9C2T.melody	@ltx/en_uk_lash/he.h.m3:heHE.EnSinaioToOrei.name
ltx/en_uk_lash/oc.m3.d5:ocMA.OdeW9C2T.mode	@ltx/en_uk_lash/miscellanea:misc.Mode3
ltx/en_uk_lash/oc.m3.d5:ocMA.OdeW9C2T.ode	@ltx/en_uk_lash/miscellanea:misc.Ode9
ltx/en_uk_lash/oc.m3.d5:ocMA.OdeW9C2T.text	Appear to me as a saving enlightenment, you who bore the light, dispelling the many and dread clouds from my soul, that by your prayers I may become a son of the day, doing holy deeds, and that in hymns I may ever call you blessed.
ltx/en_uk_lash/oc.m3.d5:ocVE.ApolTheotokionVM.incipit	…
ltx/en_uk_lash/oc.m3.d5:ocVE.ApolTheotokionVM.melody	
ltx/en_uk_lash/oc.m3.d5:ocVE.ApolTheotokionVM.mode	@ltx/en_uk_lash/miscellanea:misc.Mode3
ltx/en_uk_lash/oc.m3.d5:ocVE.ApolTheotokionVM.text	
ltx/en_uk_lash/oc.m3.d5:ocVE.AposTheotokion.greekmelody	@ltx/en_uk_lash/he.a.m3:heAU.MegaliTonMartyronSou.greekname
ltx/en_uk_lash/oc.m3.d5:ocVE.AposTheotokion.incipit	O Maiden, you are the…
ltx/en_uk_lash/oc.m3.d5:ocVE.AposTheotokion.melody	@ltx/en_uk_lash/he.a.m3:heAU.MegaliTonMartyronSou.notmetered
ltx/en_uk_lash/oc.m3.d5:ocVE.AposTheotokion.mode	@ltx/en_uk_lash/miscellanea:misc.Mode3
ltx/en_uk_lash/oc.m3.d5:ocVE.AposTheotokion.text	O Maiden, you are the joy of Angels, glory of the Apostles, seal of Prophets, protection and saving guide of faithful humans; and so we worship you, O Virgin.
ltx/en_uk_lash/oc.m3.d5:ocVE.Aposticha1.incipit	Your sound has gone out…
ltx/en_uk_lash/oc.m3.d5:ocVE.Aposticha1.melody	
ltx/en_uk_lash/oc.m3.d5:ocVE.Aposticha1.mode	@ltx/en_uk_lash/miscellanea:misc.Mode3
ltx/en_uk_lash/oc.m3.d5:ocVE.Aposticha1.text	Your sound has gone out into all the earth, holy Apostles; you abolished the error of idols by preaching the knowledge of God; this is your good fight, blessed Saints, and so we hymn and glorify your memories.
ltx/en_uk_lash/oc.m3.d5:ocVE.Aposticha2.incipit	Blamelessly keeping Christ''s commands, holy…
ltx/en_uk_lash/oc.m3.d5:ocVE.Aposticha2.melody	
ltx/en_uk_lash/oc.m3.d5:ocVE.Aposticha2.mode	@ltx/en_uk_lash/miscellanea:misc.Mode3
ltx/en_uk_lash/oc.m3.d5:ocVE.Aposticha2.text	Blamelessly keeping Christ''s commands, holy Apostles, freely you received, freely you give, curing the passions of our souls and bodies; and so as you have freedom to speak, implore him to have mercy on our souls.
ltx/en_uk_lash/oc.m3.d5:ocVE.Aposticha3.incipit	Your Martyrs, Lord, strengthened by…
ltx/en_uk_lash/oc.m3.d5:ocVE.Aposticha3.melody	
ltx/en_uk_lash/oc.m3.d5:ocVE.Aposticha3.mode	@ltx/en_uk_lash/miscellanea:misc.Mode3
ltx/en_uk_lash/oc.m3.d5:ocVE.Aposticha3.text	Your Martyrs, Lord, strengthened by faith, confirmed by hope, united in soul by love of your Cross, destroyed the tyranny of the foe, and having gained their crowns, they intercede with the Bodiless Powers on behalf of our souls.
ltx/en_uk_lash/oc.m3.d5:ocVE.SticTheotokion.greekmelody	@ltx/en_uk_lash/he.a.m3:heAU.MegaliTonMartyronSou.greekname
ltx/en_uk_lash/oc.m3.d5:ocVE.SticTheotokion.incipit	Lady, Bride of God, who…
ltx/en_uk_lash/oc.m3.d5:ocVE.SticTheotokion.melody	@ltx/en_uk_lash/he.a.m3:heAU.MegaliTonMartyronSou.notmetered
ltx/en_uk_lash/oc.m3.d5:ocVE.SticTheotokion.mode	@ltx/en_uk_lash/miscellanea:misc.Mode3
ltx/en_uk_lash/oc.m3.d5:ocVE.SticTheotokion.text	Lady, Bride of God, who have dominion over all creatures, with the medicine of your intercession quickly free my soul dreadfully dominated by the passions and enslave it to your Son and God.
ltx/en_uk_lash/oc.m3.d5:ocVE.Stichera1.greekmelody	@ltx/en_uk_lash/he.a.m3:heAU.MegaliTonMartyronSou.greekname
ltx/en_uk_lash/oc.m3.d5:ocVE.Stichera1.incipit	At the intercessions of your…
ltx/en_uk_lash/oc.m3.d5:ocVE.Stichera1.melody	@ltx/en_uk_lash/he.a.m3:heAU.MegaliTonMartyronSou.notmetered
ltx/en_uk_lash/oc.m3.d5:ocVE.Stichera1.mode	@ltx/en_uk_lash/miscellanea:misc.Mode3
ltx/en_uk_lash/oc.m3.d5:ocVE.Stichera1.text	At the intercessions of your honoured Apostles, O Lover of humankind, pitying and alone merciful, grant peace to your people, and deliver from troubles those who sing your praise and faithfully worship you.
ltx/en_uk_lash/oc.m3.d5:ocVE.Stichera2.incipit	As eye-witnesses of God, deliver…
ltx/en_uk_lash/oc.m3.d5:ocVE.Stichera2.melody	@ltx/en_uk_lash/he.a.m3:heAU.MegaliTonMartyronSou.notmetered
ltx/en_uk_lash/oc.m3.d5:ocVE.Stichera2.mode	@ltx/en_uk_lash/miscellanea:misc.Mode3
ltx/en_uk_lash/oc.m3.d5:ocVE.Stichera2.text	As eye-witnesses of God, deliver me from the darts of the boaster, quenching his villainies. Bedew me, sweltering in the heat of sins, with the dew of the spirit, my godlike Benefactors.
ltx/en_uk_lash/oc.m3.d5:ocVE.Stichera3.incipit	Truly your godlike sound has…
ltx/en_uk_lash/oc.m3.d5:ocVE.Stichera3.melody	@ltx/en_uk_lash/he.a.m3:heAU.MegaliTonMartyronSou.notmetered
ltx/en_uk_lash/oc.m3.d5:ocVE.Stichera3.mode	@ltx/en_uk_lash/miscellanea:misc.Mode3
ltx/en_uk_lash/oc.m3.d5:ocVE.Stichera3.text	Truly your godlike sound has gone out into all the inhabited world, Apostles of the Lord, enlightened those who sit in darkness and offered to God, like incense, those who know him.
ltx/en_uk_lash/oc.m3.d5:ocVE.Stichera4.greekmelody	@ltx/en_uk_lash/he.a.m3:heAU.MegaliTonMartyronSou.greekname
ltx/en_uk_lash/oc.m3.d5:ocVE.Stichera4.incipit	You have been revealed to…
ltx/en_uk_lash/oc.m3.d5:ocVE.Stichera4.melody	@ltx/en_uk_lash/he.a.m3:heAU.MegaliTonMartyronSou.notmetered
ltx/en_uk_lash/oc.m3.d5:ocVE.Stichera4.mode	@ltx/en_uk_lash/miscellanea:misc.Mode3
ltx/en_uk_lash/oc.m3.d5:ocVE.Stichera4.text	You have been revealed to us as a mighty salvation for all, thrice-blessed Nicholas; for you deliver your servants from dangers of every kind, from constraint, from trials, diseases, troubles and invisible foes.
ltx/en_uk_lash/oc.m3.d5:ocVE.Stichera5.incipit	A prodigal, I have been…
ltx/en_uk_lash/oc.m3.d5:ocVE.Stichera5.melody	@ltx/en_uk_lash/he.a.m3:heAU.MegaliTonMartyronSou.notmetered
ltx/en_uk_lash/oc.m3.d5:ocVE.Stichera5.mode	@ltx/en_uk_lash/miscellanea:misc.Mode3
ltx/en_uk_lash/oc.m3.d5:ocVE.Stichera5.text	A prodigal, I have been struck by a poisonous sting and I lie perishing; by your unsleeping prayer, High Priest, raise me quickly that I may glorify your grace, so quick to hear.
ltx/en_uk_lash/oc.m3.d5:ocVE.Stichera6.incipit	In that dread hour in…
ltx/en_uk_lash/oc.m3.d5:ocVE.Stichera6.melody	@ltx/en_uk_lash/he.a.m3:heAU.MegaliTonMartyronSou.notmetered
ltx/en_uk_lash/oc.m3.d5:ocVE.Stichera6.mode	@ltx/en_uk_lash/miscellanea:misc.Mode3
ltx/en_uk_lash/oc.m3.d5:ocVE.Stichera6.text	In that dread hour in which I am to stand before the dreadful judgement seat and to be sent to punishment, as you have freedom to speak, may I find you as my helper, O High Priest, I implore you, to deliver me from darkness.
ltx/en_uk_lash/oc.m3.d5:octrMA.Kathisma11.greekmelody	@ltx/en_uk_lash/he.a.m3:heAU.TheiasPisteos.greekname
ltx/en_uk_lash/oc.m3.d5:octrMA.Kathisma11.incipit	…
ltx/en_uk_lash/oc.m3.d5:octrMA.Kathisma11.melody	@ltx/en_uk_lash/he.a.m3:heAU.TheiasPisteos.notmetered
ltx/en_uk_lash/oc.m3.d5:octrMA.Kathisma11.mode	@ltx/en_uk_lash/miscellanea:misc.Mode3
ltx/en_uk_lash/oc.m3.d5:octrMA.Kathisma11.text	
ltx/en_uk_lash/oc.m3.d5:octrMA.Kathisma12.incipit	@ltx/en_uk_lash/oc.m3.d5:ocMA.Kathisma21.incipit
ltx/en_uk_lash/oc.m3.d5:octrMA.Kathisma12.melody	
ltx/en_uk_lash/oc.m3.d5:octrMA.Kathisma12.mode	@ltx/en_uk_lash/miscellanea:misc.Mode3
ltx/en_uk_lash/oc.m3.d5:octrMA.Kathisma12.text	@ltx/en_uk_lash/oc.m3.d5:ocMA.Kathisma21.text
ltx/en_uk_lash/oc.m3.d5:octrMA.Kathisma1T.greekmelody	@ltx/en_uk_lash/he.a.m3:heAU.TinOraiotita.greekname
ltx/en_uk_lash/oc.m3.d5:octrMA.Kathisma1T.incipit	…
ltx/en_uk_lash/oc.m3.d5:octrMA.Kathisma1T.melody	@ltx/en_uk_lash/he.a.m3:heAU.TinOraiotita.notmetered
ltx/en_uk_lash/oc.m3.d5:octrMA.Kathisma1T.mode	@ltx/en_uk_lash/miscellanea:misc.Mode3
ltx/en_uk_lash/oc.m3.d5:octrMA.Kathisma1T.text	
ltx/en_uk_lash/oc.m3.d5:octrMA.Ode7Martyricon.greekmelody	@ltx/en_uk_lash/he.a.m3:heAU.TinOraiotita.greekname
ltx/en_uk_lash/oc.m3.d5:octrMA.Ode7Martyricon.incipit	@ltx/en_uk_lash/oc.m3.d4:ocMA.Kathisma32.incipit
ltx/en_uk_lash/oc.m3.d5:octrMA.Ode7Martyricon.melody	@ltx/en_uk_lash/he.a.m3:heAU.TinOraiotita.notmetered
ltx/en_uk_lash/oc.m3.d5:octrMA.Ode7Martyricon.mode	@ltx/en_uk_lash/miscellanea:misc.Mode3
ltx/en_uk_lash/oc.m3.d5:octrMA.Ode7Martyricon.text	@ltx/en_uk_lash/oc.m3.d4:ocMA.Kathisma32.text
ltx/en_uk_lash/oc.m3.d5:octrMA.Photogogic.incipit	@ltx/en_uk_lash/oc.m3.d2:octrMA.Photagogic.incipit
ltx/en_uk_lash/oc.m3.d5:octrMA.Photogogic.mode	@ltx/en_uk_lash/miscellanea:misc.Mode3
ltx/en_uk_lash/oc.m3.d5:octrMA.Photogogic.text	@ltx/en_uk_lash/oc.m3.d2:octrMA.Photagogic.text
ltx/en_uk_lash/oc.m3.d5:octrMA.Triadic1.incipit	@ltx/en_uk_lash/oc.m3.d2:octrMA.Triadic1.incipit
ltx/en_uk_lash/oc.m3.d5:octrMA.Triadic1.mode	@ltx/en_uk_lash/miscellanea:misc.Mode3
ltx/en_uk_lash/oc.m3.d5:octrMA.Triadic1.text	@ltx/en_uk_lash/oc.m3.d2:octrMA.Triadic1.text
ltx/en_uk_lash/oc.m3.d5:octrMA.Triadic2.incipit	@ltx/en_uk_lash/oc.m3.d2:octrMA.Triadic2.incipit
ltx/en_uk_lash/oc.m3.d5:octrMA.Triadic2.mode	@ltx/en_uk_lash/miscellanea:misc.Mode3
ltx/en_uk_lash/oc.m3.d5:octrMA.Triadic2.text	@ltx/en_uk_lash/oc.m3.d2:octrMA.Triadic2.text
ltx/en_uk_lash/oc.m3.d5:octrMA.Triadic3.incipit	@ltx/en_uk_lash/oc.m3.d2:octrMA.Triadic3.incipit
ltx/en_uk_lash/oc.m3.d5:octrMA.Triadic3.mode	@ltx/en_uk_lash/miscellanea:misc.Mode3
ltx/en_uk_lash/oc.m3.d5:octrMA.Triadic3.text	@ltx/en_uk_lash/oc.m3.d2:octrMA.Triadic3.text
