ltx/en_uk_lash/eu.baptism:euBAP.Key0100.title	Order That Takes Place Before Holy Baptism
ltx/en_uk_lash/eu.baptism:euBAP.Key0101.text	In your name, O Lord God of truth, and of your Only-Begotten Son and your Holy Spirit, I place my hand on the head of your servant N., who has been counted worthy to take refuge in your holy Name and to be guarded under the shelter of your wings. Remove from him/her that ancient error and fill him/her with faith in you, and hope and love, so that he/she may know that you alone are God, true God, and your Only-Begotten Son, our Lord Jesus Christ, and your Holy Spirit. Grant that he/she may walk in your commandments and preserve those things that are pleasing to you, for if someone does them, they will live by them. Inscribe him/her in your book of life and unite him/her to the flock of your inheritance. Let your holy Name and that of your beloved Son, our Lord Jesus Christ and of your life-giving Spirit, be glorified in him/her. Let your eyes remain ever fixed in mercy on him/her, and your ears to hear the voice of his/her supplication. Make him/her glad in the works of his/her hands and in all his/her race, that he/she may confess you, worshipping and glorifying your great and most high Name, and may praise you throughout all the days of his/her life.
ltx/en_uk_lash/eu.baptism:euBAP.Key0101.title	Prayer for Making a Catechumen
ltx/en_uk_lash/eu.baptism:euBAP.Key0102.text	For every power of heaven sings your praise, and yours is the glory, of the Father, the Son and the Holy Spirit, now and for ever, and to the ages of ages. Amen.
ltx/en_uk_lash/eu.baptism:euBAP.Key0103.text	The Lord rebukes you, O Devil, the Lord who came into the world and dwelt among mortals so that he might destroy your tyranny and deliver humanity; the Lord who on the Tree crushed the hostile powers, when the sun was darkened, the earth shaken, the graves opened and the bodies of Saints arose; the Lord who by death abolished death and destroyed the one who had the power of death, that is you, the Devil. I adjure you by God, who revealed the tree of life and set in place the Cherubim and the flaming sword which turned this way and that to guard it: Be rebuked and withdraw! I adjure you by the One who walked on the surface of the sea as on dry land and rebuked the tempest of the winds, the One whose gaze dries up the deeps and whose curse melts mountains. For it is he who now commands you, through us: Be afraid, come out, withdraw from this creature and return no more. Do not hide in him/her, nor encounter him/her, nor influence him/her either by night or day, early or at noon. But go back to your own Tartarus until the great day of the judgement that has been prepared. Be afraid of God, who is seated upon the Cherubim and looks upon the deeps; before whom Angels, Archangels, Thrones, Dominions, Principalities, Authorities, Powers, the many-eyed Cherubim and the six-winged Seraphim tremble; before whom heaven and earth, the sea and all that is in them tremble. Come out, and withdraw from the sealed and newly-enlisted soldier of Christ our God. For it is by him that I adjure you, the One who walks on the wings of the winds, who makes his Angels spirits and his ministers a flaming fire. Come out, and withdraw from this creature with all your power and your angels. For the name of the Father and of the Son and of the Holy Spirit has been glorified, now and for ever, and to the ages of ages.
ltx/en_uk_lash/eu.baptism:euBAP.Key0103.title	First Exorcism
ltx/en_uk_lash/eu.baptism:euBAP.Key0104.text	It is God, the Holy One, who is beyond understanding and unsearchable in all his works and in his strength, the One who foreordained for you, O Devil, the penalty of eternal damnation, that through us, his unprofitable servants, orders you, and every power that works with you, to depart from the one who has been newly sealed in the name of our Lord Jesus Christ, our true God. I adjure you, most evil, unclean, foul, abominable and alien spirit, by the power of Jesus Christ, who has all authority in heaven and on earth and who said to the deaf and dumb demon, ‘Come out of the man, and enter him no more!’ Depart! Acknowledge the futility of your power, which had no authority even over swine. Remember the One who ordered you, in accordance with your own request, to enter the herd of swine. Fear God, at whose command the earth was established upon the waters, who created the heavens and fixed the mountains with a king post and the valleys with a cross-beam, placed sand as a boundary for the sea and made a safe path through wild water; who touches the mountains and they smoke; who wraps himself in light as in a garment, stretching out the heavens like a tent cloth; who roofs his upper chambers with waters; who established the earth on its foundations; it will not be moved for to age on age; who summoned the water of the sea and poured it out upon the face of the earth. Come and depart from one who is being made ready for holy Enlightenment. I adjure you by the saving Passion of our Lord Jesus Christ, by his precious Body and Blood and his dread Coming; for he will come, and he will not delay, to judge the whole earth and he will condemn you and the power that works with you to the Gehenna of fire, handing you over to the exterior darkness, where the worm is unsleeping and the fire is not quenched. Because the might is Christ our God's, with the Father and the Holy Spirit, now and for ever, and to the ages of ages.
ltx/en_uk_lash/eu.baptism:euBAP.Key0104.title	Second Exorcism
ltx/en_uk_lash/eu.baptism:euBAP.Key0105.text	Lord Sabaoth, God of Israel, who heal every disease and every sickness, look upon your servant, search out, seek and drive from him/her all the activities of the devil. Rebuke the unclean spirits and expel them, and cleanse the work of your hands; and using your swift force, crush Satan speedily under his/her feet and grant him/her victories against him and all his unclean spirits, so that, obtaining mercy from you, he/she may be found worthy of your immortal and heavenly Mysteries and may give glory to you, the Father, the Son and the Holy Spirit, now and for ever, and to the ages of ages.
ltx/en_uk_lash/eu.baptism:euBAP.Key0105.title	Third Exorcism
ltx/en_uk_lash/eu.baptism:euBAP.Key0106.text	Master and Lord, the One who Is, who made man according to your image and likeness and gave him the power of eternal life; then, when he fell through sin, did not disdain him, but provided for the salvation of the world through the incarnation of your Christ, do you yourself receive also this creature of yours, whom you have redeemed from the slavery of the foe, into the heavenly Kingdom. Open the eyes of his/her mind so that the enlightenment of your Gospel may dawn on him/her. Yoke to his/her life an Angel of light, to deliver him/her from every attack of the adversary, from evil encounter, from the noon-day demon, from evil visions.
ltx/en_uk_lash/eu.baptism:euBAP.Key0107.text	Drive out of him/her every evil and unclean spirit hiding and lurking in his/her heart.
ltx/en_uk_lash/eu.baptism:euBAP.Key0108.text	The spirit of error, the spirit of wickedness, the spirit of idolatry and diabolic oppression; the spirit of lying and every uncleanness which operates in accordance with the teaching of the devil. And make him/her a rational sheep of the flock of your Christ, an honoured member of your Church, a vessel made holy, a child of light and an heir of your Kingdom. So that, having lived in accordance with your commandments, preserving the seal undamaged and keeping his/her garment undefiled, he/she may attain to the blessedness of the Saints in your Kingdom.
ltx/en_uk_lash/eu.baptism:euBAP.Key0110.text	Do you renounce Satan? And all his works? And all his angels? And all his worship? And all his solemn rites?
ltx/en_uk_lash/eu.baptism:euBAP.Key0111.text	I renounce them.
ltx/en_uk_lash/eu.baptism:euBAP.Key0112.text	Have you renounced Satan?
ltx/en_uk_lash/eu.baptism:euBAP.Key0113.text	I have renounced him.
ltx/en_uk_lash/eu.baptism:euBAP.Key0114.text	Then blow and spit on him.
ltx/en_uk_lash/eu.baptism:euBAP.Key0115.text	Do you unite yourself to Christ?
ltx/en_uk_lash/eu.baptism:euBAP.Key0116.text	I unite myself to him.
ltx/en_uk_lash/eu.baptism:euBAP.Key0117.text	Have you united yourself to Christ?
ltx/en_uk_lash/eu.baptism:euBAP.Key0118.text	I have united myself to him.
ltx/en_uk_lash/eu.baptism:euBAP.Key0119.text	And do you believe in him?
ltx/en_uk_lash/eu.baptism:euBAP.Key0120.text	I believe in him as King and God,
ltx/en_uk_lash/eu.baptism:euBAP.Key0121.text	Bow down also and worship him.
ltx/en_uk_lash/eu.baptism:euBAP.Key0122.text	I worship Father, Son and Holy Spirit, Trinity consubstantial and undivided.
ltx/en_uk_lash/eu.baptism:euBAP.Key0123.text	Blessed is God who wishes all to be saved and come to the knowledge of the truth, now and for ever, and to the ages of ages.
ltx/en_uk_lash/eu.baptism:euBAP.Key0124.text	Master, Lord our God, call your servant N. to your holy Enlightenment and count him/her worthy of the great grace of your holy Baptism. Put off his/her old self and renew him/her for eternal life and fill him/her with the power of your Holy Spirit for union with your Christ, that he/she may no longer be a child of the body, but a child of your kingdom. Through the good pleasure and grace of your Only-begotten Son, with whom you are blessed, together with your all-holy, good and life-giving Spirit, now and for ever, and to the ages of ages.
ltx/en_uk_lash/eu.baptism:euBAP.Key0200.title	Service of Holy Baptism
ltx/en_uk_lash/eu.baptism:euBAP.Key0201.text	Compassionate and merciful God, you test minds and hearts and alone know the secrets of mortals, for no deed is hidden in your sight, but everything is naked and exposed to your eyes. You know all about me; do not then despise me or turn your face from me, but overlook my offences at this hour, you who overlook the sins of mortals for their repentance. Wash away the filth of my body and the defilement of my soul by the power of your invisible and spiritual right hand, lest, as I proclaim freedom to others and grant it by the perfect faith of your ineffable love for mankind, I myself, as a slave of sin, become unworthy of it. May I not, Master, alone good and lover of mankind, may I not be turned away humiliated and put to shame, but from on high send power out to me and give me strength for your great and heavenly Mystery which lies before me, and through my miserable person form your Christ in the one who is about to be reborn. Build him/her up on the foundation of your Apostles and Prophets, and do not pull him/her down, but plant him/her as a plant of truth in your holy Catholic and Apostolic Church, and do not pull him/her out. So that by his/her progressing in true religion, your all-holy name, of Father, Son and Holy Spirit, may be glorified also through him/her, now and for ever, and to the ages of ages. Amen.
ltx/en_uk_lash/eu.baptism:euBAP.Key0202.text	Great are you, O Lord, and wonderful are your works; and no word will be adequate to sing the praise of your wonders.
ltx/en_uk_lash/eu.baptism:euBAP.Key0204.text	For as by your will you brought the universe from non-existence into being, by your might you uphold creation and by your providence you direct the world. From four elements you composed the world, with four seasons you crowned the circle of the year. All the spiritual Powers tremble before you. The sun sings your praise, the moon glorifies you, the stars entreat you, the light obeys you, the deeps tremble before you, the springs are your servants. You stretched out the heaven like a curtain; you established the earth on the waters; you walled in the sea with sand; you poured out the air for breathing. Angelic Powers minister to you, the choirs of Archangels worship you, the many-eyed Cherubim and the six-winged Seraphim, as they stand and fly around you, veil themselves in fear of your unapproachable glory. For you, God uncircumscribed, without beginning and ineffable, came upon earth taking the form of a slave, being found in the likeness of mortals. For through the compassion of your mercy, Master, you could not endure to watch the human race being tyrannized by the devil, but you came and saved us. We confess your grace, we proclaim your mercy, we do not conceal your benevolence. You set at liberty the generations of our nature, you sanctified a virgin womb by your birth. All creation sang your praise when you appeared. For you, our God, were seen on earth and lived among mortals. You also sanctified the streams of Jordan by sending down to them from heaven your all-holy Spirit, and you crushed the heads of the dragons that lurked there.
ltx/en_uk_lash/eu.baptism:euBAP.Key0205.text	Therefore, O King, lover of mankind, be present now too, through the visitation of your Holy Spirit, and sanctify this water.
ltx/en_uk_lash/eu.baptism:euBAP.Key0206.text	Give it the grace of redemption, the blessing of Jordan. Make it a source of incorruption, a gift of sanctification, an deliverance from sins, a destruction of demons. Make it unapproachable by hostile powers and filled with angelic strength. Let those that conspire against your creature flee from it, because I, Lord, have called upon your Name, which is wondrous and glorious and fearful to adversaries.
ltx/en_uk_lash/eu.baptism:euBAP.Key0207.text	Let all adverse powers be crushed beneath the sign of the image of your Cross.
ltx/en_uk_lash/eu.baptism:euBAP.Key0208.text	We pray you, Lord, let all airy and invisible specters withdraw from us, and do not let a demon of darkness hide itself in this water, and do not let an evil spirit, bringing darkening of thoughts and disturbance of mind, go down into it with the one who is being baptized. But do you, Master of all things, declare this water to be water of redemption, water of sanctification, cleansing of flesh and spirit, untying of bonds, forgiveness of offences, enlightenment of soul, washing of rebirth, renewal of spirit, gift of adoption, garment of incorruption, source of life. For it was you, Lord, who said, ‘Wash and be made clean, and put away evils from your souls’. It is you who have given us the grace of rebirth from on high through water and Spirit. Manifest yourself, Lord, in this water, and grant that the one being baptized in it may be transformed for the putting off of the old self that is corrupted after the desires of deception, and may put on the new that is renewed after the image of the One who created him/her. So that, planted in the likeness of your death through Baptism, he/she may also become a partaker in your Resurrection, and having guarded the gift of the Holy Spirit and increased the deposit of grace, may receive the prize of his/her high calling and be numbered with the firstborn, whose names are inscribed in heaven, in you our God and Lord, Jesus Christ.
ltx/en_uk_lash/eu.baptism:euBAP.Key0209.text	Because to you belong glory, might, honour and worship, together with your Father who is without beginning and your all-holy, good, and life-giving Spirit, now and for ever, and to the ages of ages.
ltx/en_uk_lash/eu.baptism:euBAP.Key0301.text	Master, Lord God of our fathers, who sent out a dove to those in Noah’s ark, with a branch of olive in its beak as sign of reconciliation and salvation from the flood, and through these things prefigured the Mystery of grace; who have given the fruit of the olive for the completion of your holy Mysteries; who through it both filled those under the Law with the Holy Spirit, and make perfect those under grace; do you yourself bless this olive oil also by the power, operation and descent of your Holy Spirit, so that it may become an anointing of incorruption, a weapon of righteousness, renewal of soul and body, a driving away of every operation of the devil, for the removal of all evils from those who are anointed with it in faith, or who partake of it.
ltx/en_uk_lash/eu.baptism:euBAP.Key0302.text	To your glory and that of your Only-Begotten Son and your all-holy, good, and life-giving Spirit, now and for ever, and to the ages of ages.
ltx/en_uk_lash/eu.baptism:euBAP.Key0303.text	Blessed is God, who enlightens and sanctifies everyone who comes into the world, now and for ever, and to the ages of ages.
ltx/en_uk_lash/eu.baptism:euBAP.Key0304.text	The servant of God, N., is anointed with the oil of gladness, in the name of the Father, and of the Son, and of the Holy Spirit. Amen.
ltx/en_uk_lash/eu.baptism:euBAP.Key0305.text	For healing of soul and body.
ltx/en_uk_lash/eu.baptism:euBAP.Key0306.text	For the hearing of faith.
ltx/en_uk_lash/eu.baptism:euBAP.Key0307.text	For your feet to walk.
ltx/en_uk_lash/eu.baptism:euBAP.Key0308.text	Your hands made me and fashioned me.
ltx/en_uk_lash/eu.baptism:euBAP.Key0313.text	The servant of God N. is baptized, in the name of the Father.
ltx/en_uk_lash/eu.baptism:euBAP.Key0314.text	And of the Son.
ltx/en_uk_lash/eu.baptism:euBAP.Key0315.text	And of the Holy Spirit.
ltx/en_uk_lash/eu.baptism:euBAP.Key0401.text	Blessed are you, Lord God Almighty, the source of blessings, the Sun of righteousness, who have made the light of salvation shine for those in darkness through the appearing of your Only-Begotten Son and our God, and have granted us, unworthy though are, the grace of blessed cleansing by holy Baptism, and divine sanctification by life-giving Anointing. And you have now been well-pleased to make your newly-enlightened servant to be born again through water and Spirit, and have granted him/her forgiveness of sins both voluntary and involuntary. Do you then, Master, compassionate, universal King, grant him/her also the Seal of the gift of your holy, all-powerful and adorable Spirit and the Communion of the holy Body and precious Blood of your Christ. Keep him/her in your sanctification; confirm him/her in the Orthodox Faith; deliver him/her from the evil one and all his devices, and by your saving fear guard his/her soul in purity and righteousness; so that being in every deed and word well-pleasing to you, he/she may become a child and heir of your heavenly Kingdom.
ltx/en_uk_lash/eu.baptism:euBAP.Key0403.text	Seal of the gift of the Holy Spirit.
ltx/en_uk_lash/eu.baptism:euBAP.Key0404.text	The servant of God N. is clothed with a tunic of righteousness, in the name of the Father, and of the Son, and of the Holy Spirit. Amen.
ltx/en_uk_lash/eu.baptism:euBAP.Key0405.text	Grant me a tunic of light, O most merciful, Christ our God, who wrap yourself in light as in a garment.
ltx/en_uk_lash/eu.baptism:euBAP.Key0501.text	Master and Lord, who have granted your servant forgiveness of sins through holy Baptism, and given him/her the grace of a life of rebirth, be well pleased for the illumination of your face to shine for ever in his/her heart; keep the shield of his/her faith safe from attack by foes; preserve on him/her the garment of incorruption, which he/she has put on, undefiled and unstained; by your grace keeping the spiritual seal unbroken in him/her, and being merciful to him/her and to us.
ltx/en_uk_lash/eu.baptism:euBAP.Key0501.title	PRAYERS OF THE ABLUTION
ltx/en_uk_lash/eu.baptism:euBAP.Key0502.text	For blessed and glorified is your all-honoured and majestic Name, of the Father, the Son and the Holy Spirit, now and for ever, and to the ages of ages.
ltx/en_uk_lash/eu.baptism:euBAP.Key0503.text	Master, Lord our God, who through the font grant heavenly radiance to those who are baptized, who have given your newly enlightened servant rebirth through water and Spirit, and granted him/her forgiveness of sins both voluntary and involuntary, lay your mighty hand on him/her and guard him/her by the power of your loving kindness; preserve the pledge inviolate; and count him/her worthy of eternal life and your good pleasure.
ltx/en_uk_lash/eu.baptism:euBAP.Key0504.text	@ltx/en_uk_lash/eu.lichrysbasil:euLI.Key1607.text
ltx/en_uk_lash/eu.baptism:euBAP.Key0505.text	The one who has put you on, Christ our God, has bowed his/her head to you with us. Guard him/her always to remain an invincible warrior against those that in vain bear enmity against him/her and us, and with your incorruptible crown declare us all to be victors unto the end.
ltx/en_uk_lash/eu.baptism:euBAP.Key0506.text	Because yours it is to have mercy and to save us, and to you we give glory, with your Father who is without beginning and your all-holy, good and life-giving Spirit, now and for ever, and to the ages of ages.
ltx/en_uk_lash/eu.baptism:euBAP.Key0508.text	You have been baptized. You have been enlightened. You have been anointed with chrism. You have been sanctified. You have been washed clean. In the name of the Father and of the Son and of the Holy Spirit. Amen.
ltx/en_uk_lash/eu.baptism:euBAP.Key0601.text	Master, Lord our God, who honoured mortals with your image, furnishing them with a rational soul and a comely body, so that the body might serve the rational soul, you placed the head at the very top and in it you planted the majority of the senses, which do not interfere with one another, while you covered the head with hair so as not to be harmed by the changes of the weather, and you fitted all the limbs most suitably to each one, so that through them all they might give thanks to you, the master craftsman. Do you yourself, Master, who through your vessel of election, the Apostle Paul, ordered us to do all things to your glory, bless your servant N. who has come to make a first offering by the cutting of the hair of his/her head. Bless his/her Sponsor also and grant that they may always meditate on your law and do what is well-pleasing to you.
ltx/en_uk_lash/eu.baptism:euBAP.Key0601.title	PRAYERS FOR THE TONSURE
ltx/en_uk_lash/eu.baptism:euBAP.Key0602.text	For you, O God, are merciful and love mankind, and to you we give glory, to the Father and to the Son and to the Holy Spirit, now and for ever, and to the ages of ages.
ltx/en_uk_lash/eu.baptism:euBAP.Key0603.text	Lord our God, who through your loving kindness have sanctified from the fullness of the font those who believe in you, bless this child here present, and let your blessing come down upon his/her head. As you blessed King David through Samuel the Prophet, bless too the head of your servant N. through the hand of me, a sinner, visiting him/her with your Holy Spirit, so that as he/she advances to mature years and to the grey hairs of old age, he/she may give glory to you and see the good things of Jerusalem all the days of his/her life.
ltx/en_uk_lash/eu.baptism:euBAP.Key0604.text	@ltx/en_uk_lash/prayers:pr.exc01.text
ltx/en_uk_lash/eu.baptism:euBAP.Key0606.text	Again we pray for mercy, life, peace, health, salvation and forgiveness of sins for the servant of God, the Sponsor N.
ltx/en_uk_lash/eu.baptism:euBAP.Key0607.text	@ltx/en_uk_lash/prayers:pr.exc11.text
ltx/en_uk_lash/eu.baptism:euBAP.Key0701.text	of Saint N., the Saint of the Newly-baptized,
ltx/en_uk_lash/eu.baptism:euBAP.title	The Order of the Sacrament of Holy Baptism
