ltx/en_uk_lash/eo.e01:eo.Doxasticon.incipit	…
ltx/en_uk_lash/eo.e01:eo.Doxasticon.mode	@ltx/en_uk_lash/miscellanea:misc.Mode1
ltx/en_uk_lash/eo.e01:eo.Doxasticon.text	
ltx/en_uk_lash/eo.e01:eo.Exaposteilarion.greekmelody	@ltx/en_uk_lash/he.a.m2:heAU.ToisMathitaisSynelthomen.greekname
ltx/en_uk_lash/eo.e01:eo.Exaposteilarion.incipit	@ltx/en_uk_lash/he.a.m2:heAU.ToisMathitaisSynelthomen.incipit
ltx/en_uk_lash/eo.e01:eo.Exaposteilarion.melody	@ltx/en_uk_lash/he.a.m2:heAU.ToisMathitaisSynelthomen.melody
ltx/en_uk_lash/eo.e01:eo.Exaposteilarion.mode	@ltx/en_uk_lash/miscellanea:misc.Mode2
ltx/en_uk_lash/eo.e01:eo.Exaposteilarion.text	@ltx/en_uk_lash/he.a.m2:heAU.ToisMathitaisSynelthomen.text
ltx/en_uk_lash/eo.e01:eo.Theotokion.incipit	…
ltx/en_uk_lash/eo.e01:eo.Theotokion.melody	@ltx/en_uk_lash/he.a.m2:heAU.ToisMathitaisSynelthomen.notmetered
ltx/en_uk_lash/eo.e01:eo.Theotokion.mode	@ltx/en_uk_lash/miscellanea:misc.Mode2
ltx/en_uk_lash/eo.e01:eo.Theotokion.text	
ltx/en_uk_lash/eo.e01:eo.title	
