ltx/en_uk_lash/me.m11.d27:meDA.commemoration.first	
ltx/en_uk_lash/me.m11.d27:meDA.commemoration.first_name	
ltx/en_uk_lash/me.m11.d27:meDA.commemoration.first_short	
ltx/en_uk_lash/me.m11.d27:meDA.commemoration.first_title	
ltx/en_uk_lash/me.m11.d27:meDA.commemoration.full	
ltx/en_uk_lash/me.m11.d27:meDA.commemoration.second_name	
ltx/en_uk_lash/me.m11.d27:meDA.commemoration.second_title	
ltx/en_uk_lash/me.m11.d27:meDA.date	
ltx/en_uk_lash/me.m11.d27:meDA.insert1	
ltx/en_uk_lash/me.m11.d27:meDA.insert2	
ltx/en_uk_lash/me.m11.d27:meDA.note	
ltx/en_uk_lash/me.m11.d27:meHO.commemorations	
ltx/en_uk_lash/me.m11.d27:meHO.note1	
ltx/en_uk_lash/me.m11.d27:meHO.note2	
ltx/en_uk_lash/me.m11.d27:meHO.number	
ltx/en_uk_lash/me.m11.d27:meHO.rank	
ltx/en_uk_lash/me.m11.d27:meLE.commemoration1	
ltx/en_uk_lash/me.m11.d27:meLE.commemoration2	
ltx/en_uk_lash/me.m11.d27:meVE.AposTheotokion.greekmelody	@ltx/en_uk_lash/he.a.m5:heAU.ChairoisAskitikon.greekname
ltx/en_uk_lash/me.m11.d27:meVE.AposTheotokion.incipit	@ltx/en_uk_lash/oc.m5.d1:ocSV.Aposticha3.incipit
ltx/en_uk_lash/me.m11.d27:meVE.AposTheotokion.melody	@ltx/en_uk_lash/he.a.m5:heAU.ChairoisAskitikon.notmetered
ltx/en_uk_lash/me.m11.d27:meVE.AposTheotokion.mode	@ltx/en_uk_lash/miscellanea:misc.Mode5
ltx/en_uk_lash/me.m11.d27:meVE.AposTheotokion.text	@ltx/en_uk_lash/oc.m5.d1:ocSV.Aposticha3.text
