ltx/en_uk_lash/me.m08.d16:meDA.commemoration.first	
ltx/en_uk_lash/me.m08.d16:meDA.commemoration.first_name	
ltx/en_uk_lash/me.m08.d16:meDA.commemoration.first_short	
ltx/en_uk_lash/me.m08.d16:meDA.commemoration.first_title	
ltx/en_uk_lash/me.m08.d16:meDA.commemoration.full	Commemoration of the translation from Edessa of the Icon of our Lord Jesus Christ Not Made With Hands, or the Mandylion; and of the Holy Martyr Diomedes.
ltx/en_uk_lash/me.m08.d16:meDA.commemoration.second_name	
ltx/en_uk_lash/me.m08.d16:meDA.commemoration.second_title	
ltx/en_uk_lash/me.m08.d16:meDA.date	
ltx/en_uk_lash/me.m08.d16:meDA.insert1	
ltx/en_uk_lash/me.m08.d16:meDA.insert2	
ltx/en_uk_lash/me.m08.d16:meDA.note	
ltx/en_uk_lash/me.m08.d16:meHO.commemorations	
ltx/en_uk_lash/me.m08.d16:meHO.note1	
ltx/en_uk_lash/me.m08.d16:meHO.note2	
ltx/en_uk_lash/me.m08.d16:meHO.number	
ltx/en_uk_lash/me.m08.d16:meHO.rank	
ltx/en_uk_lash/me.m08.d16:meLE.commemoration1	
ltx/en_uk_lash/me.m08.d16:meLE.commemoration2	
ltx/en_uk_lash/me.m08.d16:meLI.Kontakion1.incipit	@ltx/en_uk_lash/me.m08.d16:meMA.Kontakion1ger.incipit
ltx/en_uk_lash/me.m08.d16:meLI.Kontakion1.melody	@ltx/en_uk_lash/me.m08.d16:meMA.Kontakion1ger.melody
ltx/en_uk_lash/me.m08.d16:meLI.Kontakion1.mode	@ltx/en_uk_lash/me.m08.d16:meMA.Kontakion1ger.mode
ltx/en_uk_lash/me.m08.d16:meLI.Kontakion1.text	@ltx/en_uk_lash/me.m08.d16:meMA.Kontakion1ger.text
ltx/en_uk_lash/me.m08.d16:meLI.Megalynarion.text	
ltx/en_uk_lash/me.m08.d16:meMA.AposGlory.incipit	@ltx/en_uk_lash/me.m08.d15:meVE.Lity1.incipit
ltx/en_uk_lash/me.m08.d16:meMA.AposGlory.melody	
ltx/en_uk_lash/me.m08.d16:meMA.AposGlory.mode	@ltx/en_uk_lash/miscellanea:misc.Mode1
ltx/en_uk_lash/me.m08.d16:meMA.AposGlory.text	@ltx/en_uk_lash/me.m08.d15:meVE.Lity1.text
ltx/en_uk_lash/me.m08.d16:meMA.Aposticha1.greekmelody	@ltx/en_uk_lash/he.a.m2:heAU.OikosTouEfratha.greekname
ltx/en_uk_lash/me.m08.d16:meMA.Aposticha1.incipit	With hymns the godly worshippers…
ltx/en_uk_lash/me.m08.d16:meMA.Aposticha1.melody	@ltx/en_uk_lash/he.a.m2:heAU.OikosTouEfratha.notmetered
ltx/en_uk_lash/me.m08.d16:meMA.Aposticha1.mode	@ltx/en_uk_lash/miscellanea:misc.Mode2
ltx/en_uk_lash/me.m08.d16:meMA.Aposticha1.text	With hymns the godly worshippers, as they accompanied your revered body that had received God, cried out, ''Where do you now depart, Sovereign Lady?''
ltx/en_uk_lash/me.m08.d16:meMA.Aposticha2.incipit	Come, let us born of…
ltx/en_uk_lash/me.m08.d16:meMA.Aposticha2.melody	@ltx/en_uk_lash/he.a.m2:heAU.OikosTouEfratha.notmetered
ltx/en_uk_lash/me.m08.d16:meMA.Aposticha2.mode	@ltx/en_uk_lash/miscellanea:misc.Mode2
ltx/en_uk_lash/me.m08.d16:meMA.Aposticha2.text	Come, let us born of earth set in place the dance as we cry aloud the funeral hymns at the Translation of the Mother of God today.
ltx/en_uk_lash/me.m08.d16:meMA.Aposticha3.incipit	Earth has been blessed by…
ltx/en_uk_lash/me.m08.d16:meMA.Aposticha3.melody	@ltx/en_uk_lash/he.a.m2:heAU.OikosTouEfratha.notmetered
ltx/en_uk_lash/me.m08.d16:meMA.Aposticha3.mode	@ltx/en_uk_lash/miscellanea:misc.Mode2
ltx/en_uk_lash/me.m08.d16:meMA.Aposticha3.text	Earth has been blessed by your burial, O Virgin; while the air has been sanctified by you ascent, strange to the law of mortal nature.
ltx/en_uk_lash/me.m08.d16:meMA.C1.acrostic.notice1	of which the Acrostic is:
ltx/en_uk_lash/me.m08.d16:meMA.C1.acrostic.text	I honour the imprint of your face, O Saviour.
ltx/en_uk_lash/me.m08.d16:meMA.C1.acrostic.title	Canon for the Holy Mandylion.
ltx/en_uk_lash/me.m08.d16:meMA.C1.poet	@ltx/en_uk_lash/poets:po.GermanouPatriarchou
ltx/en_uk_lash/me.m08.d16:meMA.C1.title	Canon for the Mandylion.
ltx/en_uk_lash/me.m08.d16:meMA.C1.verse	@ltx/en_uk_lash/prayers:pr.verse_God.text
ltx/en_uk_lash/me.m08.d16:meMA.C2.title	@ltx/en_uk_lash/titles:ti.CanonSaintM
ltx/en_uk_lash/me.m08.d16:meMA.C2.verse	@ltx/en_uk_lash/prayers:pr.verse_SaintM.text
ltx/en_uk_lash/me.m08.d16:meMA.Exaposteilarion1.greekmelody	@ltx/en_uk_lash/he.a.m2:heAU.GynaikesAkoutisthite.greekname
ltx/en_uk_lash/me.m08.d16:meMA.Exaposteilarion1.incipit	…
ltx/en_uk_lash/me.m08.d16:meMA.Exaposteilarion1.melody	@ltx/en_uk_lash/he.a.m2:heAU.GynaikesAkoutisthite.notmetered
ltx/en_uk_lash/me.m08.d16:meMA.Exaposteilarion1.mode	@ltx/en_uk_lash/miscellanea:misc.Mode2
ltx/en_uk_lash/me.m08.d16:meMA.Exaposteilarion1.text	
ltx/en_uk_lash/me.m08.d16:meMA.Exaposteilarion2.greekmelody	@ltx/en_uk_lash/he.a.m3:heAU.OOuranonToisAstrois.greekname
ltx/en_uk_lash/me.m08.d16:meMA.Exaposteilarion2.incipit	…
ltx/en_uk_lash/me.m08.d16:meMA.Exaposteilarion2.melody	@ltx/en_uk_lash/he.a.m3:heAU.OOuranonToisAstrois.notmetered
ltx/en_uk_lash/me.m08.d16:meMA.Exaposteilarion2.mode	@ltx/en_uk_lash/miscellanea:misc.Mode3
ltx/en_uk_lash/me.m08.d16:meMA.Exaposteilarion2.text	
ltx/en_uk_lash/me.m08.d16:meMA.Kathisma11.greekmelody	@ltx/en_uk_lash/he.a.m4:heAU.KateplagiIosif.greekname
ltx/en_uk_lash/me.m08.d16:meMA.Kathisma11.incipit	The armies of the Angels…
ltx/en_uk_lash/me.m08.d16:meMA.Kathisma11.melody	@ltx/en_uk_lash/he.a.m4:heAU.KateplagiIosif.notmetered
ltx/en_uk_lash/me.m08.d16:meMA.Kathisma11.mode	@ltx/en_uk_lash/miscellanea:misc.Mode4
ltx/en_uk_lash/me.m08.d16:meMA.Kathisma11.text	The armies of the Angels as they watched your Translation, immaculate Mother of God, blessed, all-praised All-holy, having the counsel of the One born from you they gathered the band of Disciples and with joy bore your honoured body to Paradise as they sang the praise of Christ, the Giver of life, to the ages.
ltx/en_uk_lash/me.m08.d16:meMA.Kathisma21.greekmelody	@ltx/en_uk_lash/he.a.m4:heAU.KateplagiIosif.greekname
ltx/en_uk_lash/me.m08.d16:meMA.Kathisma21.incipit	As your Fashioner and God…
ltx/en_uk_lash/me.m08.d16:meMA.Kathisma21.melody	@ltx/en_uk_lash/he.a.m4:heAU.KateplagiIosif.notmetered
ltx/en_uk_lash/me.m08.d16:meMA.Kathisma21.mode	@ltx/en_uk_lash/miscellanea:misc.Mode4
ltx/en_uk_lash/me.m08.d16:meMA.Kathisma21.text	As your Fashioner and God he translated to perfect joy your soul that had been placed in the hands of the One who had become man from you for our sake; therefore we reverently call you blessed, the only pure and undefiled, and as we all acknowledge you to be in deed Mother of God we cry: Implore Christ, to whom you have passed over, to save our souls.
ltx/en_uk_lash/me.m08.d16:meMA.Kontakion1ger.incipit	…
ltx/en_uk_lash/me.m08.d16:meMA.Kontakion1ger.melody	@ltx/en_uk_lash/he.a.m2:heAU.TousAsfaleis.name
ltx/en_uk_lash/me.m08.d16:meMA.Kontakion1ger.mode	@ltx/en_uk_lash/miscellanea:misc.Mode2
ltx/en_uk_lash/me.m08.d16:meMA.Kontakion1ger.poet	@ltx/en_uk_lash/poets:po.Gerasimou
ltx/en_uk_lash/me.m08.d16:meMA.Kontakion1ger.text	
ltx/en_uk_lash/me.m08.d16:meMA.Ode1C11.greekmelody	@ltx/en_uk_lash/he.h.m6:heHE.OsEnIpeiroPezefsas.greekname
ltx/en_uk_lash/me.m08.d16:meMA.Ode1C11.incipit	The One who before was…
ltx/en_uk_lash/me.m08.d16:meMA.Ode1C11.melody	@ltx/en_uk_lash/he.h.m6:heHE.OsEnIpeiroPezefsas.name
ltx/en_uk_lash/me.m08.d16:meMA.Ode1C11.mode	@ltx/en_uk_lash/miscellanea:misc.Mode6
ltx/en_uk_lash/me.m08.d16:meMA.Ode1C11.ode	@ltx/en_uk_lash/miscellanea:misc.Ode1
ltx/en_uk_lash/me.m08.d16:meMA.Ode1C11.text	The One who before was without a body, by the Father''s good pleasure did not refuse to be formed with a body like ours, and has granted us the grace of a divine representation.
ltx/en_uk_lash/me.m08.d16:meMA.Ode1C12.incipit	The unchanging nature, the most…
ltx/en_uk_lash/me.m08.d16:meMA.Ode1C12.melody	@ltx/en_uk_lash/he.h.m6:heHE.OsEnIpeiroPezefsas.name
ltx/en_uk_lash/me.m08.d16:meMA.Ode1C12.mode	@ltx/en_uk_lash/miscellanea:misc.Mode6
ltx/en_uk_lash/me.m08.d16:meMA.Ode1C12.ode	@ltx/en_uk_lash/miscellanea:misc.Ode1
ltx/en_uk_lash/me.m08.d16:meMA.Ode1C12.text	The unchanging nature, the most precise definition of the Father, having entered mortal flesh, left behind for us on earth his characteristics when he went back to heaven.
ltx/en_uk_lash/me.m08.d16:meMA.Ode1C13.incipit	By your revered sufferings, O…
ltx/en_uk_lash/me.m08.d16:meMA.Ode1C13.melody	@ltx/en_uk_lash/he.h.m6:heHE.OsEnIpeiroPezefsas.name
ltx/en_uk_lash/me.m08.d16:meMA.Ode1C13.mode	@ltx/en_uk_lash/miscellanea:misc.Mode6
ltx/en_uk_lash/me.m08.d16:meMA.Ode1C13.ode	@ltx/en_uk_lash/miscellanea:misc.Ode1
ltx/en_uk_lash/me.m08.d16:meMA.Ode1C13.text	By your revered sufferings, O Christ, you justified your inheritance, which had been shaken by the deception of the Enemy, making it stable by the representation of your form.
ltx/en_uk_lash/me.m08.d16:meMA.Ode1C1T.incipit	Taking flesh from your pure…
ltx/en_uk_lash/me.m08.d16:meMA.Ode1C1T.melody	@ltx/en_uk_lash/he.h.m6:heHE.OsEnIpeiroPezefsas.name
ltx/en_uk_lash/me.m08.d16:meMA.Ode1C1T.mode	@ltx/en_uk_lash/miscellanea:misc.Mode6
ltx/en_uk_lash/me.m08.d16:meMA.Ode1C1T.ode	@ltx/en_uk_lash/miscellanea:misc.Ode1
ltx/en_uk_lash/me.m08.d16:meMA.Ode1C1T.text	Taking flesh from your pure loins in a manner above nature, O all-blameless, the One who gives being to all mortals became visible, yet not abandoning what he was before.
ltx/en_uk_lash/me.m08.d16:meMA.Ode1C21.greekmelody	@ltx/en_uk_lash/he.h.m4:heHE.AnoixoToStomaMou.greekname
ltx/en_uk_lash/me.m08.d16:meMA.Ode1C21.incipit	…
ltx/en_uk_lash/me.m08.d16:meMA.Ode1C21.melody	@ltx/en_uk_lash/he.h.m4:heHE.AnoixoToStomaMou.name
ltx/en_uk_lash/me.m08.d16:meMA.Ode1C21.mode	@ltx/en_uk_lash/miscellanea:misc.Mode4
ltx/en_uk_lash/me.m08.d16:meMA.Ode1C21.ode	@ltx/en_uk_lash/miscellanea:misc.Ode1
ltx/en_uk_lash/me.m08.d16:meMA.Ode1C21.text	
ltx/en_uk_lash/me.m08.d16:meMA.Ode1C22.incipit	…
ltx/en_uk_lash/me.m08.d16:meMA.Ode1C22.melody	@ltx/en_uk_lash/he.h.m4:heHE.AnoixoToStomaMou.name
ltx/en_uk_lash/me.m08.d16:meMA.Ode1C22.mode	@ltx/en_uk_lash/miscellanea:misc.Mode4
ltx/en_uk_lash/me.m08.d16:meMA.Ode1C22.ode	@ltx/en_uk_lash/miscellanea:misc.Ode1
ltx/en_uk_lash/me.m08.d16:meMA.Ode1C22.text	
ltx/en_uk_lash/me.m08.d16:meMA.Ode1C23.incipit	…
ltx/en_uk_lash/me.m08.d16:meMA.Ode1C23.melody	@ltx/en_uk_lash/he.h.m4:heHE.AnoixoToStomaMou.name
ltx/en_uk_lash/me.m08.d16:meMA.Ode1C23.mode	@ltx/en_uk_lash/miscellanea:misc.Mode4
ltx/en_uk_lash/me.m08.d16:meMA.Ode1C23.ode	@ltx/en_uk_lash/miscellanea:misc.Ode1
ltx/en_uk_lash/me.m08.d16:meMA.Ode1C23.text	
ltx/en_uk_lash/me.m08.d16:meMA.Ode1C2T.incipit	…
ltx/en_uk_lash/me.m08.d16:meMA.Ode1C2T.melody	@ltx/en_uk_lash/he.h.m4:heHE.AnoixoToStomaMou.name
ltx/en_uk_lash/me.m08.d16:meMA.Ode1C2T.mode	@ltx/en_uk_lash/miscellanea:misc.Mode4
ltx/en_uk_lash/me.m08.d16:meMA.Ode1C2T.ode	@ltx/en_uk_lash/miscellanea:misc.Ode1
ltx/en_uk_lash/me.m08.d16:meMA.Ode1C2T.text	
ltx/en_uk_lash/me.m08.d16:meMA.Ode3C11.greekmelody	@ltx/en_uk_lash/he.h.m6:heHE.OukEstinAgios.greekname
ltx/en_uk_lash/me.m08.d16:meMA.Ode3C11.incipit	You wrapped the honoured Church…
ltx/en_uk_lash/me.m08.d16:meMA.Ode3C11.melody	@ltx/en_uk_lash/he.h.m6:heHE.OukEstinAgios.name
ltx/en_uk_lash/me.m08.d16:meMA.Ode3C11.mode	@ltx/en_uk_lash/miscellanea:misc.Mode6
ltx/en_uk_lash/me.m08.d16:meMA.Ode3C11.ode	@ltx/en_uk_lash/miscellanea:misc.Ode3
ltx/en_uk_lash/me.m08.d16:meMA.Ode3C11.text	You wrapped the honoured Church around with raiment, O Saviour, when you moved the royal heart to seek out your likeness as a shield wall.
ltx/en_uk_lash/me.m08.d16:meMA.Ode3C12.incipit	Wishing to strip away things…
ltx/en_uk_lash/me.m08.d16:meMA.Ode3C12.melody	@ltx/en_uk_lash/he.h.m6:heHE.OukEstinAgios.name
ltx/en_uk_lash/me.m08.d16:meMA.Ode3C12.mode	@ltx/en_uk_lash/miscellanea:misc.Mode6
ltx/en_uk_lash/me.m08.d16:meMA.Ode3C12.ode	@ltx/en_uk_lash/miscellanea:misc.Ode3
ltx/en_uk_lash/me.m08.d16:meMA.Ode3C12.text	Wishing to strip away things that are good and diminish them in time, the begetter of envy shamelessly handed them over to polluted hands; but he was confounded, for his reckoning was in vain.
ltx/en_uk_lash/me.m08.d16:meMA.Ode3C13.incipit	David once danced with radiant…
ltx/en_uk_lash/me.m08.d16:meMA.Ode3C13.melody	@ltx/en_uk_lash/he.h.m6:heHE.OukEstinAgios.name
ltx/en_uk_lash/me.m08.d16:meMA.Ode3C13.mode	@ltx/en_uk_lash/miscellanea:misc.Mode6
ltx/en_uk_lash/me.m08.d16:meMA.Ode3C13.ode	@ltx/en_uk_lash/miscellanea:misc.Ode3
ltx/en_uk_lash/me.m08.d16:meMA.Ode3C13.text	David once danced with radiant joy before the holy Ark; and now the one who has gained royal sceptres as his lot is glad to give them greater strength by the divine likeness.
ltx/en_uk_lash/me.m08.d16:meMA.Ode3C1T.incipit	Wishing to cut out from…
ltx/en_uk_lash/me.m08.d16:meMA.Ode3C1T.melody	@ltx/en_uk_lash/he.h.m6:heHE.OukEstinAgios.name
ltx/en_uk_lash/me.m08.d16:meMA.Ode3C1T.mode	@ltx/en_uk_lash/miscellanea:misc.Mode6
ltx/en_uk_lash/me.m08.d16:meMA.Ode3C1T.ode	@ltx/en_uk_lash/miscellanea:misc.Ode3
ltx/en_uk_lash/me.m08.d16:meMA.Ode3C1T.text	Wishing to cut out from its root all the forefather''s natural disobedience, O Virgin, your Son assumed from your womb all that is human.
ltx/en_uk_lash/me.m08.d16:meMA.Ode3C21.greekmelody	@ltx/en_uk_lash/he.h.m4:heHE.TousSousYmnologous.greekname
ltx/en_uk_lash/me.m08.d16:meMA.Ode3C21.incipit	…
ltx/en_uk_lash/me.m08.d16:meMA.Ode3C21.melody	@ltx/en_uk_lash/he.h.m4:heHE.TousSousYmnologous.name
ltx/en_uk_lash/me.m08.d16:meMA.Ode3C21.mode	@ltx/en_uk_lash/miscellanea:misc.Mode4
ltx/en_uk_lash/me.m08.d16:meMA.Ode3C21.ode	@ltx/en_uk_lash/miscellanea:misc.Ode3
ltx/en_uk_lash/me.m08.d16:meMA.Ode3C21.text	
ltx/en_uk_lash/me.m08.d16:meMA.Ode3C22.incipit	…
ltx/en_uk_lash/me.m08.d16:meMA.Ode3C22.melody	@ltx/en_uk_lash/he.h.m4:heHE.TousSousYmnologous.name
ltx/en_uk_lash/me.m08.d16:meMA.Ode3C22.mode	@ltx/en_uk_lash/miscellanea:misc.Mode4
ltx/en_uk_lash/me.m08.d16:meMA.Ode3C22.ode	@ltx/en_uk_lash/miscellanea:misc.Ode3
ltx/en_uk_lash/me.m08.d16:meMA.Ode3C22.text	
ltx/en_uk_lash/me.m08.d16:meMA.Ode3C23.incipit	…
ltx/en_uk_lash/me.m08.d16:meMA.Ode3C23.melody	@ltx/en_uk_lash/he.h.m4:heHE.TousSousYmnologous.name
ltx/en_uk_lash/me.m08.d16:meMA.Ode3C23.mode	@ltx/en_uk_lash/miscellanea:misc.Mode4
ltx/en_uk_lash/me.m08.d16:meMA.Ode3C23.ode	@ltx/en_uk_lash/miscellanea:misc.Ode3
ltx/en_uk_lash/me.m08.d16:meMA.Ode3C23.text	
ltx/en_uk_lash/me.m08.d16:meMA.Ode3C2T.incipit	…
ltx/en_uk_lash/me.m08.d16:meMA.Ode3C2T.melody	@ltx/en_uk_lash/he.h.m4:heHE.TousSousYmnologous.name
ltx/en_uk_lash/me.m08.d16:meMA.Ode3C2T.mode	@ltx/en_uk_lash/miscellanea:misc.Mode4
ltx/en_uk_lash/me.m08.d16:meMA.Ode3C2T.ode	@ltx/en_uk_lash/miscellanea:misc.Ode3
ltx/en_uk_lash/me.m08.d16:meMA.Ode3C2T.text	
ltx/en_uk_lash/me.m08.d16:meMA.Ode3H.greekmelody	@ltx/en_uk_lash/he.h.m4:heHE.TousSousYmnologous.greekname
ltx/en_uk_lash/me.m08.d16:meMA.Ode3H.incipit	@ltx/en_uk_lash/he.h.m4:heHE.TousSousYmnologous.incipit
ltx/en_uk_lash/me.m08.d16:meMA.Ode3H.melody	@ltx/en_uk_lash/he.h.m4:heHE.TousSousYmnologous.melody
ltx/en_uk_lash/me.m08.d16:meMA.Ode3H.mode	@ltx/en_uk_lash/miscellanea:misc.Mode4
ltx/en_uk_lash/me.m08.d16:meMA.Ode3H.ode	@ltx/en_uk_lash/miscellanea:misc.Ode3
ltx/en_uk_lash/me.m08.d16:meMA.Ode3H.text	@ltx/en_uk_lash/he.h.m4:heHE.TousSousYmnologous.text
ltx/en_uk_lash/me.m08.d16:meMA.Ode3Kathisma1.greekmelody	@ltx/en_uk_lash/he.a.m1:heAU.TonTafonSouSotir.greekname
ltx/en_uk_lash/me.m08.d16:meMA.Ode3Kathisma1.incipit	The king of Edessa, recognising…
ltx/en_uk_lash/me.m08.d16:meMA.Ode3Kathisma1.melody	@ltx/en_uk_lash/he.a.m1:heAU.TonTafonSouSotir.notmetered
ltx/en_uk_lash/me.m08.d16:meMA.Ode3Kathisma1.mode	@ltx/en_uk_lash/miscellanea:misc.Mode1
ltx/en_uk_lash/me.m08.d16:meMA.Ode3Kathisma1.text	The king of Edessa, recognising you as King of all things, who do not offer sceptre and army, but with a word multitudes of wonders, implored you, the God-man, to come to him. But seeing your impress on the towel he cried out, ''You are Lord and God''.
ltx/en_uk_lash/me.m08.d16:meMA.Ode3Kathisma2.greekmelody	@ltx/en_uk_lash/he.a.m8:heAU.TinSofianKaiLogon.greekname
ltx/en_uk_lash/me.m08.d16:meMA.Ode3Kathisma2.incipit	…
ltx/en_uk_lash/me.m08.d16:meMA.Ode3Kathisma2.melody	@ltx/en_uk_lash/he.a.m8:heAU.TinSofianKaiLogon.notmetered
ltx/en_uk_lash/me.m08.d16:meMA.Ode3Kathisma2.mode	@ltx/en_uk_lash/miscellanea:misc.Mode8
ltx/en_uk_lash/me.m08.d16:meMA.Ode3Kathisma2.text	
ltx/en_uk_lash/me.m08.d16:meMA.Ode3Kathisma3.greekmelody	@ltx/en_uk_lash/he.a.m8:heAU.TinSofianKaiLogon.greekname
ltx/en_uk_lash/me.m08.d16:meMA.Ode3Kathisma3.incipit	O Virgin, who conceived God…
ltx/en_uk_lash/me.m08.d16:meMA.Ode3Kathisma3.melody	@ltx/en_uk_lash/he.a.m8:heAU.TinSofianKaiLogon.notmetered
ltx/en_uk_lash/me.m08.d16:meMA.Ode3Kathisma3.mode	@ltx/en_uk_lash/miscellanea:misc.Mode8
ltx/en_uk_lash/me.m08.d16:meMA.Ode3Kathisma3.text	O Virgin, who conceived God without seed and without corruption gave birth to him incarnate, you have been clothed in the new incorruption of the Spirit; for as Mother of Life and Queen of all things you have passed over to immaterial life. Therefore fittingly and truly you have been revealed as a cloud pouring down waters of life for us. All-blameless Mother of God, intercede with your Son and God to grant forgiveness of faults to those who with faith bow down before your divine Falling Asleep.
ltx/en_uk_lash/me.m08.d16:meMA.Ode4C11.greekmelody	@ltx/en_uk_lash/he.h.m6:heHE.ChristosMouDynamis.greekname
ltx/en_uk_lash/me.m08.d16:meMA.Ode4C11.incipit	As it leaves the city…
ltx/en_uk_lash/me.m08.d16:meMA.Ode4C11.melody	@ltx/en_uk_lash/he.h.m6:heHE.ChristosMouDynamis.name
ltx/en_uk_lash/me.m08.d16:meMA.Ode4C11.mode	@ltx/en_uk_lash/miscellanea:misc.Mode6
ltx/en_uk_lash/me.m08.d16:meMA.Ode4C11.ode	@ltx/en_uk_lash/miscellanea:misc.Ode4
ltx/en_uk_lash/me.m08.d16:meMA.Ode4C11.text	As it leaves the city in the East and draws near ours, the King, wise in God, now receives your sacred napkin.
ltx/en_uk_lash/me.m08.d16:meMA.Ode4C12.incipit	Sweet is the sun, which…
ltx/en_uk_lash/me.m08.d16:meMA.Ode4C12.melody	@ltx/en_uk_lash/he.h.m6:heHE.ChristosMouDynamis.name
ltx/en_uk_lash/me.m08.d16:meMA.Ode4C12.mode	@ltx/en_uk_lash/miscellanea:misc.Mode6
ltx/en_uk_lash/me.m08.d16:meMA.Ode4C12.ode	@ltx/en_uk_lash/miscellanea:misc.Ode4
ltx/en_uk_lash/me.m08.d16:meMA.Ode4C12.text	Sweet is the sun, which appears to the eyes; but sweeter the appearance, O Christ, of your likeness; for the one gives sensible light, the other spiritual.
ltx/en_uk_lash/me.m08.d16:meMA.Ode4C13.incipit	Strength deserted the right hand…
ltx/en_uk_lash/me.m08.d16:meMA.Ode4C13.melody	@ltx/en_uk_lash/he.h.m6:heHE.ChristosMouDynamis.name
ltx/en_uk_lash/me.m08.d16:meMA.Ode4C13.mode	@ltx/en_uk_lash/miscellanea:misc.Mode6
ltx/en_uk_lash/me.m08.d16:meMA.Ode4C13.ode	@ltx/en_uk_lash/miscellanea:misc.Ode4
ltx/en_uk_lash/me.m08.d16:meMA.Ode4C13.text	Strength deserted the right hand of the Ishmaelite, for with the weapon of the Cross the stern King cast all its defence to the ground.
ltx/en_uk_lash/me.m08.d16:meMA.Ode4C1T.incipit	Intercede we beg, O most…
ltx/en_uk_lash/me.m08.d16:meMA.Ode4C1T.melody	@ltx/en_uk_lash/he.h.m6:heHE.ChristosMouDynamis.name
ltx/en_uk_lash/me.m08.d16:meMA.Ode4C1T.mode	@ltx/en_uk_lash/miscellanea:misc.Mode6
ltx/en_uk_lash/me.m08.d16:meMA.Ode4C1T.ode	@ltx/en_uk_lash/miscellanea:misc.Ode4
ltx/en_uk_lash/me.m08.d16:meMA.Ode4C1T.text	Intercede we beg, O most pure, that your city may be guarded unharmed from barbarous assault; for see what the boasters devise against her.
ltx/en_uk_lash/me.m08.d16:meMA.Ode4C21.greekmelody	@ltx/en_uk_lash/he.h.m4:heHE.TinAnexichniaston.greekname
ltx/en_uk_lash/me.m08.d16:meMA.Ode4C21.incipit	…
ltx/en_uk_lash/me.m08.d16:meMA.Ode4C21.melody	@ltx/en_uk_lash/he.h.m4:heHE.TinAnexichniaston.name
ltx/en_uk_lash/me.m08.d16:meMA.Ode4C21.mode	@ltx/en_uk_lash/miscellanea:misc.Mode4
ltx/en_uk_lash/me.m08.d16:meMA.Ode4C21.ode	@ltx/en_uk_lash/miscellanea:misc.Ode4
ltx/en_uk_lash/me.m08.d16:meMA.Ode4C21.text	
ltx/en_uk_lash/me.m08.d16:meMA.Ode4C22.incipit	…
ltx/en_uk_lash/me.m08.d16:meMA.Ode4C22.melody	@ltx/en_uk_lash/he.h.m4:heHE.TinAnexichniaston.name
ltx/en_uk_lash/me.m08.d16:meMA.Ode4C22.mode	@ltx/en_uk_lash/miscellanea:misc.Mode4
ltx/en_uk_lash/me.m08.d16:meMA.Ode4C22.ode	@ltx/en_uk_lash/miscellanea:misc.Ode4
ltx/en_uk_lash/me.m08.d16:meMA.Ode4C22.text	
ltx/en_uk_lash/me.m08.d16:meMA.Ode4C23.incipit	…
ltx/en_uk_lash/me.m08.d16:meMA.Ode4C23.melody	@ltx/en_uk_lash/he.h.m4:heHE.TinAnexichniaston.name
ltx/en_uk_lash/me.m08.d16:meMA.Ode4C23.mode	@ltx/en_uk_lash/miscellanea:misc.Mode4
ltx/en_uk_lash/me.m08.d16:meMA.Ode4C23.ode	@ltx/en_uk_lash/miscellanea:misc.Ode4
ltx/en_uk_lash/me.m08.d16:meMA.Ode4C23.text	
ltx/en_uk_lash/me.m08.d16:meMA.Ode4C2T.incipit	…
ltx/en_uk_lash/me.m08.d16:meMA.Ode4C2T.melody	@ltx/en_uk_lash/he.h.m4:heHE.TinAnexichniaston.name
ltx/en_uk_lash/me.m08.d16:meMA.Ode4C2T.mode	@ltx/en_uk_lash/miscellanea:misc.Mode4
ltx/en_uk_lash/me.m08.d16:meMA.Ode4C2T.ode	@ltx/en_uk_lash/miscellanea:misc.Ode4
ltx/en_uk_lash/me.m08.d16:meMA.Ode4C2T.text	
ltx/en_uk_lash/me.m08.d16:meMA.Ode5C11.greekmelody	@ltx/en_uk_lash/he.h.m6:heHE.ToTheioFengeiSou.greekname
ltx/en_uk_lash/me.m08.d16:meMA.Ode5C11.incipit	Small was the city that…
ltx/en_uk_lash/me.m08.d16:meMA.Ode5C11.melody	@ltx/en_uk_lash/he.h.m6:heHE.ToTheioFengeiSou.name
ltx/en_uk_lash/me.m08.d16:meMA.Ode5C11.mode	@ltx/en_uk_lash/miscellanea:misc.Mode6
ltx/en_uk_lash/me.m08.d16:meMA.Ode5C11.ode	@ltx/en_uk_lash/miscellanea:misc.Ode5
ltx/en_uk_lash/me.m08.d16:meMA.Ode5C11.text	Small was the city that first prepared your reception, O Christ, which the coming of Thaddaios set free from diseases, the writing of your hand and the depiction of your face.
ltx/en_uk_lash/me.m08.d16:meMA.Ode5C12.incipit	The gifts of your graces…
ltx/en_uk_lash/me.m08.d16:meMA.Ode5C12.melody	@ltx/en_uk_lash/he.h.m6:heHE.ToTheioFengeiSou.name
ltx/en_uk_lash/me.m08.d16:meMA.Ode5C12.mode	@ltx/en_uk_lash/miscellanea:misc.Mode6
ltx/en_uk_lash/me.m08.d16:meMA.Ode5C12.ode	@ltx/en_uk_lash/miscellanea:misc.Ode5
ltx/en_uk_lash/me.m08.d16:meMA.Ode5C12.text	The gifts of your graces have been multiplied, O Christ; for the things which before Edessa held in its bosom as its boast, New Rome receives with rejoicing.
ltx/en_uk_lash/me.m08.d16:meMA.Ode5C1T.incipit	Halt the massed assaults of…
ltx/en_uk_lash/me.m08.d16:meMA.Ode5C1T.melody	@ltx/en_uk_lash/he.h.m6:heHE.ToTheioFengeiSou.name
ltx/en_uk_lash/me.m08.d16:meMA.Ode5C1T.mode	@ltx/en_uk_lash/miscellanea:misc.Mode6
ltx/en_uk_lash/me.m08.d16:meMA.Ode5C1T.ode	@ltx/en_uk_lash/miscellanea:misc.Ode5
ltx/en_uk_lash/me.m08.d16:meMA.Ode5C1T.text	Halt the massed assaults of our enemies, O Virgin; destroy their devices; help your inheritance; for you see that we have been beset by evils.
ltx/en_uk_lash/me.m08.d16:meMA.Ode5C21.greekmelody	@ltx/en_uk_lash/he.h.m4:heHE.ExestiTaSympanta.greekname
ltx/en_uk_lash/me.m08.d16:meMA.Ode5C21.incipit	…
ltx/en_uk_lash/me.m08.d16:meMA.Ode5C21.melody	@ltx/en_uk_lash/he.h.m4:heHE.ExestiTaSympanta.name
ltx/en_uk_lash/me.m08.d16:meMA.Ode5C21.mode	@ltx/en_uk_lash/miscellanea:misc.Mode4
ltx/en_uk_lash/me.m08.d16:meMA.Ode5C21.ode	@ltx/en_uk_lash/miscellanea:misc.Ode5
ltx/en_uk_lash/me.m08.d16:meMA.Ode5C21.text	
ltx/en_uk_lash/me.m08.d16:meMA.Ode5C22.incipit	…
ltx/en_uk_lash/me.m08.d16:meMA.Ode5C22.melody	@ltx/en_uk_lash/he.h.m4:heHE.ExestiTaSympanta.name
ltx/en_uk_lash/me.m08.d16:meMA.Ode5C22.mode	@ltx/en_uk_lash/miscellanea:misc.Mode4
ltx/en_uk_lash/me.m08.d16:meMA.Ode5C22.ode	@ltx/en_uk_lash/miscellanea:misc.Ode5
ltx/en_uk_lash/me.m08.d16:meMA.Ode5C22.text	
ltx/en_uk_lash/me.m08.d16:meMA.Ode5C23.incipit	…
ltx/en_uk_lash/me.m08.d16:meMA.Ode5C23.melody	@ltx/en_uk_lash/he.h.m4:heHE.ExestiTaSympanta.name
ltx/en_uk_lash/me.m08.d16:meMA.Ode5C23.mode	@ltx/en_uk_lash/miscellanea:misc.Mode4
ltx/en_uk_lash/me.m08.d16:meMA.Ode5C23.ode	@ltx/en_uk_lash/miscellanea:misc.Ode5
ltx/en_uk_lash/me.m08.d16:meMA.Ode5C23.text	
ltx/en_uk_lash/me.m08.d16:meMA.Ode5C2T.incipit	…
ltx/en_uk_lash/me.m08.d16:meMA.Ode5C2T.melody	@ltx/en_uk_lash/he.h.m4:heHE.ExestiTaSympanta.name
ltx/en_uk_lash/me.m08.d16:meMA.Ode5C2T.mode	@ltx/en_uk_lash/miscellanea:misc.Mode4
ltx/en_uk_lash/me.m08.d16:meMA.Ode5C2T.ode	@ltx/en_uk_lash/miscellanea:misc.Ode5
ltx/en_uk_lash/me.m08.d16:meMA.Ode5C2T.text	
ltx/en_uk_lash/me.m08.d16:meMA.Ode6C11.greekmelody	@ltx/en_uk_lash/he.h.m6:heHE.SyneschethiAllOuKateschethi.greekname
ltx/en_uk_lash/me.m08.d16:meMA.Ode6C11.incipit	You were fairer in beauty…
ltx/en_uk_lash/me.m08.d16:meMA.Ode6C11.melody	@ltx/en_uk_lash/he.h.m6:heHE.SyneschethiAllOuKateschethi.name
ltx/en_uk_lash/me.m08.d16:meMA.Ode6C11.mode	@ltx/en_uk_lash/miscellanea:misc.Mode6
ltx/en_uk_lash/me.m08.d16:meMA.Ode6C11.ode	@ltx/en_uk_lash/miscellanea:misc.Ode6
ltx/en_uk_lash/me.m08.d16:meMA.Ode6C11.text	You were fairer in beauty beyond all the sons of mortals, O Saviour; for though you had neither form nor beauty at the moment of your passion, yet you truly enlightened all things, and the sight of your form is revealed. Its likeness, imprinted on a cloth, has been granted to us.
ltx/en_uk_lash/me.m08.d16:meMA.Ode6C12.incipit	The multitude of the strength…
ltx/en_uk_lash/me.m08.d16:meMA.Ode6C12.melody	@ltx/en_uk_lash/he.h.m6:heHE.SyneschethiAllOuKateschethi.name
ltx/en_uk_lash/me.m08.d16:meMA.Ode6C12.mode	@ltx/en_uk_lash/miscellanea:misc.Mode6
ltx/en_uk_lash/me.m08.d16:meMA.Ode6C12.ode	@ltx/en_uk_lash/miscellanea:misc.Ode6
ltx/en_uk_lash/me.m08.d16:meMA.Ode6C12.text	The multitude of the strength of the Hagarenes has been removed and has now given, like an Ark from among foreigners to the new Israel, your imprint on a towel, O Christ, and your glory which it had also gained; for it is not right for Holy Things to be thrown aside.
ltx/en_uk_lash/me.m08.d16:meMA.Ode6C1T.incipit	Just now I was fainting…
ltx/en_uk_lash/me.m08.d16:meMA.Ode6C1T.melody	@ltx/en_uk_lash/he.h.m6:heHE.SyneschethiAllOuKateschethi.name
ltx/en_uk_lash/me.m08.d16:meMA.Ode6C1T.mode	@ltx/en_uk_lash/miscellanea:misc.Mode6
ltx/en_uk_lash/me.m08.d16:meMA.Ode6C1T.ode	@ltx/en_uk_lash/miscellanea:misc.Ode6
ltx/en_uk_lash/me.m08.d16:meMA.Ode6C1T.text	Just now I was fainting, O Saviour, from the strength from your hand; but take your blows from me at the prayers of her who bore you without knowing man, O Word, and do not abandon me to be drowned by the tempest of sin and suffer dread nausea, O only Redeemer.
ltx/en_uk_lash/me.m08.d16:meMA.Ode6C21.greekmelody	@ltx/en_uk_lash/he.h.m4:heHE.TinTheianTaftin.greekname
ltx/en_uk_lash/me.m08.d16:meMA.Ode6C21.incipit	…
ltx/en_uk_lash/me.m08.d16:meMA.Ode6C21.melody	@ltx/en_uk_lash/he.h.m4:heHE.TinTheianTaftin.name
ltx/en_uk_lash/me.m08.d16:meMA.Ode6C21.mode	@ltx/en_uk_lash/miscellanea:misc.Mode4
ltx/en_uk_lash/me.m08.d16:meMA.Ode6C21.ode	@ltx/en_uk_lash/miscellanea:misc.Ode6
ltx/en_uk_lash/me.m08.d16:meMA.Ode6C21.text	
ltx/en_uk_lash/me.m08.d16:meMA.Ode6C22.incipit	…
ltx/en_uk_lash/me.m08.d16:meMA.Ode6C22.melody	@ltx/en_uk_lash/he.h.m4:heHE.TinTheianTaftin.name
ltx/en_uk_lash/me.m08.d16:meMA.Ode6C22.mode	@ltx/en_uk_lash/miscellanea:misc.Mode4
ltx/en_uk_lash/me.m08.d16:meMA.Ode6C22.ode	@ltx/en_uk_lash/miscellanea:misc.Ode6
ltx/en_uk_lash/me.m08.d16:meMA.Ode6C22.text	
ltx/en_uk_lash/me.m08.d16:meMA.Ode6C23.incipit	…
ltx/en_uk_lash/me.m08.d16:meMA.Ode6C23.melody	@ltx/en_uk_lash/he.h.m4:heHE.TinTheianTaftin.name
ltx/en_uk_lash/me.m08.d16:meMA.Ode6C23.mode	@ltx/en_uk_lash/miscellanea:misc.Mode4
ltx/en_uk_lash/me.m08.d16:meMA.Ode6C23.ode	@ltx/en_uk_lash/miscellanea:misc.Ode6
ltx/en_uk_lash/me.m08.d16:meMA.Ode6C23.text	
ltx/en_uk_lash/me.m08.d16:meMA.Ode6C2T.incipit	…
ltx/en_uk_lash/me.m08.d16:meMA.Ode6C2T.melody	@ltx/en_uk_lash/he.h.m4:heHE.TinTheianTaftin.name
ltx/en_uk_lash/me.m08.d16:meMA.Ode6C2T.mode	@ltx/en_uk_lash/miscellanea:misc.Mode4
ltx/en_uk_lash/me.m08.d16:meMA.Ode6C2T.ode	@ltx/en_uk_lash/miscellanea:misc.Ode6
ltx/en_uk_lash/me.m08.d16:meMA.Ode6C2T.text	
ltx/en_uk_lash/me.m08.d16:meMA.Ode6H.greekmelody	@ltx/en_uk_lash/he.h.m4:heHE.TinTheianTaftin.greekname
ltx/en_uk_lash/me.m08.d16:meMA.Ode6H.incipit	@ltx/en_uk_lash/he.h.m4:heHE.TinTheianTaftin.incipit
ltx/en_uk_lash/me.m08.d16:meMA.Ode6H.melody	@ltx/en_uk_lash/he.h.m4:heHE.TinTheianTaftin.melody
ltx/en_uk_lash/me.m08.d16:meMA.Ode6H.mode	@ltx/en_uk_lash/miscellanea:misc.Mode4
ltx/en_uk_lash/me.m08.d16:meMA.Ode6H.ode	@ltx/en_uk_lash/miscellanea:misc.Ode6
ltx/en_uk_lash/me.m08.d16:meMA.Ode6H.text	@ltx/en_uk_lash/he.h.m4:heHE.TinTheianTaftin.text
ltx/en_uk_lash/me.m08.d16:meMA.Ode7C11.greekmelody	@ltx/en_uk_lash/he.h.m6:heHE.OiPaidesEnVavyloni.greekname
ltx/en_uk_lash/me.m08.d16:meMA.Ode7C11.incipit	O Word of God, when…
ltx/en_uk_lash/me.m08.d16:meMA.Ode7C11.melody	@ltx/en_uk_lash/he.h.m6:heHE.OiPaidesEnVavyloni.name
ltx/en_uk_lash/me.m08.d16:meMA.Ode7C11.mode	@ltx/en_uk_lash/miscellanea:misc.Mode6
ltx/en_uk_lash/me.m08.d16:meMA.Ode7C11.ode	@ltx/en_uk_lash/miscellanea:misc.Ode7
ltx/en_uk_lash/me.m08.d16:meMA.Ode7C11.text	O Word of God, when you dwelt on earth you drove out every disease with a word; but returning to your Father''s throne you heal our diseases through your Imprint.
ltx/en_uk_lash/me.m08.d16:meMA.Ode7C12.incipit	The One who created all…
ltx/en_uk_lash/me.m08.d16:meMA.Ode7C12.melody	@ltx/en_uk_lash/he.h.m6:heHE.OiPaidesEnVavyloni.name
ltx/en_uk_lash/me.m08.d16:meMA.Ode7C12.mode	@ltx/en_uk_lash/miscellanea:misc.Mode6
ltx/en_uk_lash/me.m08.d16:meMA.Ode7C12.ode	@ltx/en_uk_lash/miscellanea:misc.Ode7
ltx/en_uk_lash/me.m08.d16:meMA.Ode7C12.text	The One who created all things by a word, and who received a form that was not his, has left behind for us visible appearances of his own form. As we receive them with gladness, we rejoice.
ltx/en_uk_lash/me.m08.d16:meMA.Ode7C13.incipit	The faithful king, seeking with…
ltx/en_uk_lash/me.m08.d16:meMA.Ode7C13.melody	@ltx/en_uk_lash/he.h.m6:heHE.OiPaidesEnVavyloni.name
ltx/en_uk_lash/me.m08.d16:meMA.Ode7C13.mode	@ltx/en_uk_lash/miscellanea:misc.Mode6
ltx/en_uk_lash/me.m08.d16:meMA.Ode7C13.ode	@ltx/en_uk_lash/miscellanea:misc.Ode7
ltx/en_uk_lash/me.m08.d16:meMA.Ode7C13.text	The faithful king, seeking with his whole soul an impression of your form, Lord, as he sought so he found, discovering the fitting fulfilment of his godly longing.
ltx/en_uk_lash/me.m08.d16:meMA.Ode7C1T.incipit	By your conceiving humanity was…
ltx/en_uk_lash/me.m08.d16:meMA.Ode7C1T.melody	@ltx/en_uk_lash/he.h.m6:heHE.OiPaidesEnVavyloni.name
ltx/en_uk_lash/me.m08.d16:meMA.Ode7C1T.mode	@ltx/en_uk_lash/miscellanea:misc.Mode6
ltx/en_uk_lash/me.m08.d16:meMA.Ode7C1T.ode	@ltx/en_uk_lash/miscellanea:misc.Ode7
ltx/en_uk_lash/me.m08.d16:meMA.Ode7C1T.text	By your conceiving humanity was freed from the ancient condemnation; for God, having found you alone to be wider than the heavens, O All-blameless, made you his dwelling.
ltx/en_uk_lash/me.m08.d16:meMA.Ode7C21.greekmelody	@ltx/en_uk_lash/he.h.m4:heHE.OukElatrefsan.greekname
ltx/en_uk_lash/me.m08.d16:meMA.Ode7C21.incipit	…
ltx/en_uk_lash/me.m08.d16:meMA.Ode7C21.melody	@ltx/en_uk_lash/he.h.m4:heHE.OukElatrefsan.name
ltx/en_uk_lash/me.m08.d16:meMA.Ode7C21.mode	@ltx/en_uk_lash/miscellanea:misc.Mode4
ltx/en_uk_lash/me.m08.d16:meMA.Ode7C21.ode	@ltx/en_uk_lash/miscellanea:misc.Ode7
ltx/en_uk_lash/me.m08.d16:meMA.Ode7C21.text	
ltx/en_uk_lash/me.m08.d16:meMA.Ode7C22.incipit	…
ltx/en_uk_lash/me.m08.d16:meMA.Ode7C22.melody	@ltx/en_uk_lash/he.h.m4:heHE.OukElatrefsan.name
ltx/en_uk_lash/me.m08.d16:meMA.Ode7C22.mode	@ltx/en_uk_lash/miscellanea:misc.Mode4
ltx/en_uk_lash/me.m08.d16:meMA.Ode7C22.ode	@ltx/en_uk_lash/miscellanea:misc.Ode7
ltx/en_uk_lash/me.m08.d16:meMA.Ode7C22.text	
ltx/en_uk_lash/me.m08.d16:meMA.Ode7C23.incipit	…
ltx/en_uk_lash/me.m08.d16:meMA.Ode7C23.melody	@ltx/en_uk_lash/he.h.m4:heHE.OukElatrefsan.name
ltx/en_uk_lash/me.m08.d16:meMA.Ode7C23.mode	@ltx/en_uk_lash/miscellanea:misc.Mode4
ltx/en_uk_lash/me.m08.d16:meMA.Ode7C23.ode	@ltx/en_uk_lash/miscellanea:misc.Ode7
ltx/en_uk_lash/me.m08.d16:meMA.Ode7C23.text	
ltx/en_uk_lash/me.m08.d16:meMA.Ode7C2T.incipit	…
ltx/en_uk_lash/me.m08.d16:meMA.Ode7C2T.melody	@ltx/en_uk_lash/he.h.m4:heHE.OukElatrefsan.name
ltx/en_uk_lash/me.m08.d16:meMA.Ode7C2T.mode	@ltx/en_uk_lash/miscellanea:misc.Mode4
ltx/en_uk_lash/me.m08.d16:meMA.Ode7C2T.ode	@ltx/en_uk_lash/miscellanea:misc.Ode7
ltx/en_uk_lash/me.m08.d16:meMA.Ode7C2T.text	
ltx/en_uk_lash/me.m08.d16:meMA.Ode8C11.greekmelody	@ltx/en_uk_lash/he.h.m6:heHE.NomonPatroon.greekname
ltx/en_uk_lash/me.m08.d16:meMA.Ode8C11.incipit	As in a vision, the…
ltx/en_uk_lash/me.m08.d16:meMA.Ode8C11.melody	@ltx/en_uk_lash/he.h.m6:heHE.NomonPatroon.name
ltx/en_uk_lash/me.m08.d16:meMA.Ode8C11.mode	@ltx/en_uk_lash/miscellanea:misc.Mode6
ltx/en_uk_lash/me.m08.d16:meMA.Ode8C11.ode	@ltx/en_uk_lash/miscellanea:misc.Ode8
ltx/en_uk_lash/me.m08.d16:meMA.Ode8C11.text	As in a vision, the whole chosen people of the city, hoping that you, the Lord, will make your home there, gives you a wondrous welcome, leading out a choir of High Priests, carried on whose shoulders and entering your own inheritance, O Compassionate, you came to rest in your Mother''s shrine.
ltx/en_uk_lash/me.m08.d16:meMA.Ode8C12.incipit	The mouths of innocent children…
ltx/en_uk_lash/me.m08.d16:meMA.Ode8C12.melody	@ltx/en_uk_lash/he.h.m6:heHE.NomonPatroon.name
ltx/en_uk_lash/me.m08.d16:meMA.Ode8C12.mode	@ltx/en_uk_lash/miscellanea:misc.Mode6
ltx/en_uk_lash/me.m08.d16:meMA.Ode8C12.ode	@ltx/en_uk_lash/miscellanea:misc.Ode8
ltx/en_uk_lash/me.m08.d16:meMA.Ode8C12.text	The mouths of innocent children sang your praise as you journeyed to the city that slew the Prophets; but the lawless synagogue of the Hebrews armed a murderous hand and raged against you. But now the lawful city, pouring out with all its people because it sees you, the Creator, rejoices as it receives the imprint of your form.
ltx/en_uk_lash/me.m08.d16:meMA.Ode8C1T.incipit	The Angel of Great Counsel…
ltx/en_uk_lash/me.m08.d16:meMA.Ode8C1T.melody	@ltx/en_uk_lash/he.h.m6:heHE.NomonPatroon.name
ltx/en_uk_lash/me.m08.d16:meMA.Ode8C1T.mode	@ltx/en_uk_lash/miscellanea:misc.Mode6
ltx/en_uk_lash/me.m08.d16:meMA.Ode8C1T.ode	@ltx/en_uk_lash/miscellanea:misc.Ode8
ltx/en_uk_lash/me.m08.d16:meMA.Ode8C1T.text	The Angel of Great Counsel of the Father, having chosen to put on flesh, was brought to completion in your womb, O All-pure. He declared you to be his Mother below, O holy one, and renewed corrupted mortal nature. We bless him as Creator and highly exalt him to all the ages.
ltx/en_uk_lash/me.m08.d16:meMA.Ode8C21.greekmelody	@ltx/en_uk_lash/he.h.m4:heHE.PaidasEvageis.greekname
ltx/en_uk_lash/me.m08.d16:meMA.Ode8C21.incipit	…
ltx/en_uk_lash/me.m08.d16:meMA.Ode8C21.melody	@ltx/en_uk_lash/he.h.m4:heHE.PaidasEvageis.name
ltx/en_uk_lash/me.m08.d16:meMA.Ode8C21.mode	@ltx/en_uk_lash/miscellanea:misc.Mode4
ltx/en_uk_lash/me.m08.d16:meMA.Ode8C21.ode	@ltx/en_uk_lash/miscellanea:misc.Ode8
ltx/en_uk_lash/me.m08.d16:meMA.Ode8C21.text	
ltx/en_uk_lash/me.m08.d16:meMA.Ode8C22.incipit	…
ltx/en_uk_lash/me.m08.d16:meMA.Ode8C22.melody	@ltx/en_uk_lash/he.h.m4:heHE.PaidasEvageis.name
ltx/en_uk_lash/me.m08.d16:meMA.Ode8C22.mode	@ltx/en_uk_lash/miscellanea:misc.Mode4
ltx/en_uk_lash/me.m08.d16:meMA.Ode8C22.ode	@ltx/en_uk_lash/miscellanea:misc.Ode8
ltx/en_uk_lash/me.m08.d16:meMA.Ode8C22.text	
ltx/en_uk_lash/me.m08.d16:meMA.Ode8C23.incipit	…
ltx/en_uk_lash/me.m08.d16:meMA.Ode8C23.melody	@ltx/en_uk_lash/he.h.m4:heHE.PaidasEvageis.name
ltx/en_uk_lash/me.m08.d16:meMA.Ode8C23.mode	@ltx/en_uk_lash/miscellanea:misc.Mode4
ltx/en_uk_lash/me.m08.d16:meMA.Ode8C23.ode	@ltx/en_uk_lash/miscellanea:misc.Ode8
ltx/en_uk_lash/me.m08.d16:meMA.Ode8C23.text	
ltx/en_uk_lash/me.m08.d16:meMA.Ode8C2T.incipit	…
ltx/en_uk_lash/me.m08.d16:meMA.Ode8C2T.melody	@ltx/en_uk_lash/he.h.m4:heHE.PaidasEvageis.name
ltx/en_uk_lash/me.m08.d16:meMA.Ode8C2T.mode	@ltx/en_uk_lash/miscellanea:misc.Mode4
ltx/en_uk_lash/me.m08.d16:meMA.Ode8C2T.ode	@ltx/en_uk_lash/miscellanea:misc.Ode8
ltx/en_uk_lash/me.m08.d16:meMA.Ode8C2T.text	
ltx/en_uk_lash/me.m08.d16:meMA.Ode8H.greekmelody	@ltx/en_uk_lash/he.h.m4:heHE.PaidasEvageis.greekname
ltx/en_uk_lash/me.m08.d16:meMA.Ode8H.incipit	@ltx/en_uk_lash/he.h.m4:heHE.PaidasEvageis.incipit
ltx/en_uk_lash/me.m08.d16:meMA.Ode8H.melody	@ltx/en_uk_lash/he.h.m4:heHE.PaidasEvageis.melody
ltx/en_uk_lash/me.m08.d16:meMA.Ode8H.mode	@ltx/en_uk_lash/miscellanea:misc.Mode4
ltx/en_uk_lash/me.m08.d16:meMA.Ode8H.ode	@ltx/en_uk_lash/miscellanea:misc.Ode8
ltx/en_uk_lash/me.m08.d16:meMA.Ode8H.text	@ltx/en_uk_lash/he.h.m4:heHE.PaidasEvageis.text
ltx/en_uk_lash/me.m08.d16:meMA.Ode9C11.greekmelody	@ltx/en_uk_lash/he.h.m6:heHE.XeniasDespotikis.greekname
ltx/en_uk_lash/me.m08.d16:meMA.Ode9C11.incipit	A people without understanding raved…
ltx/en_uk_lash/me.m08.d16:meMA.Ode9C11.melody	@ltx/en_uk_lash/he.h.m6:heHE.XeniasDespotikis.name
ltx/en_uk_lash/me.m08.d16:meMA.Ode9C11.mode	@ltx/en_uk_lash/miscellanea:misc.Mode6
ltx/en_uk_lash/me.m08.d16:meMA.Ode9C11.ode	@ltx/en_uk_lash/miscellanea:misc.Ode9
ltx/en_uk_lash/me.m08.d16:meMA.Ode9C11.text	A people without understanding raved against you, O Saviour, and in return for kindness shamelessly threatened dreadful deeds against you; but we, who had been thrust far away, were adopted as children by your sufferings, O Saviour.
ltx/en_uk_lash/me.m08.d16:meMA.Ode9C12.incipit	Grant help against their enemies…
ltx/en_uk_lash/me.m08.d16:meMA.Ode9C12.melody	@ltx/en_uk_lash/he.h.m6:heHE.XeniasDespotikis.name
ltx/en_uk_lash/me.m08.d16:meMA.Ode9C12.mode	@ltx/en_uk_lash/miscellanea:misc.Mode6
ltx/en_uk_lash/me.m08.d16:meMA.Ode9C12.ode	@ltx/en_uk_lash/miscellanea:misc.Ode9
ltx/en_uk_lash/me.m08.d16:meMA.Ode9C12.text	Grant help against their enemies to the Orthodox and to their faithful Sovereigns, because we have gained as an invincible protection, Master, the symbols of your flesh. Through them they look towards their salvation.
ltx/en_uk_lash/me.m08.d16:meMA.Ode9C1T.incipit	The Word of God, bearing…
ltx/en_uk_lash/me.m08.d16:meMA.Ode9C1T.melody	@ltx/en_uk_lash/he.h.m6:heHE.XeniasDespotikis.name
ltx/en_uk_lash/me.m08.d16:meMA.Ode9C1T.mode	@ltx/en_uk_lash/miscellanea:misc.Mode6
ltx/en_uk_lash/me.m08.d16:meMA.Ode9C1T.ode	@ltx/en_uk_lash/miscellanea:misc.Ode9
ltx/en_uk_lash/me.m08.d16:meMA.Ode9C1T.text	The Word of God, bearing a body, appeared to those on earth, double by nature from you, O All-blameless, by exchange of the Godhead, united without mixture in one hypostasis by the mingling. Him we glorify.
ltx/en_uk_lash/me.m08.d16:meMA.Ode9C21.greekmelody	@ltx/en_uk_lash/he.h.m4:heHE.ApasGigenis.greekname
ltx/en_uk_lash/me.m08.d16:meMA.Ode9C21.incipit	…
ltx/en_uk_lash/me.m08.d16:meMA.Ode9C21.melody	@ltx/en_uk_lash/he.h.m4:heHE.ApasGigenis.name
ltx/en_uk_lash/me.m08.d16:meMA.Ode9C21.mode	@ltx/en_uk_lash/miscellanea:misc.Mode4
ltx/en_uk_lash/me.m08.d16:meMA.Ode9C21.ode	@ltx/en_uk_lash/miscellanea:misc.Ode9
ltx/en_uk_lash/me.m08.d16:meMA.Ode9C21.text	
ltx/en_uk_lash/me.m08.d16:meMA.Ode9C22.incipit	…
ltx/en_uk_lash/me.m08.d16:meMA.Ode9C22.melody	@ltx/en_uk_lash/he.h.m4:heHE.ApasGigenis.name
ltx/en_uk_lash/me.m08.d16:meMA.Ode9C22.mode	@ltx/en_uk_lash/miscellanea:misc.Mode4
ltx/en_uk_lash/me.m08.d16:meMA.Ode9C22.ode	@ltx/en_uk_lash/miscellanea:misc.Ode9
ltx/en_uk_lash/me.m08.d16:meMA.Ode9C22.text	
ltx/en_uk_lash/me.m08.d16:meMA.Ode9C23.incipit	…
ltx/en_uk_lash/me.m08.d16:meMA.Ode9C23.melody	@ltx/en_uk_lash/he.h.m4:heHE.ApasGigenis.name
ltx/en_uk_lash/me.m08.d16:meMA.Ode9C23.mode	@ltx/en_uk_lash/miscellanea:misc.Mode4
ltx/en_uk_lash/me.m08.d16:meMA.Ode9C23.ode	@ltx/en_uk_lash/miscellanea:misc.Ode9
ltx/en_uk_lash/me.m08.d16:meMA.Ode9C23.text	
ltx/en_uk_lash/me.m08.d16:meMA.Ode9C2T.incipit	…
ltx/en_uk_lash/me.m08.d16:meMA.Ode9C2T.melody	@ltx/en_uk_lash/he.h.m4:heHE.ApasGigenis.name
ltx/en_uk_lash/me.m08.d16:meMA.Ode9C2T.mode	@ltx/en_uk_lash/miscellanea:misc.Mode4
ltx/en_uk_lash/me.m08.d16:meMA.Ode9C2T.ode	@ltx/en_uk_lash/miscellanea:misc.Ode9
ltx/en_uk_lash/me.m08.d16:meMA.Ode9C2T.text	
ltx/en_uk_lash/me.m08.d16:meMA.Ode9H.greekmelody	@ltx/en_uk_lash/he.h.m4:heHE.ApasGigenis.greekname
ltx/en_uk_lash/me.m08.d16:meMA.Ode9H.incipit	@ltx/en_uk_lash/he.h.m4:heHE.ApasGigenis.incipit
ltx/en_uk_lash/me.m08.d16:meMA.Ode9H.melody	@ltx/en_uk_lash/he.h.m4:heHE.ApasGigenis.melody
ltx/en_uk_lash/me.m08.d16:meMA.Ode9H.mode	@ltx/en_uk_lash/miscellanea:misc.Mode4
ltx/en_uk_lash/me.m08.d16:meMA.Ode9H.ode	@ltx/en_uk_lash/miscellanea:misc.Ode9
ltx/en_uk_lash/me.m08.d16:meMA.Ode9H.text	@ltx/en_uk_lash/he.h.m4:heHE.ApasGigenis.text
ltx/en_uk_lash/me.m08.d16:meVE.Apolytikion1.incipit	@ltx/en_uk_lash/oc.m2.d4:ocMA.Kathisma21.incipit
ltx/en_uk_lash/me.m08.d16:meVE.Apolytikion1.melody	
ltx/en_uk_lash/me.m08.d16:meVE.Apolytikion1.mode	@ltx/en_uk_lash/miscellanea:misc.Mode2
ltx/en_uk_lash/me.m08.d16:meVE.Apolytikion1.text	@ltx/en_uk_lash/oc.m2.d4:ocMA.Kathisma21.text
ltx/en_uk_lash/me.m08.d16:meVE.AposGlory.incipit	When you were translated to…
ltx/en_uk_lash/me.m08.d16:meVE.AposGlory.melody	@ltx/en_uk_lash/he.a.m2:heAU.OikosTouEfratha.notmetered
ltx/en_uk_lash/me.m08.d16:meVE.AposGlory.mode	@ltx/en_uk_lash/miscellanea:misc.Mode2
ltx/en_uk_lash/me.m08.d16:meVE.AposGlory.text	When you were translated to him who was born of you, O Virgin, the Apostles came together on clouds to bury your body.
ltx/en_uk_lash/me.m08.d16:meVE.Aposticha1.greekmelody	@ltx/en_uk_lash/he.a.m2:heAU.OikosTouEfratha.greekname
ltx/en_uk_lash/me.m08.d16:meVE.Aposticha1.incipit	@ltx/en_uk_lash/me.m08.d15:meSV.Aposticha1.incipit
ltx/en_uk_lash/me.m08.d16:meVE.Aposticha1.melody	@ltx/en_uk_lash/he.a.m2:heAU.OikosTouEfratha.notmetered
ltx/en_uk_lash/me.m08.d16:meVE.Aposticha1.mode	@ltx/en_uk_lash/miscellanea:misc.Mode2
ltx/en_uk_lash/me.m08.d16:meVE.Aposticha1.text	@ltx/en_uk_lash/me.m08.d15:meSV.Aposticha1.text
ltx/en_uk_lash/me.m08.d16:meVE.Aposticha2.incipit	O your mysteries, Pure Virgin…
ltx/en_uk_lash/me.m08.d16:meVE.Aposticha2.melody	@ltx/en_uk_lash/he.a.m2:heAU.OikosTouEfratha.notmetered
ltx/en_uk_lash/me.m08.d16:meVE.Aposticha2.mode	@ltx/en_uk_lash/miscellanea:misc.Mode2
ltx/en_uk_lash/me.m08.d16:meVE.Aposticha2.text	O your mysteries, Pure Virgin, which are above nature! For as God''s Mother you have now radiantly departed to him, Mother of God.
ltx/en_uk_lash/me.m08.d16:meVE.Aposticha3.incipit	The tomb of the Virgin…
ltx/en_uk_lash/me.m08.d16:meVE.Aposticha3.melody	@ltx/en_uk_lash/he.a.m2:heAU.OikosTouEfratha.notmetered
ltx/en_uk_lash/me.m08.d16:meVE.Aposticha3.mode	@ltx/en_uk_lash/miscellanea:misc.Mode2
ltx/en_uk_lash/me.m08.d16:meVE.Aposticha3.text	The tomb of the Virgin and Mother of God is a ladder leading up to heaven those who ever glorify her with faith.
ltx/en_uk_lash/me.m08.d16:meVE.SticGlory.incipit	Come, let us feast the…
ltx/en_uk_lash/me.m08.d16:meVE.SticGlory.melody	
ltx/en_uk_lash/me.m08.d16:meVE.SticGlory.mode	@ltx/en_uk_lash/miscellanea:misc.Mode6
ltx/en_uk_lash/me.m08.d16:meVE.SticGlory.text	Come, let us feast the universal Dormition of the all-blameless Mother of God; for today Angels celebrate the honoured Translation of God''s Mother, and invite us who are born of earth to a festival to cry with never-silent voice: Hail, who passed over from earth and took up your abode in heavenly dwellings. Hail, who gathered the choir of the Disciples together by a light cloud. Hail, our hope and protection; for we, the race of Christians, ceaselessly call you blest.
ltx/en_uk_lash/me.m08.d16:meVE.Stichera01.incipit	With what eyes shall we…
ltx/en_uk_lash/me.m08.d16:meVE.Stichera01.melody	@ltx/en_uk_lash/he.a.m2:heAU.PoioisEffimionStemmasin.notmetered
ltx/en_uk_lash/me.m08.d16:meVE.Stichera01.mode	@ltx/en_uk_lash/miscellanea:misc.Mode2
ltx/en_uk_lash/me.m08.d16:meVE.Stichera01.text	With what eyes shall we who are born of earth look upon your image, which the armies of the Angels cannot look at without fear as it blazes with divine light? For it departs today from the land of unbelievers and by divine decree comes to dwell in the Queen of cities and among a people of true religion. At its entry Kings rejoice, O Christ, falling down before it with fear and faith.
ltx/en_uk_lash/me.m08.d16:meVE.Stichera02.incipit	With what hands shall we…
ltx/en_uk_lash/me.m08.d16:meVE.Stichera02.melody	@ltx/en_uk_lash/he.a.m2:heAU.PoioisEffimionStemmasin.notmetered
ltx/en_uk_lash/me.m08.d16:meVE.Stichera02.mode	@ltx/en_uk_lash/miscellanea:misc.Mode2
ltx/en_uk_lash/me.m08.d16:meVE.Stichera02.text	With what hands shall we creatures of dust touch your Image, O Word? We who are stained by faults touch you, our sinless God? We who live in filth touch you the unapproachable? The Cherubim tremble and hide their gaze; the Seraphim cannot bear to see your glory; creation serves you with fear. Do not then condemn us, O Christ, who unworthily greet from faith your dread appearance.
ltx/en_uk_lash/me.m08.d16:meVE.Stichera03.incipit	Once again the godlike day…
ltx/en_uk_lash/me.m08.d16:meVE.Stichera03.melody	@ltx/en_uk_lash/he.a.m2:heAU.PoioisEffimionStemmasin.notmetered
ltx/en_uk_lash/me.m08.d16:meVE.Stichera03.mode	@ltx/en_uk_lash/miscellanea:misc.Mode2
ltx/en_uk_lash/me.m08.d16:meVE.Stichera03.text	Once again the godlike day of the Master''s festival is here; for he who is seated in the highest has now clearly visited us through his honoured Image; he who is unseen by the Cherubim above appears through painting to those to whom he has become like, formed ineffably by the immaculate finger of the Father according to his likeness. As we worship it with faith and love we are sanctified.
ltx/en_uk_lash/me.m08.d16:meVE.Stichera04.incipit	…
ltx/en_uk_lash/me.m08.d16:meVE.Stichera04.melody	@ltx/en_uk_lash/he.a.m4:heAU.OsGennaionEnMartysi.notmetered
ltx/en_uk_lash/me.m08.d16:meVE.Stichera04.mode	@ltx/en_uk_lash/miscellanea:misc.Mode4
ltx/en_uk_lash/me.m08.d16:meVE.Stichera04.text	
ltx/en_uk_lash/me.m08.d16:meVE.Stichera05.incipit	…
ltx/en_uk_lash/me.m08.d16:meVE.Stichera05.melody	@ltx/en_uk_lash/he.a.m4:heAU.OsGennaionEnMartysi.notmetered
ltx/en_uk_lash/me.m08.d16:meVE.Stichera05.mode	@ltx/en_uk_lash/miscellanea:misc.Mode4
ltx/en_uk_lash/me.m08.d16:meVE.Stichera05.text	
ltx/en_uk_lash/me.m08.d16:meVE.Stichera06.incipit	…
ltx/en_uk_lash/me.m08.d16:meVE.Stichera06.melody	@ltx/en_uk_lash/he.a.m4:heAU.OsGennaionEnMartysi.notmetered
ltx/en_uk_lash/me.m08.d16:meVE.Stichera06.mode	@ltx/en_uk_lash/miscellanea:misc.Mode4
ltx/en_uk_lash/me.m08.d16:meVE.Stichera06.text	
