ltx/en_uk_lash/tr.d061:trCO.header	
ltx/en_uk_lash/tr.d061:trDA.commemoration.full	
ltx/en_uk_lash/tr.d061:trDA.commemoration.short	
ltx/en_uk_lash/tr.d061:trDA.insert1	
ltx/en_uk_lash/tr.d061:trDA.insert2	
ltx/en_uk_lash/tr.d061:trDA.note	
ltx/en_uk_lash/tr.d061:trDA.title	
ltx/en_uk_lash/tr.d061:trHO.commemorations	
ltx/en_uk_lash/tr.d061:trHO.daytitle	
ltx/en_uk_lash/tr.d061:trHO.description1	
ltx/en_uk_lash/tr.d061:trHO.description2	
ltx/en_uk_lash/tr.d061:trHO.note1	
ltx/en_uk_lash/tr.d061:trHO.note2	
ltx/en_uk_lash/tr.d061:trMA.AposIdiomelon1.incipit	…
ltx/en_uk_lash/tr.d061:trMA.AposIdiomelon1.melody	@ltx/en_uk_lash/miscellanea:misc.Idiomelon
ltx/en_uk_lash/tr.d061:trMA.AposIdiomelon1.mode	@ltx/en_uk_lash/miscellanea:misc.Mode5
ltx/en_uk_lash/tr.d061:trMA.AposIdiomelon1.text	
ltx/en_uk_lash/tr.d061:trMA.AposMartyric.incipit	@ltx/en_uk_lash/oc.m5.d5:ocMA.Aposticha3.incipit
ltx/en_uk_lash/tr.d061:trMA.AposMartyric.melody	
ltx/en_uk_lash/tr.d061:trMA.AposMartyric.mode	@ltx/en_uk_lash/miscellanea:misc.Mode5
ltx/en_uk_lash/tr.d061:trMA.AposMartyric.text	@ltx/en_uk_lash/oc.m5.d5:ocMA.Aposticha3.text
ltx/en_uk_lash/tr.d061:trMA.AposTheotokion.incipit	@ltx/en_uk_lash/oc.m5.d5:ocMA.AposTheotokion.incipit
ltx/en_uk_lash/tr.d061:trMA.AposTheotokion.melody	
ltx/en_uk_lash/tr.d061:trMA.AposTheotokion.mode	@ltx/en_uk_lash/miscellanea:misc.Mode5
ltx/en_uk_lash/tr.d061:trMA.AposTheotokion.text	@ltx/en_uk_lash/oc.m5.d5:ocMA.AposTheotokion.text
ltx/en_uk_lash/tr.d061:trMA.C1.poet	@ltx/en_uk_lash/poets:po.Iosif
ltx/en_uk_lash/tr.d061:trMA.C2.poet	@ltx/en_uk_lash/poets:po.Theodorou
ltx/en_uk_lash/tr.d061:trMA.Kathisma21.greekmelody	@ltx/en_uk_lash/he.a.m5:heAU.TonSynanarchonLogon.greekname
ltx/en_uk_lash/tr.d061:trMA.Kathisma21.incipit	…
ltx/en_uk_lash/tr.d061:trMA.Kathisma21.melody	@ltx/en_uk_lash/he.a.m5:heAU.TonSynanarchonLogon.notmetered
ltx/en_uk_lash/tr.d061:trMA.Kathisma21.mode	@ltx/en_uk_lash/miscellanea:misc.Mode5
ltx/en_uk_lash/tr.d061:trMA.Kathisma21.text	
ltx/en_uk_lash/tr.d061:trMA.Kathisma22.greekmelody	@ltx/en_uk_lash/he.a.m5:heAU.TonSynanarchonLogon.greekname
ltx/en_uk_lash/tr.d061:trMA.Kathisma22.incipit	…
ltx/en_uk_lash/tr.d061:trMA.Kathisma22.melody	@ltx/en_uk_lash/he.a.m5:heAU.TonSynanarchonLogon.notmetered
ltx/en_uk_lash/tr.d061:trMA.Kathisma22.mode	@ltx/en_uk_lash/miscellanea:misc.Mode5
ltx/en_uk_lash/tr.d061:trMA.Kathisma22.text	
ltx/en_uk_lash/tr.d061:trMA.Kathisma31.greekmelody	@ltx/en_uk_lash/he.a.m6:heAU.AngelikaiDynameis.greekname
ltx/en_uk_lash/tr.d061:trMA.Kathisma31.incipit	…
ltx/en_uk_lash/tr.d061:trMA.Kathisma31.melody	@ltx/en_uk_lash/he.a.m6:heAU.AngelikaiDynameis.notmetered
ltx/en_uk_lash/tr.d061:trMA.Kathisma31.mode	@ltx/en_uk_lash/miscellanea:misc.Mode6
ltx/en_uk_lash/tr.d061:trMA.Kathisma31.text	
ltx/en_uk_lash/tr.d061:trMA.Kathisma32.greekmelody	@ltx/en_uk_lash/he.a.m6:heAU.ElpisTouKosmouAgathi.greekname
ltx/en_uk_lash/tr.d061:trMA.Kathisma32.incipit	…
ltx/en_uk_lash/tr.d061:trMA.Kathisma32.melody	@ltx/en_uk_lash/he.a.m6:heAU.ElpisTouKosmouAgathi.notmetered
ltx/en_uk_lash/tr.d061:trMA.Kathisma32.mode	@ltx/en_uk_lash/miscellanea:misc.Mode6
ltx/en_uk_lash/tr.d061:trMA.Kathisma32.text	
ltx/en_uk_lash/tr.d061:trMA.Ode4C11.greekmelody	@ltx/en_uk_lash/he.h.m5:heHE.TinTheianEnnoisas.greekname
ltx/en_uk_lash/tr.d061:trMA.Ode4C11.incipit	…
ltx/en_uk_lash/tr.d061:trMA.Ode4C11.melody	@ltx/en_uk_lash/he.h.m5:heHE.TinTheianEnnoisas.name
ltx/en_uk_lash/tr.d061:trMA.Ode4C11.mode	@ltx/en_uk_lash/miscellanea:misc.Mode5
ltx/en_uk_lash/tr.d061:trMA.Ode4C11.ode	@ltx/en_uk_lash/miscellanea:misc.Ode4
ltx/en_uk_lash/tr.d061:trMA.Ode4C11.text	
ltx/en_uk_lash/tr.d061:trMA.Ode4C12.incipit	…
ltx/en_uk_lash/tr.d061:trMA.Ode4C12.melody	@ltx/en_uk_lash/he.h.m5:heHE.TinTheianEnnoisas.name
ltx/en_uk_lash/tr.d061:trMA.Ode4C12.mode	@ltx/en_uk_lash/miscellanea:misc.Mode5
ltx/en_uk_lash/tr.d061:trMA.Ode4C12.ode	@ltx/en_uk_lash/miscellanea:misc.Ode4
ltx/en_uk_lash/tr.d061:trMA.Ode4C12.text	
ltx/en_uk_lash/tr.d061:trMA.Ode4C13.incipit	…
ltx/en_uk_lash/tr.d061:trMA.Ode4C13.melody	@ltx/en_uk_lash/he.h.m5:heHE.TinTheianEnnoisas.name
ltx/en_uk_lash/tr.d061:trMA.Ode4C13.mode	@ltx/en_uk_lash/miscellanea:misc.Mode5
ltx/en_uk_lash/tr.d061:trMA.Ode4C13.ode	@ltx/en_uk_lash/miscellanea:misc.Ode4
ltx/en_uk_lash/tr.d061:trMA.Ode4C13.text	
ltx/en_uk_lash/tr.d061:trMA.Ode4C14.incipit	…
ltx/en_uk_lash/tr.d061:trMA.Ode4C14.melody	@ltx/en_uk_lash/he.h.m5:heHE.TinTheianEnnoisas.name
ltx/en_uk_lash/tr.d061:trMA.Ode4C14.mode	@ltx/en_uk_lash/miscellanea:misc.Mode5
ltx/en_uk_lash/tr.d061:trMA.Ode4C14.ode	@ltx/en_uk_lash/miscellanea:misc.Ode4
ltx/en_uk_lash/tr.d061:trMA.Ode4C14.text	
ltx/en_uk_lash/tr.d061:trMA.Ode4C1T.incipit	…
ltx/en_uk_lash/tr.d061:trMA.Ode4C1T.melody	@ltx/en_uk_lash/he.h.m5:heHE.TinTheianEnnoisas.name
ltx/en_uk_lash/tr.d061:trMA.Ode4C1T.mode	@ltx/en_uk_lash/miscellanea:misc.Mode5
ltx/en_uk_lash/tr.d061:trMA.Ode4C1T.ode	@ltx/en_uk_lash/miscellanea:misc.Ode4
ltx/en_uk_lash/tr.d061:trMA.Ode4C1T.text	
ltx/en_uk_lash/tr.d061:trMA.Ode4C21.greekmelody	@ltx/en_uk_lash/he.h.m6:heHE.AkikoaKyrieTinAkoin.greekname
ltx/en_uk_lash/tr.d061:trMA.Ode4C21.incipit	…
ltx/en_uk_lash/tr.d061:trMA.Ode4C21.melody	@ltx/en_uk_lash/he.h.m6:heHE.AkikoaKyrieTinAkoin.name
ltx/en_uk_lash/tr.d061:trMA.Ode4C21.mode	@ltx/en_uk_lash/miscellanea:misc.Mode6
ltx/en_uk_lash/tr.d061:trMA.Ode4C21.ode	@ltx/en_uk_lash/miscellanea:misc.Ode4
ltx/en_uk_lash/tr.d061:trMA.Ode4C21.text	
ltx/en_uk_lash/tr.d061:trMA.Ode4C22.incipit	…
ltx/en_uk_lash/tr.d061:trMA.Ode4C22.melody	@ltx/en_uk_lash/he.h.m6:heHE.AkikoaKyrieTinAkoin.name
ltx/en_uk_lash/tr.d061:trMA.Ode4C22.mode	@ltx/en_uk_lash/miscellanea:misc.Mode6
ltx/en_uk_lash/tr.d061:trMA.Ode4C22.ode	@ltx/en_uk_lash/miscellanea:misc.Ode4
ltx/en_uk_lash/tr.d061:trMA.Ode4C22.text	
ltx/en_uk_lash/tr.d061:trMA.Ode4C2A1.incipit	…
ltx/en_uk_lash/tr.d061:trMA.Ode4C2A1.melody	@ltx/en_uk_lash/he.h.m6:heHE.AkikoaKyrieTinAkoin.name
ltx/en_uk_lash/tr.d061:trMA.Ode4C2A1.mode	@ltx/en_uk_lash/miscellanea:misc.Mode6
ltx/en_uk_lash/tr.d061:trMA.Ode4C2A1.ode	@ltx/en_uk_lash/miscellanea:misc.Ode4
ltx/en_uk_lash/tr.d061:trMA.Ode4C2A1.text	
ltx/en_uk_lash/tr.d061:trMA.Ode4C2H.greekmelody	@ltx/en_uk_lash/he.h.m6:heHE.AkikoaKyrieTinAkoin.greekname
ltx/en_uk_lash/tr.d061:trMA.Ode4C2H.incipit	@ltx/en_uk_lash/he.h.m6:heHE.AkikoaKyrieTinAkoin.incipit
ltx/en_uk_lash/tr.d061:trMA.Ode4C2H.melody	@ltx/en_uk_lash/he.h.m6:heHE.AkikoaKyrieTinAkoin.melody
ltx/en_uk_lash/tr.d061:trMA.Ode4C2H.mode	@ltx/en_uk_lash/miscellanea:misc.Mode6
ltx/en_uk_lash/tr.d061:trMA.Ode4C2H.ode	@ltx/en_uk_lash/miscellanea:misc.Ode4
ltx/en_uk_lash/tr.d061:trMA.Ode4C2H.text	@ltx/en_uk_lash/he.h.m6:heHE.AkikoaKyrieTinAkoin.text
ltx/en_uk_lash/tr.d061:trMA.Ode4C2T.incipit	…
ltx/en_uk_lash/tr.d061:trMA.Ode4C2T.melody	@ltx/en_uk_lash/he.h.m6:heHE.AkikoaKyrieTinAkoin.name
ltx/en_uk_lash/tr.d061:trMA.Ode4C2T.mode	@ltx/en_uk_lash/miscellanea:misc.Mode6
ltx/en_uk_lash/tr.d061:trMA.Ode4C2T.ode	@ltx/en_uk_lash/miscellanea:misc.Ode4
ltx/en_uk_lash/tr.d061:trMA.Ode4C2T.text	
ltx/en_uk_lash/tr.d061:trMA.Ode4C2Tr.incipit	…
ltx/en_uk_lash/tr.d061:trMA.Ode4C2Tr.melody	@ltx/en_uk_lash/he.h.m6:heHE.AkikoaKyrieTinAkoin.name
ltx/en_uk_lash/tr.d061:trMA.Ode4C2Tr.mode	@ltx/en_uk_lash/miscellanea:misc.Mode6
ltx/en_uk_lash/tr.d061:trMA.Ode4C2Tr.ode	@ltx/en_uk_lash/miscellanea:misc.Ode4
ltx/en_uk_lash/tr.d061:trMA.Ode4C2Tr.text	
ltx/en_uk_lash/tr.d061:trMA.Ode8C11.greekmelody	@ltx/en_uk_lash/he.h.m5:heHE.SoiToPantourgo.greekname
ltx/en_uk_lash/tr.d061:trMA.Ode8C11.incipit	…
ltx/en_uk_lash/tr.d061:trMA.Ode8C11.melody	@ltx/en_uk_lash/he.h.m5:heHE.SoiToPantourgo.name
ltx/en_uk_lash/tr.d061:trMA.Ode8C11.mode	@ltx/en_uk_lash/miscellanea:misc.Mode5
ltx/en_uk_lash/tr.d061:trMA.Ode8C11.ode	@ltx/en_uk_lash/miscellanea:misc.Ode8
ltx/en_uk_lash/tr.d061:trMA.Ode8C11.text	
ltx/en_uk_lash/tr.d061:trMA.Ode8C12.incipit	…
ltx/en_uk_lash/tr.d061:trMA.Ode8C12.melody	@ltx/en_uk_lash/he.h.m5:heHE.SoiToPantourgo.name
ltx/en_uk_lash/tr.d061:trMA.Ode8C12.mode	@ltx/en_uk_lash/miscellanea:misc.Mode5
ltx/en_uk_lash/tr.d061:trMA.Ode8C12.ode	@ltx/en_uk_lash/miscellanea:misc.Ode8
ltx/en_uk_lash/tr.d061:trMA.Ode8C12.text	
ltx/en_uk_lash/tr.d061:trMA.Ode8C13.incipit	…
ltx/en_uk_lash/tr.d061:trMA.Ode8C13.melody	@ltx/en_uk_lash/he.h.m5:heHE.SoiToPantourgo.name
ltx/en_uk_lash/tr.d061:trMA.Ode8C13.mode	@ltx/en_uk_lash/miscellanea:misc.Mode5
ltx/en_uk_lash/tr.d061:trMA.Ode8C13.ode	@ltx/en_uk_lash/miscellanea:misc.Ode8
ltx/en_uk_lash/tr.d061:trMA.Ode8C13.text	
ltx/en_uk_lash/tr.d061:trMA.Ode8C1T.incipit	…
ltx/en_uk_lash/tr.d061:trMA.Ode8C1T.melody	@ltx/en_uk_lash/he.h.m5:heHE.SoiToPantourgo.name
ltx/en_uk_lash/tr.d061:trMA.Ode8C1T.mode	@ltx/en_uk_lash/miscellanea:misc.Mode5
ltx/en_uk_lash/tr.d061:trMA.Ode8C1T.ode	@ltx/en_uk_lash/miscellanea:misc.Ode8
ltx/en_uk_lash/tr.d061:trMA.Ode8C1T.text	
ltx/en_uk_lash/tr.d061:trMA.Ode8C21.greekmelody	@ltx/en_uk_lash/he.h.m6:heHE.OiOsioiSouPaides.greekname
ltx/en_uk_lash/tr.d061:trMA.Ode8C21.incipit	…
ltx/en_uk_lash/tr.d061:trMA.Ode8C21.melody	@ltx/en_uk_lash/he.h.m6:heHE.OiOsioiSouPaides.name
ltx/en_uk_lash/tr.d061:trMA.Ode8C21.mode	@ltx/en_uk_lash/miscellanea:misc.Mode6
ltx/en_uk_lash/tr.d061:trMA.Ode8C21.ode	@ltx/en_uk_lash/miscellanea:misc.Ode8
ltx/en_uk_lash/tr.d061:trMA.Ode8C21.text	
ltx/en_uk_lash/tr.d061:trMA.Ode8C22.incipit	…
ltx/en_uk_lash/tr.d061:trMA.Ode8C22.melody	@ltx/en_uk_lash/he.h.m6:heHE.OiOsioiSouPaides.name
ltx/en_uk_lash/tr.d061:trMA.Ode8C22.mode	@ltx/en_uk_lash/miscellanea:misc.Mode6
ltx/en_uk_lash/tr.d061:trMA.Ode8C22.ode	@ltx/en_uk_lash/miscellanea:misc.Ode8
ltx/en_uk_lash/tr.d061:trMA.Ode8C22.text	
ltx/en_uk_lash/tr.d061:trMA.Ode8C2A1.incipit	…
ltx/en_uk_lash/tr.d061:trMA.Ode8C2A1.melody	@ltx/en_uk_lash/he.h.m6:heHE.OiOsioiSouPaides.name
ltx/en_uk_lash/tr.d061:trMA.Ode8C2A1.mode	@ltx/en_uk_lash/miscellanea:misc.Mode6
ltx/en_uk_lash/tr.d061:trMA.Ode8C2A1.ode	@ltx/en_uk_lash/miscellanea:misc.Ode8
ltx/en_uk_lash/tr.d061:trMA.Ode8C2A1.text	
ltx/en_uk_lash/tr.d061:trMA.Ode8C2H.greekmelody	@ltx/en_uk_lash/he.h.m6:heHE.OiOsioiSouPaides.greekname
ltx/en_uk_lash/tr.d061:trMA.Ode8C2H.incipit	@ltx/en_uk_lash/he.h.m6:heHE.OiOsioiSouPaides.incipit
ltx/en_uk_lash/tr.d061:trMA.Ode8C2H.melody	@ltx/en_uk_lash/he.h.m6:heHE.OiOsioiSouPaides.melody
ltx/en_uk_lash/tr.d061:trMA.Ode8C2H.mode	@ltx/en_uk_lash/miscellanea:misc.Mode6
ltx/en_uk_lash/tr.d061:trMA.Ode8C2H.ode	@ltx/en_uk_lash/miscellanea:misc.Ode8
ltx/en_uk_lash/tr.d061:trMA.Ode8C2H.text	@ltx/en_uk_lash/he.h.m6:heHE.OiOsioiSouPaides.text
ltx/en_uk_lash/tr.d061:trMA.Ode8C2T.incipit	…
ltx/en_uk_lash/tr.d061:trMA.Ode8C2T.melody	@ltx/en_uk_lash/he.h.m6:heHE.OiOsioiSouPaides.name
ltx/en_uk_lash/tr.d061:trMA.Ode8C2T.mode	@ltx/en_uk_lash/miscellanea:misc.Mode6
ltx/en_uk_lash/tr.d061:trMA.Ode8C2T.ode	@ltx/en_uk_lash/miscellanea:misc.Ode8
ltx/en_uk_lash/tr.d061:trMA.Ode8C2T.text	
ltx/en_uk_lash/tr.d061:trMA.Ode8C2Tr.incipit	…
ltx/en_uk_lash/tr.d061:trMA.Ode8C2Tr.melody	@ltx/en_uk_lash/he.h.m6:heHE.OiOsioiSouPaides.name
ltx/en_uk_lash/tr.d061:trMA.Ode8C2Tr.mode	@ltx/en_uk_lash/miscellanea:misc.Mode6
ltx/en_uk_lash/tr.d061:trMA.Ode8C2Tr.ode	@ltx/en_uk_lash/miscellanea:misc.Ode8
ltx/en_uk_lash/tr.d061:trMA.Ode8C2Tr.text	
ltx/en_uk_lash/tr.d061:trMA.Ode9C11.greekmelody	@ltx/en_uk_lash/he.h.m5:heHE.IsaiaChoreve.greekname
ltx/en_uk_lash/tr.d061:trMA.Ode9C11.incipit	…
ltx/en_uk_lash/tr.d061:trMA.Ode9C11.melody	@ltx/en_uk_lash/he.h.m5:heHE.IsaiaChoreve.name
ltx/en_uk_lash/tr.d061:trMA.Ode9C11.mode	@ltx/en_uk_lash/miscellanea:misc.Mode5
ltx/en_uk_lash/tr.d061:trMA.Ode9C11.ode	@ltx/en_uk_lash/miscellanea:misc.Ode9
ltx/en_uk_lash/tr.d061:trMA.Ode9C11.text	
ltx/en_uk_lash/tr.d061:trMA.Ode9C12.incipit	…
ltx/en_uk_lash/tr.d061:trMA.Ode9C12.melody	@ltx/en_uk_lash/he.h.m5:heHE.IsaiaChoreve.name
ltx/en_uk_lash/tr.d061:trMA.Ode9C12.mode	@ltx/en_uk_lash/miscellanea:misc.Mode5
ltx/en_uk_lash/tr.d061:trMA.Ode9C12.ode	@ltx/en_uk_lash/miscellanea:misc.Ode9
ltx/en_uk_lash/tr.d061:trMA.Ode9C12.text	
ltx/en_uk_lash/tr.d061:trMA.Ode9C13.incipit	…
ltx/en_uk_lash/tr.d061:trMA.Ode9C13.melody	@ltx/en_uk_lash/he.h.m5:heHE.IsaiaChoreve.name
ltx/en_uk_lash/tr.d061:trMA.Ode9C13.mode	@ltx/en_uk_lash/miscellanea:misc.Mode5
ltx/en_uk_lash/tr.d061:trMA.Ode9C13.ode	@ltx/en_uk_lash/miscellanea:misc.Ode9
ltx/en_uk_lash/tr.d061:trMA.Ode9C13.text	
ltx/en_uk_lash/tr.d061:trMA.Ode9C1T.incipit	…
ltx/en_uk_lash/tr.d061:trMA.Ode9C1T.melody	@ltx/en_uk_lash/he.h.m5:heHE.IsaiaChoreve.name
ltx/en_uk_lash/tr.d061:trMA.Ode9C1T.mode	@ltx/en_uk_lash/miscellanea:misc.Mode5
ltx/en_uk_lash/tr.d061:trMA.Ode9C1T.ode	@ltx/en_uk_lash/miscellanea:misc.Ode9
ltx/en_uk_lash/tr.d061:trMA.Ode9C1T.text	
ltx/en_uk_lash/tr.d061:trMA.Ode9C21.greekmelody	@ltx/en_uk_lash/he.h.m6:heHE.AsporouSyllipseos.greekname
ltx/en_uk_lash/tr.d061:trMA.Ode9C21.incipit	…
ltx/en_uk_lash/tr.d061:trMA.Ode9C21.melody	@ltx/en_uk_lash/he.h.m6:heHE.AsporouSyllipseos.name
ltx/en_uk_lash/tr.d061:trMA.Ode9C21.mode	@ltx/en_uk_lash/miscellanea:misc.Mode6
ltx/en_uk_lash/tr.d061:trMA.Ode9C21.ode	@ltx/en_uk_lash/miscellanea:misc.Ode9
ltx/en_uk_lash/tr.d061:trMA.Ode9C21.text	
ltx/en_uk_lash/tr.d061:trMA.Ode9C22.incipit	…
ltx/en_uk_lash/tr.d061:trMA.Ode9C22.melody	@ltx/en_uk_lash/he.h.m6:heHE.AsporouSyllipseos.name
ltx/en_uk_lash/tr.d061:trMA.Ode9C22.mode	@ltx/en_uk_lash/miscellanea:misc.Mode6
ltx/en_uk_lash/tr.d061:trMA.Ode9C22.ode	@ltx/en_uk_lash/miscellanea:misc.Ode9
ltx/en_uk_lash/tr.d061:trMA.Ode9C22.text	
ltx/en_uk_lash/tr.d061:trMA.Ode9C2A1.incipit	…
ltx/en_uk_lash/tr.d061:trMA.Ode9C2A1.melody	@ltx/en_uk_lash/he.h.m6:heHE.AsporouSyllipseos.name
ltx/en_uk_lash/tr.d061:trMA.Ode9C2A1.mode	@ltx/en_uk_lash/miscellanea:misc.Mode6
ltx/en_uk_lash/tr.d061:trMA.Ode9C2A1.ode	@ltx/en_uk_lash/miscellanea:misc.Ode9
ltx/en_uk_lash/tr.d061:trMA.Ode9C2A1.text	
ltx/en_uk_lash/tr.d061:trMA.Ode9C2H.greekmelody	@ltx/en_uk_lash/he.h.m6:heHE.AsporouSyllipseos.greekname
ltx/en_uk_lash/tr.d061:trMA.Ode9C2H.incipit	@ltx/en_uk_lash/he.h.m6:heHE.AsporouSyllipseos.incipit
ltx/en_uk_lash/tr.d061:trMA.Ode9C2H.melody	@ltx/en_uk_lash/he.h.m6:heHE.AsporouSyllipseos.melody
ltx/en_uk_lash/tr.d061:trMA.Ode9C2H.mode	@ltx/en_uk_lash/miscellanea:misc.Mode6
ltx/en_uk_lash/tr.d061:trMA.Ode9C2H.ode	@ltx/en_uk_lash/miscellanea:misc.Ode9
ltx/en_uk_lash/tr.d061:trMA.Ode9C2H.text	@ltx/en_uk_lash/he.h.m6:heHE.AsporouSyllipseos.text
ltx/en_uk_lash/tr.d061:trMA.Ode9C2T.incipit	…
ltx/en_uk_lash/tr.d061:trMA.Ode9C2T.melody	@ltx/en_uk_lash/he.h.m6:heHE.AsporouSyllipseos.name
ltx/en_uk_lash/tr.d061:trMA.Ode9C2T.mode	@ltx/en_uk_lash/miscellanea:misc.Mode6
ltx/en_uk_lash/tr.d061:trMA.Ode9C2T.ode	@ltx/en_uk_lash/miscellanea:misc.Ode9
ltx/en_uk_lash/tr.d061:trMA.Ode9C2T.text	
ltx/en_uk_lash/tr.d061:trMA.Ode9C2Tr.incipit	…
ltx/en_uk_lash/tr.d061:trMA.Ode9C2Tr.melody	@ltx/en_uk_lash/he.h.m6:heHE.AsporouSyllipseos.name
ltx/en_uk_lash/tr.d061:trMA.Ode9C2Tr.mode	@ltx/en_uk_lash/miscellanea:misc.Mode6
ltx/en_uk_lash/tr.d061:trMA.Ode9C2Tr.ode	@ltx/en_uk_lash/miscellanea:misc.Ode9
ltx/en_uk_lash/tr.d061:trMA.Ode9C2Tr.text	
ltx/en_uk_lash/tr.d061:trTE.Troparion.incipit	Do not forget the voice…
ltx/en_uk_lash/tr.d061:trTE.Troparion.melody	
ltx/en_uk_lash/tr.d061:trTE.Troparion.mode	@ltx/en_uk_lash/miscellanea:misc.Mode1
ltx/en_uk_lash/tr.d061:trTE.Troparion.text	Do not forget the voice of your servants, Lord. Remember that we have always put our hope in you, the one who can all things, and help us, we implore.
ltx/en_uk_lash/tr.d061:trTE.Troparion2.text	And help us, we implore.
ltx/en_uk_lash/tr.d061:trVE.AposIdiomelon1.incipit	…
ltx/en_uk_lash/tr.d061:trVE.AposIdiomelon1.melody	@ltx/en_uk_lash/miscellanea:misc.Idiomelon
ltx/en_uk_lash/tr.d061:trVE.AposIdiomelon1.mode	@ltx/en_uk_lash/miscellanea:misc.Mode5
ltx/en_uk_lash/tr.d061:trVE.AposIdiomelon1.text	
ltx/en_uk_lash/tr.d061:trVE.AposMartyric.incipit	@ltx/en_uk_lash/oc.m5.d5:ocVE.Aposticha3.incipit
ltx/en_uk_lash/tr.d061:trVE.AposMartyric.melody	
ltx/en_uk_lash/tr.d061:trVE.AposMartyric.mode	@ltx/en_uk_lash/miscellanea:misc.Mode5
ltx/en_uk_lash/tr.d061:trVE.AposMartyric.text	@ltx/en_uk_lash/oc.m5.d5:ocVE.Aposticha3.text
ltx/en_uk_lash/tr.d061:trVE.Stichera01.greekmelody	@ltx/en_uk_lash/he.a.m5:heAU.ChairoisAskitikon.greekname
ltx/en_uk_lash/tr.d061:trVE.Stichera01.incipit	…
ltx/en_uk_lash/tr.d061:trVE.Stichera01.melody	@ltx/en_uk_lash/he.a.m5:heAU.ChairoisAskitikon.notmetered
ltx/en_uk_lash/tr.d061:trVE.Stichera01.mode	@ltx/en_uk_lash/miscellanea:misc.Mode5
ltx/en_uk_lash/tr.d061:trVE.Stichera01.text	
ltx/en_uk_lash/tr.d061:trVE.Stichera02.greekmelody	@ltx/en_uk_lash/he.a.m5:heAU.ChairoisAskitikon.greekname
ltx/en_uk_lash/tr.d061:trVE.Stichera02.incipit	…
ltx/en_uk_lash/tr.d061:trVE.Stichera02.melody	@ltx/en_uk_lash/he.a.m5:heAU.ChairoisAskitikon.notmetered
ltx/en_uk_lash/tr.d061:trVE.Stichera02.mode	@ltx/en_uk_lash/miscellanea:misc.Mode5
ltx/en_uk_lash/tr.d061:trVE.Stichera02.text	
ltx/en_uk_lash/tr.d061:trVE.Stichera03.incipit	…
ltx/en_uk_lash/tr.d061:trVE.Stichera03.melody	
ltx/en_uk_lash/tr.d061:trVE.Stichera03.mode	@ltx/en_uk_lash/miscellanea:misc.Mode6
ltx/en_uk_lash/tr.d061:trVE.Stichera03.text	
ltx/en_uk_lash/tr.d061:trVL.header	
