ltx/en_uk_lash/oc.m8.d6:ocBK.ModeNaked	@ltx/en_uk_lash/miscellanea:misc.Mode8.naked
ltx/en_uk_lash/oc.m8.d6:ocLI.Beatitudes1.incipit	@ltx/en_uk_lash/oc.m8.d1:ocLI.Beatitudes1.incipit
ltx/en_uk_lash/oc.m8.d6:ocLI.Beatitudes1.melody	
ltx/en_uk_lash/oc.m8.d6:ocLI.Beatitudes1.mode	@ltx/en_uk_lash/miscellanea:misc.Mode8
ltx/en_uk_lash/oc.m8.d6:ocLI.Beatitudes1.text	@ltx/en_uk_lash/oc.m8.d1:ocLI.Beatitudes1.text
ltx/en_uk_lash/oc.m8.d6:ocLI.Beatitudes2.incipit	…
ltx/en_uk_lash/oc.m8.d6:ocLI.Beatitudes2.melody	
ltx/en_uk_lash/oc.m8.d6:ocLI.Beatitudes2.mode	@ltx/en_uk_lash/miscellanea:misc.Mode8
ltx/en_uk_lash/oc.m8.d6:ocLI.Beatitudes2.text	
ltx/en_uk_lash/oc.m8.d6:ocLI.Beatitudes3.incipit	…
ltx/en_uk_lash/oc.m8.d6:ocLI.Beatitudes3.melody	
ltx/en_uk_lash/oc.m8.d6:ocLI.Beatitudes3.mode	@ltx/en_uk_lash/miscellanea:misc.Mode8
ltx/en_uk_lash/oc.m8.d6:ocLI.Beatitudes3.text	
ltx/en_uk_lash/oc.m8.d6:ocLI.Beatitudes4.incipit	…
ltx/en_uk_lash/oc.m8.d6:ocLI.Beatitudes4.melody	
ltx/en_uk_lash/oc.m8.d6:ocLI.Beatitudes4.mode	@ltx/en_uk_lash/miscellanea:misc.Mode8
ltx/en_uk_lash/oc.m8.d6:ocLI.Beatitudes4.text	
ltx/en_uk_lash/oc.m8.d6:ocLI.BeatitudesT.incipit	…
ltx/en_uk_lash/oc.m8.d6:ocLI.BeatitudesT.melody	
ltx/en_uk_lash/oc.m8.d6:ocLI.BeatitudesT.mode	@ltx/en_uk_lash/miscellanea:misc.Mode8
ltx/en_uk_lash/oc.m8.d6:ocLI.BeatitudesT.text	
ltx/en_uk_lash/oc.m8.d6:ocLI.BeatitudesTr.incipit	…
ltx/en_uk_lash/oc.m8.d6:ocLI.BeatitudesTr.melody	
ltx/en_uk_lash/oc.m8.d6:ocLI.BeatitudesTr.mode	@ltx/en_uk_lash/miscellanea:misc.Mode8
ltx/en_uk_lash/oc.m8.d6:ocLI.BeatitudesTr.text	
ltx/en_uk_lash/oc.m8.d6:ocLI.MM.Beatitudes1234TrTas78910GB.text	@ltx/en_uk_lash/properties:media.key
ltx/en_uk_lash/oc.m8.d6:ocMA.ApolTheotokion.incipit	@ltx/en_uk_lash/oc.m8.d4:ocMA.ApolTheotokion.incipit
ltx/en_uk_lash/oc.m8.d6:ocMA.ApolTheotokion.melody	
ltx/en_uk_lash/oc.m8.d6:ocMA.ApolTheotokion.mode	@ltx/en_uk_lash/miscellanea:misc.Mode8
ltx/en_uk_lash/oc.m8.d6:ocMA.ApolTheotokion.text	@ltx/en_uk_lash/oc.m8.d4:ocMA.ApolTheotokion.text
ltx/en_uk_lash/oc.m8.d6:ocMA.AposTheotokion.incipit	@ltx/en_uk_lash/he.a.m8:heAU.OTouParadoxou.incipit
ltx/en_uk_lash/oc.m8.d6:ocMA.AposTheotokion.melody	@ltx/en_uk_lash/he.a.m8:heAU.OTouParadoxou.melody
ltx/en_uk_lash/oc.m8.d6:ocMA.AposTheotokion.mode	@ltx/en_uk_lash/miscellanea:misc.Mode8
ltx/en_uk_lash/oc.m8.d6:ocMA.AposTheotokion.text	@ltx/en_uk_lash/he.a.m8:heAU.OTouParadoxou.text
ltx/en_uk_lash/oc.m8.d6:ocMA.Aposticha1.incipit	@ltx/en_uk_lash/oc.m8.d4:ocMA.Aposticha1.incipit
ltx/en_uk_lash/oc.m8.d6:ocMA.Aposticha1.melody	
ltx/en_uk_lash/oc.m8.d6:ocMA.Aposticha1.mode	@ltx/en_uk_lash/miscellanea:misc.Mode8
ltx/en_uk_lash/oc.m8.d6:ocMA.Aposticha1.text	@ltx/en_uk_lash/oc.m8.d4:ocMA.Aposticha1.text
ltx/en_uk_lash/oc.m8.d6:ocMA.Aposticha2.greekmelody	@ltx/en_uk_lash/he.a.m8:heAU.OEnEdemParadeisos.greekname
ltx/en_uk_lash/oc.m8.d6:ocMA.Aposticha2.incipit	@ltx/en_uk_lash/he.a.m8:heAU.OEnEdemParadeisos.incipit
ltx/en_uk_lash/oc.m8.d6:ocMA.Aposticha2.melody	@ltx/en_uk_lash/he.a.m8:heAU.OEnEdemParadeisos.melody
ltx/en_uk_lash/oc.m8.d6:ocMA.Aposticha2.mode	@ltx/en_uk_lash/miscellanea:misc.Mode8
ltx/en_uk_lash/oc.m8.d6:ocMA.Aposticha2.text	@ltx/en_uk_lash/he.a.m8:heAU.OEnEdemParadeisos.text
ltx/en_uk_lash/oc.m8.d6:ocMA.Aposticha3.greekmelody	@ltx/en_uk_lash/he.a.m8:heAU.TiYmasKalesomen.greekname
ltx/en_uk_lash/oc.m8.d6:ocMA.Aposticha3.incipit	@ltx/en_uk_lash/he.a.m8:heAU.TiYmasKalesomen.incipit
ltx/en_uk_lash/oc.m8.d6:ocMA.Aposticha3.melody	@ltx/en_uk_lash/he.a.m8:heAU.TiYmasKalesomen.melody
ltx/en_uk_lash/oc.m8.d6:ocMA.Aposticha3.mode	@ltx/en_uk_lash/miscellanea:misc.Mode8
ltx/en_uk_lash/oc.m8.d6:ocMA.Aposticha3.text	@ltx/en_uk_lash/he.a.m8:heAU.TiYmasKalesomen.text
ltx/en_uk_lash/oc.m8.d6:ocMA.C1.acrostic.notice1	
ltx/en_uk_lash/oc.m8.d6:ocMA.C1.acrostic.text	
ltx/en_uk_lash/oc.m8.d6:ocMA.C1.acrostic.title	
ltx/en_uk_lash/oc.m8.d6:ocMA.Kathisma11.incipit	@ltx/en_uk_lash/oc.m8.d4:ocMA.Kathisma11.incipit
ltx/en_uk_lash/oc.m8.d6:ocMA.Kathisma11.melody	
ltx/en_uk_lash/oc.m8.d6:ocMA.Kathisma11.mode	@ltx/en_uk_lash/miscellanea:misc.Mode8
ltx/en_uk_lash/oc.m8.d6:ocMA.Kathisma11.text	@ltx/en_uk_lash/oc.m8.d4:ocMA.Kathisma11.text
ltx/en_uk_lash/oc.m8.d6:ocMA.Kathisma12.incipit	@ltx/en_uk_lash/oc.m8.d4:ocMA.Kathisma12.incipit
ltx/en_uk_lash/oc.m8.d6:ocMA.Kathisma12.melody	
ltx/en_uk_lash/oc.m8.d6:ocMA.Kathisma12.mode	@ltx/en_uk_lash/miscellanea:misc.Mode8
ltx/en_uk_lash/oc.m8.d6:ocMA.Kathisma12.text	@ltx/en_uk_lash/oc.m8.d4:ocMA.Kathisma12.text
ltx/en_uk_lash/oc.m8.d6:ocMA.Kathisma13.greekmelody	@ltx/en_uk_lash/he.a.m8:heAU.ToProstachthen.greekname
ltx/en_uk_lash/oc.m8.d6:ocMA.Kathisma13.incipit	…
ltx/en_uk_lash/oc.m8.d6:ocMA.Kathisma13.melody	@ltx/en_uk_lash/he.a.m8:heAU.ToProstachthen.notmetered
ltx/en_uk_lash/oc.m8.d6:ocMA.Kathisma13.mode	@ltx/en_uk_lash/miscellanea:misc.Mode8
ltx/en_uk_lash/oc.m8.d6:ocMA.Kathisma13.text	
ltx/en_uk_lash/oc.m8.d6:ocMA.Kathisma21.greekmelody	@ltx/en_uk_lash/he.a.m8:heAU.AnestisEkNekron.greekname
ltx/en_uk_lash/oc.m8.d6:ocMA.Kathisma21.incipit	…
ltx/en_uk_lash/oc.m8.d6:ocMA.Kathisma21.melody	@ltx/en_uk_lash/he.a.m8:heAU.AnestisEkNekron.notmetered
ltx/en_uk_lash/oc.m8.d6:ocMA.Kathisma21.mode	@ltx/en_uk_lash/miscellanea:misc.Mode8
ltx/en_uk_lash/oc.m8.d6:ocMA.Kathisma21.text	
ltx/en_uk_lash/oc.m8.d6:ocMA.Kathisma21b.incipit	…
ltx/en_uk_lash/oc.m8.d6:ocMA.Kathisma21b.melody	@ltx/en_uk_lash/he.a.m8:heAU.TinSofianKaiLogon.notmetered
ltx/en_uk_lash/oc.m8.d6:ocMA.Kathisma21b.mode	@ltx/en_uk_lash/miscellanea:misc.Mode8
ltx/en_uk_lash/oc.m8.d6:ocMA.Kathisma21b.text	
ltx/en_uk_lash/oc.m8.d6:ocMA.Kathisma22.greekmelody	@ltx/en_uk_lash/he.a.m8:heAU.ToProstachthen.greekname
ltx/en_uk_lash/oc.m8.d6:ocMA.Kathisma22.incipit	…
ltx/en_uk_lash/oc.m8.d6:ocMA.Kathisma22.melody	@ltx/en_uk_lash/he.a.m8:heAU.ToProstachthen.notmetered
ltx/en_uk_lash/oc.m8.d6:ocMA.Kathisma22.mode	@ltx/en_uk_lash/miscellanea:misc.Mode8
ltx/en_uk_lash/oc.m8.d6:ocMA.Kathisma22.text	
ltx/en_uk_lash/oc.m8.d6:ocMA.Kathisma22b.incipit	…
ltx/en_uk_lash/oc.m8.d6:ocMA.Kathisma22b.melody	@ltx/en_uk_lash/he.a.m8:heAU.AnestisEkNekron.notmetered
ltx/en_uk_lash/oc.m8.d6:ocMA.Kathisma22b.mode	@ltx/en_uk_lash/miscellanea:misc.Mode8
ltx/en_uk_lash/oc.m8.d6:ocMA.Kathisma22b.text	
ltx/en_uk_lash/oc.m8.d6:ocMA.Kathisma23.greekmelody	@ltx/en_uk_lash/he.a.m8:heAU.ToProstachthen.greekname
ltx/en_uk_lash/oc.m8.d6:ocMA.Kathisma23.incipit	…
ltx/en_uk_lash/oc.m8.d6:ocMA.Kathisma23.melody	@ltx/en_uk_lash/he.a.m8:heAU.ToProstachthen.notmetered
ltx/en_uk_lash/oc.m8.d6:ocMA.Kathisma23.mode	@ltx/en_uk_lash/miscellanea:misc.Mode8
ltx/en_uk_lash/oc.m8.d6:ocMA.Kathisma23.text	
ltx/en_uk_lash/oc.m8.d6:ocMA.Kathisma31.greekmelody	@ltx/en_uk_lash/he.a.m8:heAU.AnestisEkNekron.greekname
ltx/en_uk_lash/oc.m8.d6:ocMA.Kathisma31.incipit	…
ltx/en_uk_lash/oc.m8.d6:ocMA.Kathisma31.melody	@ltx/en_uk_lash/he.a.m8:heAU.AnestisEkNekron.notmetered
ltx/en_uk_lash/oc.m8.d6:ocMA.Kathisma31.mode	@ltx/en_uk_lash/miscellanea:misc.Mode8
ltx/en_uk_lash/oc.m8.d6:ocMA.Kathisma31.text	
ltx/en_uk_lash/oc.m8.d6:ocMA.Kathisma32.incipit	…
ltx/en_uk_lash/oc.m8.d6:ocMA.Kathisma32.melody	
ltx/en_uk_lash/oc.m8.d6:ocMA.Kathisma32.mode	@ltx/en_uk_lash/miscellanea:misc.Mode8
ltx/en_uk_lash/oc.m8.d6:ocMA.Kathisma32.text	
ltx/en_uk_lash/oc.m8.d6:ocMA.Kathisma33.greekmelody	@ltx/en_uk_lash/he.a.m8:heAU.AnestisEkNekron.greekname
ltx/en_uk_lash/oc.m8.d6:ocMA.Kathisma33.incipit	…
ltx/en_uk_lash/oc.m8.d6:ocMA.Kathisma33.melody	@ltx/en_uk_lash/he.a.m8:heAU.AnestisEkNekron.notmetered
ltx/en_uk_lash/oc.m8.d6:ocMA.Kathisma33.mode	@ltx/en_uk_lash/miscellanea:misc.Mode8
ltx/en_uk_lash/oc.m8.d6:ocMA.Kathisma33.text	
ltx/en_uk_lash/oc.m8.d6:ocMA.OdeW1C11.incipit	…
ltx/en_uk_lash/oc.m8.d6:ocMA.OdeW1C11.melody	@ltx/en_uk_lash/he.h.m8:heHE.StavronCharaxasMosis.name
ltx/en_uk_lash/oc.m8.d6:ocMA.OdeW1C11.mode	@ltx/en_uk_lash/miscellanea:misc.Mode8
ltx/en_uk_lash/oc.m8.d6:ocMA.OdeW1C11.ode	@ltx/en_uk_lash/miscellanea:misc.Ode1
ltx/en_uk_lash/oc.m8.d6:ocMA.OdeW1C11.text	
ltx/en_uk_lash/oc.m8.d6:ocMA.OdeW1C12.incipit	…
ltx/en_uk_lash/oc.m8.d6:ocMA.OdeW1C12.melody	@ltx/en_uk_lash/he.h.m8:heHE.StavronCharaxasMosis.name
ltx/en_uk_lash/oc.m8.d6:ocMA.OdeW1C12.mode	@ltx/en_uk_lash/miscellanea:misc.Mode8
ltx/en_uk_lash/oc.m8.d6:ocMA.OdeW1C12.ode	@ltx/en_uk_lash/miscellanea:misc.Ode1
ltx/en_uk_lash/oc.m8.d6:ocMA.OdeW1C12.text	
ltx/en_uk_lash/oc.m8.d6:ocMA.OdeW1C13.incipit	…
ltx/en_uk_lash/oc.m8.d6:ocMA.OdeW1C13.melody	@ltx/en_uk_lash/he.h.m8:heHE.StavronCharaxasMosis.name
ltx/en_uk_lash/oc.m8.d6:ocMA.OdeW1C13.mode	@ltx/en_uk_lash/miscellanea:misc.Mode8
ltx/en_uk_lash/oc.m8.d6:ocMA.OdeW1C13.ode	@ltx/en_uk_lash/miscellanea:misc.Ode1
ltx/en_uk_lash/oc.m8.d6:ocMA.OdeW1C13.text	
ltx/en_uk_lash/oc.m8.d6:ocMA.OdeW1C14.incipit	…
ltx/en_uk_lash/oc.m8.d6:ocMA.OdeW1C14.melody	@ltx/en_uk_lash/he.h.m8:heHE.StavronCharaxasMosis.name
ltx/en_uk_lash/oc.m8.d6:ocMA.OdeW1C14.mode	@ltx/en_uk_lash/miscellanea:misc.Mode8
ltx/en_uk_lash/oc.m8.d6:ocMA.OdeW1C14.ode	@ltx/en_uk_lash/miscellanea:misc.Ode1
ltx/en_uk_lash/oc.m8.d6:ocMA.OdeW1C14.text	
ltx/en_uk_lash/oc.m8.d6:ocMA.OdeW1C1H.greekmelody	@ltx/en_uk_lash/he.h.m8:heHE.StavronCharaxasMosis.greekname
ltx/en_uk_lash/oc.m8.d6:ocMA.OdeW1C1H.incipit	@ltx/en_uk_lash/he.h.m8:heHE.StavronCharaxasMosis.incipit
ltx/en_uk_lash/oc.m8.d6:ocMA.OdeW1C1H.melody	@ltx/en_uk_lash/he.h.m8:heHE.StavronCharaxasMosis.melody
ltx/en_uk_lash/oc.m8.d6:ocMA.OdeW1C1H.mode	@ltx/en_uk_lash/miscellanea:misc.Mode8
ltx/en_uk_lash/oc.m8.d6:ocMA.OdeW1C1H.ode	@ltx/en_uk_lash/miscellanea:misc.Ode1
ltx/en_uk_lash/oc.m8.d6:ocMA.OdeW1C1H.text	@ltx/en_uk_lash/he.h.m8:heHE.StavronCharaxasMosis.text
ltx/en_uk_lash/oc.m8.d6:ocMA.OdeW1C1T.incipit	…
ltx/en_uk_lash/oc.m8.d6:ocMA.OdeW1C1T.melody	@ltx/en_uk_lash/he.h.m8:heHE.StavronCharaxasMosis.name
ltx/en_uk_lash/oc.m8.d6:ocMA.OdeW1C1T.mode	@ltx/en_uk_lash/miscellanea:misc.Mode8
ltx/en_uk_lash/oc.m8.d6:ocMA.OdeW1C1T.ode	@ltx/en_uk_lash/miscellanea:misc.Ode1
ltx/en_uk_lash/oc.m8.d6:ocMA.OdeW1C1T.text	
ltx/en_uk_lash/oc.m8.d6:ocMA.OdeW1C21.greekmelody	@ltx/en_uk_lash/he.h.m8:heHE.ArmatilatinFarao.greekname
ltx/en_uk_lash/oc.m8.d6:ocMA.OdeW1C21.incipit	…
ltx/en_uk_lash/oc.m8.d6:ocMA.OdeW1C21.melody	@ltx/en_uk_lash/he.h.m8:heHE.ArmatilatinFarao.name
ltx/en_uk_lash/oc.m8.d6:ocMA.OdeW1C21.mode	@ltx/en_uk_lash/miscellanea:misc.Mode8
ltx/en_uk_lash/oc.m8.d6:ocMA.OdeW1C21.ode	@ltx/en_uk_lash/miscellanea:misc.Ode1
ltx/en_uk_lash/oc.m8.d6:ocMA.OdeW1C21.text	
ltx/en_uk_lash/oc.m8.d6:ocMA.OdeW1C22.incipit	…
ltx/en_uk_lash/oc.m8.d6:ocMA.OdeW1C22.melody	@ltx/en_uk_lash/he.h.m8:heHE.ArmatilatinFarao.name
ltx/en_uk_lash/oc.m8.d6:ocMA.OdeW1C22.mode	@ltx/en_uk_lash/miscellanea:misc.Mode8
ltx/en_uk_lash/oc.m8.d6:ocMA.OdeW1C22.ode	@ltx/en_uk_lash/miscellanea:misc.Ode1
ltx/en_uk_lash/oc.m8.d6:ocMA.OdeW1C22.text	
ltx/en_uk_lash/oc.m8.d6:ocMA.OdeW1C23.incipit	…
ltx/en_uk_lash/oc.m8.d6:ocMA.OdeW1C23.melody	@ltx/en_uk_lash/he.h.m8:heHE.ArmatilatinFarao.name
ltx/en_uk_lash/oc.m8.d6:ocMA.OdeW1C23.mode	@ltx/en_uk_lash/miscellanea:misc.Mode8
ltx/en_uk_lash/oc.m8.d6:ocMA.OdeW1C23.ode	@ltx/en_uk_lash/miscellanea:misc.Ode1
ltx/en_uk_lash/oc.m8.d6:ocMA.OdeW1C23.text	
ltx/en_uk_lash/oc.m8.d6:ocMA.OdeW1C24.incipit	…
ltx/en_uk_lash/oc.m8.d6:ocMA.OdeW1C24.melody	@ltx/en_uk_lash/he.h.m8:heHE.ArmatilatinFarao.name
ltx/en_uk_lash/oc.m8.d6:ocMA.OdeW1C24.mode	@ltx/en_uk_lash/miscellanea:misc.Mode8
ltx/en_uk_lash/oc.m8.d6:ocMA.OdeW1C24.ode	@ltx/en_uk_lash/miscellanea:misc.Ode1
ltx/en_uk_lash/oc.m8.d6:ocMA.OdeW1C24.text	
ltx/en_uk_lash/oc.m8.d6:ocMA.OdeW3C11.incipit	…
ltx/en_uk_lash/oc.m8.d6:ocMA.OdeW3C11.melody	@ltx/en_uk_lash/he.h.m8:heHE.RavdosEisTypon.name
ltx/en_uk_lash/oc.m8.d6:ocMA.OdeW3C11.mode	@ltx/en_uk_lash/miscellanea:misc.Mode8
ltx/en_uk_lash/oc.m8.d6:ocMA.OdeW3C11.ode	@ltx/en_uk_lash/miscellanea:misc.Ode3
ltx/en_uk_lash/oc.m8.d6:ocMA.OdeW3C11.text	
ltx/en_uk_lash/oc.m8.d6:ocMA.OdeW3C12.incipit	…
ltx/en_uk_lash/oc.m8.d6:ocMA.OdeW3C12.melody	@ltx/en_uk_lash/he.h.m8:heHE.RavdosEisTypon.name
ltx/en_uk_lash/oc.m8.d6:ocMA.OdeW3C12.mode	@ltx/en_uk_lash/miscellanea:misc.Mode8
ltx/en_uk_lash/oc.m8.d6:ocMA.OdeW3C12.ode	@ltx/en_uk_lash/miscellanea:misc.Ode3
ltx/en_uk_lash/oc.m8.d6:ocMA.OdeW3C12.text	
ltx/en_uk_lash/oc.m8.d6:ocMA.OdeW3C13.incipit	…
ltx/en_uk_lash/oc.m8.d6:ocMA.OdeW3C13.melody	@ltx/en_uk_lash/he.h.m8:heHE.RavdosEisTypon.name
ltx/en_uk_lash/oc.m8.d6:ocMA.OdeW3C13.mode	@ltx/en_uk_lash/miscellanea:misc.Mode8
ltx/en_uk_lash/oc.m8.d6:ocMA.OdeW3C13.ode	@ltx/en_uk_lash/miscellanea:misc.Ode3
ltx/en_uk_lash/oc.m8.d6:ocMA.OdeW3C13.text	
ltx/en_uk_lash/oc.m8.d6:ocMA.OdeW3C14.incipit	…
ltx/en_uk_lash/oc.m8.d6:ocMA.OdeW3C14.melody	@ltx/en_uk_lash/he.h.m8:heHE.RavdosEisTypon.name
ltx/en_uk_lash/oc.m8.d6:ocMA.OdeW3C14.mode	@ltx/en_uk_lash/miscellanea:misc.Mode8
ltx/en_uk_lash/oc.m8.d6:ocMA.OdeW3C14.ode	@ltx/en_uk_lash/miscellanea:misc.Ode3
ltx/en_uk_lash/oc.m8.d6:ocMA.OdeW3C14.text	
ltx/en_uk_lash/oc.m8.d6:ocMA.OdeW3C1H.greekmelody	@ltx/en_uk_lash/he.h.m8:heHE.RavdosEisTypon.greekname
ltx/en_uk_lash/oc.m8.d6:ocMA.OdeW3C1H.incipit	@ltx/en_uk_lash/he.h.m8:heHE.RavdosEisTypon.incipit
ltx/en_uk_lash/oc.m8.d6:ocMA.OdeW3C1H.melody	@ltx/en_uk_lash/he.h.m8:heHE.RavdosEisTypon.melody
ltx/en_uk_lash/oc.m8.d6:ocMA.OdeW3C1H.mode	@ltx/en_uk_lash/miscellanea:misc.Mode8
ltx/en_uk_lash/oc.m8.d6:ocMA.OdeW3C1H.ode	@ltx/en_uk_lash/miscellanea:misc.Ode3
ltx/en_uk_lash/oc.m8.d6:ocMA.OdeW3C1H.text	@ltx/en_uk_lash/he.h.m8:heHE.RavdosEisTypon.text
ltx/en_uk_lash/oc.m8.d6:ocMA.OdeW3C1T.incipit	…
ltx/en_uk_lash/oc.m8.d6:ocMA.OdeW3C1T.melody	@ltx/en_uk_lash/he.h.m8:heHE.RavdosEisTypon.name
ltx/en_uk_lash/oc.m8.d6:ocMA.OdeW3C1T.mode	@ltx/en_uk_lash/miscellanea:misc.Mode8
ltx/en_uk_lash/oc.m8.d6:ocMA.OdeW3C1T.ode	@ltx/en_uk_lash/miscellanea:misc.Ode3
ltx/en_uk_lash/oc.m8.d6:ocMA.OdeW3C1T.text	
ltx/en_uk_lash/oc.m8.d6:ocMA.OdeW3C21.greekmelody	@ltx/en_uk_lash/he.h.m8:heHE.OStereosasKatArchas.greekname
ltx/en_uk_lash/oc.m8.d6:ocMA.OdeW3C21.incipit	…
ltx/en_uk_lash/oc.m8.d6:ocMA.OdeW3C21.melody	@ltx/en_uk_lash/he.h.m8:heHE.OStereosasKatArchas.name
ltx/en_uk_lash/oc.m8.d6:ocMA.OdeW3C21.mode	@ltx/en_uk_lash/miscellanea:misc.Mode8
ltx/en_uk_lash/oc.m8.d6:ocMA.OdeW3C21.ode	@ltx/en_uk_lash/miscellanea:misc.Ode3
ltx/en_uk_lash/oc.m8.d6:ocMA.OdeW3C21.text	
ltx/en_uk_lash/oc.m8.d6:ocMA.OdeW3C22.incipit	…
ltx/en_uk_lash/oc.m8.d6:ocMA.OdeW3C22.melody	@ltx/en_uk_lash/he.h.m8:heHE.OStereosasKatArchas.name
ltx/en_uk_lash/oc.m8.d6:ocMA.OdeW3C22.mode	@ltx/en_uk_lash/miscellanea:misc.Mode8
ltx/en_uk_lash/oc.m8.d6:ocMA.OdeW3C22.ode	@ltx/en_uk_lash/miscellanea:misc.Ode3
ltx/en_uk_lash/oc.m8.d6:ocMA.OdeW3C22.text	
ltx/en_uk_lash/oc.m8.d6:ocMA.OdeW3C23.incipit	…
ltx/en_uk_lash/oc.m8.d6:ocMA.OdeW3C23.melody	@ltx/en_uk_lash/he.h.m8:heHE.OStereosasKatArchas.name
ltx/en_uk_lash/oc.m8.d6:ocMA.OdeW3C23.mode	@ltx/en_uk_lash/miscellanea:misc.Mode8
ltx/en_uk_lash/oc.m8.d6:ocMA.OdeW3C23.ode	@ltx/en_uk_lash/miscellanea:misc.Ode3
ltx/en_uk_lash/oc.m8.d6:ocMA.OdeW3C23.text	
ltx/en_uk_lash/oc.m8.d6:ocMA.OdeW3C24.incipit	…
ltx/en_uk_lash/oc.m8.d6:ocMA.OdeW3C24.melody	@ltx/en_uk_lash/he.h.m8:heHE.OStereosasKatArchas.name
ltx/en_uk_lash/oc.m8.d6:ocMA.OdeW3C24.mode	@ltx/en_uk_lash/miscellanea:misc.Mode8
ltx/en_uk_lash/oc.m8.d6:ocMA.OdeW3C24.ode	@ltx/en_uk_lash/miscellanea:misc.Ode3
ltx/en_uk_lash/oc.m8.d6:ocMA.OdeW3C24.text	
ltx/en_uk_lash/oc.m8.d6:ocMA.OdeW4C11.incipit	…
ltx/en_uk_lash/oc.m8.d6:ocMA.OdeW4C11.melody	@ltx/en_uk_lash/he.h.m8:heHE.EisakikoaKyrie.name
ltx/en_uk_lash/oc.m8.d6:ocMA.OdeW4C11.mode	@ltx/en_uk_lash/miscellanea:misc.Mode8
ltx/en_uk_lash/oc.m8.d6:ocMA.OdeW4C11.ode	@ltx/en_uk_lash/miscellanea:misc.Ode4
ltx/en_uk_lash/oc.m8.d6:ocMA.OdeW4C11.text	
ltx/en_uk_lash/oc.m8.d6:ocMA.OdeW4C12.incipit	…
ltx/en_uk_lash/oc.m8.d6:ocMA.OdeW4C12.melody	@ltx/en_uk_lash/he.h.m8:heHE.EisakikoaKyrie.name
ltx/en_uk_lash/oc.m8.d6:ocMA.OdeW4C12.mode	@ltx/en_uk_lash/miscellanea:misc.Mode8
ltx/en_uk_lash/oc.m8.d6:ocMA.OdeW4C12.ode	@ltx/en_uk_lash/miscellanea:misc.Ode4
ltx/en_uk_lash/oc.m8.d6:ocMA.OdeW4C12.text	
ltx/en_uk_lash/oc.m8.d6:ocMA.OdeW4C13.incipit	…
ltx/en_uk_lash/oc.m8.d6:ocMA.OdeW4C13.melody	@ltx/en_uk_lash/he.h.m8:heHE.EisakikoaKyrie.name
ltx/en_uk_lash/oc.m8.d6:ocMA.OdeW4C13.mode	@ltx/en_uk_lash/miscellanea:misc.Mode8
ltx/en_uk_lash/oc.m8.d6:ocMA.OdeW4C13.ode	@ltx/en_uk_lash/miscellanea:misc.Ode4
ltx/en_uk_lash/oc.m8.d6:ocMA.OdeW4C13.text	
ltx/en_uk_lash/oc.m8.d6:ocMA.OdeW4C14.incipit	…
ltx/en_uk_lash/oc.m8.d6:ocMA.OdeW4C14.melody	@ltx/en_uk_lash/he.h.m8:heHE.EisakikoaKyrie.name
ltx/en_uk_lash/oc.m8.d6:ocMA.OdeW4C14.mode	@ltx/en_uk_lash/miscellanea:misc.Mode8
ltx/en_uk_lash/oc.m8.d6:ocMA.OdeW4C14.ode	@ltx/en_uk_lash/miscellanea:misc.Ode4
ltx/en_uk_lash/oc.m8.d6:ocMA.OdeW4C14.text	
ltx/en_uk_lash/oc.m8.d6:ocMA.OdeW4C15.incipit	…
ltx/en_uk_lash/oc.m8.d6:ocMA.OdeW4C15.melody	@ltx/en_uk_lash/he.h.m8:heHE.EisakikoaKyrie.name
ltx/en_uk_lash/oc.m8.d6:ocMA.OdeW4C15.mode	@ltx/en_uk_lash/miscellanea:misc.Mode8
ltx/en_uk_lash/oc.m8.d6:ocMA.OdeW4C15.ode	@ltx/en_uk_lash/miscellanea:misc.Ode4
ltx/en_uk_lash/oc.m8.d6:ocMA.OdeW4C15.text	
ltx/en_uk_lash/oc.m8.d6:ocMA.OdeW4C1H.greekmelody	@ltx/en_uk_lash/he.h.m8:heHE.EisakikoaKyrie.greekname
ltx/en_uk_lash/oc.m8.d6:ocMA.OdeW4C1H.incipit	@ltx/en_uk_lash/he.h.m8:heHE.EisakikoaKyrie.incipit
ltx/en_uk_lash/oc.m8.d6:ocMA.OdeW4C1H.melody	@ltx/en_uk_lash/he.h.m8:heHE.EisakikoaKyrie.melody
ltx/en_uk_lash/oc.m8.d6:ocMA.OdeW4C1H.mode	@ltx/en_uk_lash/miscellanea:misc.Mode8
ltx/en_uk_lash/oc.m8.d6:ocMA.OdeW4C1H.ode	@ltx/en_uk_lash/miscellanea:misc.Ode4
ltx/en_uk_lash/oc.m8.d6:ocMA.OdeW4C1H.text	@ltx/en_uk_lash/he.h.m8:heHE.EisakikoaKyrie.text
ltx/en_uk_lash/oc.m8.d6:ocMA.OdeW4C1T.incipit	…
ltx/en_uk_lash/oc.m8.d6:ocMA.OdeW4C1T.melody	@ltx/en_uk_lash/he.h.m8:heHE.EisakikoaKyrie.name
ltx/en_uk_lash/oc.m8.d6:ocMA.OdeW4C1T.mode	@ltx/en_uk_lash/miscellanea:misc.Mode8
ltx/en_uk_lash/oc.m8.d6:ocMA.OdeW4C1T.ode	@ltx/en_uk_lash/miscellanea:misc.Ode4
ltx/en_uk_lash/oc.m8.d6:ocMA.OdeW4C1T.text	
ltx/en_uk_lash/oc.m8.d6:ocMA.OdeW4C21.greekmelody	@ltx/en_uk_lash/he.h.m8:heHE.SyMouIschys.greekname
ltx/en_uk_lash/oc.m8.d6:ocMA.OdeW4C21.incipit	…
ltx/en_uk_lash/oc.m8.d6:ocMA.OdeW4C21.melody	@ltx/en_uk_lash/he.h.m8:heHE.SyMouIschys.name
ltx/en_uk_lash/oc.m8.d6:ocMA.OdeW4C21.mode	@ltx/en_uk_lash/miscellanea:misc.Mode8
ltx/en_uk_lash/oc.m8.d6:ocMA.OdeW4C21.ode	@ltx/en_uk_lash/miscellanea:misc.Ode4
ltx/en_uk_lash/oc.m8.d6:ocMA.OdeW4C21.text	
ltx/en_uk_lash/oc.m8.d6:ocMA.OdeW4C22.incipit	…
ltx/en_uk_lash/oc.m8.d6:ocMA.OdeW4C22.melody	@ltx/en_uk_lash/he.h.m8:heHE.SyMouIschys.name
ltx/en_uk_lash/oc.m8.d6:ocMA.OdeW4C22.mode	@ltx/en_uk_lash/miscellanea:misc.Mode8
ltx/en_uk_lash/oc.m8.d6:ocMA.OdeW4C22.ode	@ltx/en_uk_lash/miscellanea:misc.Ode4
ltx/en_uk_lash/oc.m8.d6:ocMA.OdeW4C22.text	
ltx/en_uk_lash/oc.m8.d6:ocMA.OdeW4C23.incipit	…
ltx/en_uk_lash/oc.m8.d6:ocMA.OdeW4C23.melody	@ltx/en_uk_lash/he.h.m8:heHE.SyMouIschys.name
ltx/en_uk_lash/oc.m8.d6:ocMA.OdeW4C23.mode	@ltx/en_uk_lash/miscellanea:misc.Mode8
ltx/en_uk_lash/oc.m8.d6:ocMA.OdeW4C23.ode	@ltx/en_uk_lash/miscellanea:misc.Ode4
ltx/en_uk_lash/oc.m8.d6:ocMA.OdeW4C23.text	
ltx/en_uk_lash/oc.m8.d6:ocMA.OdeW4C24.incipit	…
ltx/en_uk_lash/oc.m8.d6:ocMA.OdeW4C24.melody	@ltx/en_uk_lash/he.h.m8:heHE.SyMouIschys.name
ltx/en_uk_lash/oc.m8.d6:ocMA.OdeW4C24.mode	@ltx/en_uk_lash/miscellanea:misc.Mode8
ltx/en_uk_lash/oc.m8.d6:ocMA.OdeW4C24.ode	@ltx/en_uk_lash/miscellanea:misc.Ode4
ltx/en_uk_lash/oc.m8.d6:ocMA.OdeW4C24.text	
ltx/en_uk_lash/oc.m8.d6:ocMA.OdeW5C11.incipit	…
ltx/en_uk_lash/oc.m8.d6:ocMA.OdeW5C11.melody	@ltx/en_uk_lash/he.h.m8:heHE.OTrismakaristonXylon.name
ltx/en_uk_lash/oc.m8.d6:ocMA.OdeW5C11.mode	@ltx/en_uk_lash/miscellanea:misc.Mode8
ltx/en_uk_lash/oc.m8.d6:ocMA.OdeW5C11.ode	@ltx/en_uk_lash/miscellanea:misc.Ode5
ltx/en_uk_lash/oc.m8.d6:ocMA.OdeW5C11.text	
ltx/en_uk_lash/oc.m8.d6:ocMA.OdeW5C12.incipit	…
ltx/en_uk_lash/oc.m8.d6:ocMA.OdeW5C12.melody	@ltx/en_uk_lash/he.h.m8:heHE.OTrismakaristonXylon.name
ltx/en_uk_lash/oc.m8.d6:ocMA.OdeW5C12.mode	@ltx/en_uk_lash/miscellanea:misc.Mode8
ltx/en_uk_lash/oc.m8.d6:ocMA.OdeW5C12.ode	@ltx/en_uk_lash/miscellanea:misc.Ode5
ltx/en_uk_lash/oc.m8.d6:ocMA.OdeW5C12.text	
ltx/en_uk_lash/oc.m8.d6:ocMA.OdeW5C13.incipit	…
ltx/en_uk_lash/oc.m8.d6:ocMA.OdeW5C13.melody	@ltx/en_uk_lash/he.h.m8:heHE.OTrismakaristonXylon.name
ltx/en_uk_lash/oc.m8.d6:ocMA.OdeW5C13.mode	@ltx/en_uk_lash/miscellanea:misc.Mode8
ltx/en_uk_lash/oc.m8.d6:ocMA.OdeW5C13.ode	@ltx/en_uk_lash/miscellanea:misc.Ode5
ltx/en_uk_lash/oc.m8.d6:ocMA.OdeW5C13.text	
ltx/en_uk_lash/oc.m8.d6:ocMA.OdeW5C14.incipit	…
ltx/en_uk_lash/oc.m8.d6:ocMA.OdeW5C14.melody	@ltx/en_uk_lash/he.h.m8:heHE.OTrismakaristonXylon.name
ltx/en_uk_lash/oc.m8.d6:ocMA.OdeW5C14.mode	@ltx/en_uk_lash/miscellanea:misc.Mode8
ltx/en_uk_lash/oc.m8.d6:ocMA.OdeW5C14.ode	@ltx/en_uk_lash/miscellanea:misc.Ode5
ltx/en_uk_lash/oc.m8.d6:ocMA.OdeW5C14.text	
ltx/en_uk_lash/oc.m8.d6:ocMA.OdeW5C1H.greekmelody	@ltx/en_uk_lash/he.h.m8:heHE.OTrismakaristonXylon.greekname
ltx/en_uk_lash/oc.m8.d6:ocMA.OdeW5C1H.incipit	@ltx/en_uk_lash/he.h.m8:heHE.OTrismakaristonXylon.incipit
ltx/en_uk_lash/oc.m8.d6:ocMA.OdeW5C1H.melody	@ltx/en_uk_lash/he.h.m8:heHE.OTrismakaristonXylon.melody
ltx/en_uk_lash/oc.m8.d6:ocMA.OdeW5C1H.mode	@ltx/en_uk_lash/miscellanea:misc.Mode8
ltx/en_uk_lash/oc.m8.d6:ocMA.OdeW5C1H.ode	@ltx/en_uk_lash/miscellanea:misc.Ode5
ltx/en_uk_lash/oc.m8.d6:ocMA.OdeW5C1H.text	@ltx/en_uk_lash/he.h.m8:heHE.OTrismakaristonXylon.text
ltx/en_uk_lash/oc.m8.d6:ocMA.OdeW5C1T.incipit	…
ltx/en_uk_lash/oc.m8.d6:ocMA.OdeW5C1T.melody	@ltx/en_uk_lash/he.h.m8:heHE.OTrismakaristonXylon.name
ltx/en_uk_lash/oc.m8.d6:ocMA.OdeW5C1T.mode	@ltx/en_uk_lash/miscellanea:misc.Mode8
ltx/en_uk_lash/oc.m8.d6:ocMA.OdeW5C1T.ode	@ltx/en_uk_lash/miscellanea:misc.Ode5
ltx/en_uk_lash/oc.m8.d6:ocMA.OdeW5C1T.text	
ltx/en_uk_lash/oc.m8.d6:ocMA.OdeW5C21.greekmelody	@ltx/en_uk_lash/he.h.m8:heHE.InaTiMeAposo.greekname
ltx/en_uk_lash/oc.m8.d6:ocMA.OdeW5C21.incipit	…
ltx/en_uk_lash/oc.m8.d6:ocMA.OdeW5C21.melody	@ltx/en_uk_lash/he.h.m8:heHE.InaTiMeAposo.name
ltx/en_uk_lash/oc.m8.d6:ocMA.OdeW5C21.mode	@ltx/en_uk_lash/miscellanea:misc.Mode8
ltx/en_uk_lash/oc.m8.d6:ocMA.OdeW5C21.ode	@ltx/en_uk_lash/miscellanea:misc.Ode5
ltx/en_uk_lash/oc.m8.d6:ocMA.OdeW5C21.text	
ltx/en_uk_lash/oc.m8.d6:ocMA.OdeW5C22.incipit	…
ltx/en_uk_lash/oc.m8.d6:ocMA.OdeW5C22.melody	@ltx/en_uk_lash/he.h.m8:heHE.InaTiMeAposo.name
ltx/en_uk_lash/oc.m8.d6:ocMA.OdeW5C22.mode	@ltx/en_uk_lash/miscellanea:misc.Mode8
ltx/en_uk_lash/oc.m8.d6:ocMA.OdeW5C22.ode	@ltx/en_uk_lash/miscellanea:misc.Ode5
ltx/en_uk_lash/oc.m8.d6:ocMA.OdeW5C22.text	
ltx/en_uk_lash/oc.m8.d6:ocMA.OdeW5C23.incipit	…
ltx/en_uk_lash/oc.m8.d6:ocMA.OdeW5C23.melody	@ltx/en_uk_lash/he.h.m8:heHE.InaTiMeAposo.name
ltx/en_uk_lash/oc.m8.d6:ocMA.OdeW5C23.mode	@ltx/en_uk_lash/miscellanea:misc.Mode8
ltx/en_uk_lash/oc.m8.d6:ocMA.OdeW5C23.ode	@ltx/en_uk_lash/miscellanea:misc.Ode5
ltx/en_uk_lash/oc.m8.d6:ocMA.OdeW5C23.text	
ltx/en_uk_lash/oc.m8.d6:ocMA.OdeW5C24.incipit	…
ltx/en_uk_lash/oc.m8.d6:ocMA.OdeW5C24.melody	@ltx/en_uk_lash/he.h.m8:heHE.InaTiMeAposo.name
ltx/en_uk_lash/oc.m8.d6:ocMA.OdeW5C24.mode	@ltx/en_uk_lash/miscellanea:misc.Mode8
ltx/en_uk_lash/oc.m8.d6:ocMA.OdeW5C24.ode	@ltx/en_uk_lash/miscellanea:misc.Ode5
ltx/en_uk_lash/oc.m8.d6:ocMA.OdeW5C24.text	
ltx/en_uk_lash/oc.m8.d6:ocMA.OdeW6C11.incipit	…
ltx/en_uk_lash/oc.m8.d6:ocMA.OdeW6C11.melody	@ltx/en_uk_lash/he.h.m8:heHE.NotiouThiros.name
ltx/en_uk_lash/oc.m8.d6:ocMA.OdeW6C11.mode	@ltx/en_uk_lash/miscellanea:misc.Mode8
ltx/en_uk_lash/oc.m8.d6:ocMA.OdeW6C11.ode	@ltx/en_uk_lash/miscellanea:misc.Ode6
ltx/en_uk_lash/oc.m8.d6:ocMA.OdeW6C11.text	
ltx/en_uk_lash/oc.m8.d6:ocMA.OdeW6C12.incipit	…
ltx/en_uk_lash/oc.m8.d6:ocMA.OdeW6C12.melody	@ltx/en_uk_lash/he.h.m8:heHE.NotiouThiros.name
ltx/en_uk_lash/oc.m8.d6:ocMA.OdeW6C12.mode	@ltx/en_uk_lash/miscellanea:misc.Mode8
ltx/en_uk_lash/oc.m8.d6:ocMA.OdeW6C12.ode	@ltx/en_uk_lash/miscellanea:misc.Ode6
ltx/en_uk_lash/oc.m8.d6:ocMA.OdeW6C12.text	
ltx/en_uk_lash/oc.m8.d6:ocMA.OdeW6C13.incipit	…
ltx/en_uk_lash/oc.m8.d6:ocMA.OdeW6C13.melody	@ltx/en_uk_lash/he.h.m8:heHE.NotiouThiros.name
ltx/en_uk_lash/oc.m8.d6:ocMA.OdeW6C13.mode	@ltx/en_uk_lash/miscellanea:misc.Mode8
ltx/en_uk_lash/oc.m8.d6:ocMA.OdeW6C13.ode	@ltx/en_uk_lash/miscellanea:misc.Ode6
ltx/en_uk_lash/oc.m8.d6:ocMA.OdeW6C13.text	
ltx/en_uk_lash/oc.m8.d6:ocMA.OdeW6C14.incipit	…
ltx/en_uk_lash/oc.m8.d6:ocMA.OdeW6C14.melody	@ltx/en_uk_lash/he.h.m8:heHE.NotiouThiros.name
ltx/en_uk_lash/oc.m8.d6:ocMA.OdeW6C14.mode	@ltx/en_uk_lash/miscellanea:misc.Mode8
ltx/en_uk_lash/oc.m8.d6:ocMA.OdeW6C14.ode	@ltx/en_uk_lash/miscellanea:misc.Ode6
ltx/en_uk_lash/oc.m8.d6:ocMA.OdeW6C14.text	
ltx/en_uk_lash/oc.m8.d6:ocMA.OdeW6C1H.greekmelody	@ltx/en_uk_lash/he.h.m8:heHE.NotiouThiros.greekname
ltx/en_uk_lash/oc.m8.d6:ocMA.OdeW6C1H.incipit	@ltx/en_uk_lash/he.h.m8:heHE.NotiouThiros.incipit
ltx/en_uk_lash/oc.m8.d6:ocMA.OdeW6C1H.melody	@ltx/en_uk_lash/he.h.m8:heHE.NotiouThiros.melody
ltx/en_uk_lash/oc.m8.d6:ocMA.OdeW6C1H.mode	@ltx/en_uk_lash/miscellanea:misc.Mode8
ltx/en_uk_lash/oc.m8.d6:ocMA.OdeW6C1H.ode	@ltx/en_uk_lash/miscellanea:misc.Ode6
ltx/en_uk_lash/oc.m8.d6:ocMA.OdeW6C1H.text	@ltx/en_uk_lash/he.h.m8:heHE.NotiouThiros.text
ltx/en_uk_lash/oc.m8.d6:ocMA.OdeW6C1T.incipit	…
ltx/en_uk_lash/oc.m8.d6:ocMA.OdeW6C1T.melody	@ltx/en_uk_lash/he.h.m8:heHE.NotiouThiros.name
ltx/en_uk_lash/oc.m8.d6:ocMA.OdeW6C1T.mode	@ltx/en_uk_lash/miscellanea:misc.Mode8
ltx/en_uk_lash/oc.m8.d6:ocMA.OdeW6C1T.ode	@ltx/en_uk_lash/miscellanea:misc.Ode6
ltx/en_uk_lash/oc.m8.d6:ocMA.OdeW6C1T.text	
ltx/en_uk_lash/oc.m8.d6:ocMA.OdeW6C21.greekmelody	@ltx/en_uk_lash/he.h.m8:heHE.IlasthitiMoiSotir.greekname
ltx/en_uk_lash/oc.m8.d6:ocMA.OdeW6C21.incipit	…
ltx/en_uk_lash/oc.m8.d6:ocMA.OdeW6C21.melody	@ltx/en_uk_lash/he.h.m8:heHE.IlasthitiMoiSotir.name
ltx/en_uk_lash/oc.m8.d6:ocMA.OdeW6C21.mode	@ltx/en_uk_lash/miscellanea:misc.Mode8
ltx/en_uk_lash/oc.m8.d6:ocMA.OdeW6C21.ode	@ltx/en_uk_lash/miscellanea:misc.Ode6
ltx/en_uk_lash/oc.m8.d6:ocMA.OdeW6C21.text	
ltx/en_uk_lash/oc.m8.d6:ocMA.OdeW6C22.incipit	…
ltx/en_uk_lash/oc.m8.d6:ocMA.OdeW6C22.melody	@ltx/en_uk_lash/he.h.m8:heHE.IlasthitiMoiSotir.name
ltx/en_uk_lash/oc.m8.d6:ocMA.OdeW6C22.mode	@ltx/en_uk_lash/miscellanea:misc.Mode8
ltx/en_uk_lash/oc.m8.d6:ocMA.OdeW6C22.ode	@ltx/en_uk_lash/miscellanea:misc.Ode6
ltx/en_uk_lash/oc.m8.d6:ocMA.OdeW6C22.text	
ltx/en_uk_lash/oc.m8.d6:ocMA.OdeW6C23.incipit	…
ltx/en_uk_lash/oc.m8.d6:ocMA.OdeW6C23.melody	@ltx/en_uk_lash/he.h.m8:heHE.IlasthitiMoiSotir.name
ltx/en_uk_lash/oc.m8.d6:ocMA.OdeW6C23.mode	@ltx/en_uk_lash/miscellanea:misc.Mode8
ltx/en_uk_lash/oc.m8.d6:ocMA.OdeW6C23.ode	@ltx/en_uk_lash/miscellanea:misc.Ode6
ltx/en_uk_lash/oc.m8.d6:ocMA.OdeW6C23.text	
ltx/en_uk_lash/oc.m8.d6:ocMA.OdeW6C24.incipit	…
ltx/en_uk_lash/oc.m8.d6:ocMA.OdeW6C24.melody	@ltx/en_uk_lash/he.h.m8:heHE.IlasthitiMoiSotir.name
ltx/en_uk_lash/oc.m8.d6:ocMA.OdeW6C24.mode	@ltx/en_uk_lash/miscellanea:misc.Mode8
ltx/en_uk_lash/oc.m8.d6:ocMA.OdeW6C24.ode	@ltx/en_uk_lash/miscellanea:misc.Ode6
ltx/en_uk_lash/oc.m8.d6:ocMA.OdeW6C24.text	
ltx/en_uk_lash/oc.m8.d6:ocMA.OdeW7C11.incipit	…
ltx/en_uk_lash/oc.m8.d6:ocMA.OdeW7C11.melody	@ltx/en_uk_lash/he.h.m8:heHE.EknoonProstagma.name
ltx/en_uk_lash/oc.m8.d6:ocMA.OdeW7C11.mode	@ltx/en_uk_lash/miscellanea:misc.Mode8
ltx/en_uk_lash/oc.m8.d6:ocMA.OdeW7C11.ode	@ltx/en_uk_lash/miscellanea:misc.Ode7
ltx/en_uk_lash/oc.m8.d6:ocMA.OdeW7C11.text	
ltx/en_uk_lash/oc.m8.d6:ocMA.OdeW7C12.incipit	…
ltx/en_uk_lash/oc.m8.d6:ocMA.OdeW7C12.melody	@ltx/en_uk_lash/he.h.m8:heHE.EknoonProstagma.name
ltx/en_uk_lash/oc.m8.d6:ocMA.OdeW7C12.mode	@ltx/en_uk_lash/miscellanea:misc.Mode8
ltx/en_uk_lash/oc.m8.d6:ocMA.OdeW7C12.ode	@ltx/en_uk_lash/miscellanea:misc.Ode7
ltx/en_uk_lash/oc.m8.d6:ocMA.OdeW7C12.text	
ltx/en_uk_lash/oc.m8.d6:ocMA.OdeW7C13.incipit	…
ltx/en_uk_lash/oc.m8.d6:ocMA.OdeW7C13.melody	@ltx/en_uk_lash/he.h.m8:heHE.EknoonProstagma.name
ltx/en_uk_lash/oc.m8.d6:ocMA.OdeW7C13.mode	@ltx/en_uk_lash/miscellanea:misc.Mode8
ltx/en_uk_lash/oc.m8.d6:ocMA.OdeW7C13.ode	@ltx/en_uk_lash/miscellanea:misc.Ode7
ltx/en_uk_lash/oc.m8.d6:ocMA.OdeW7C13.text	
ltx/en_uk_lash/oc.m8.d6:ocMA.OdeW7C14.incipit	…
ltx/en_uk_lash/oc.m8.d6:ocMA.OdeW7C14.melody	@ltx/en_uk_lash/he.h.m8:heHE.EknoonProstagma.name
ltx/en_uk_lash/oc.m8.d6:ocMA.OdeW7C14.mode	@ltx/en_uk_lash/miscellanea:misc.Mode8
ltx/en_uk_lash/oc.m8.d6:ocMA.OdeW7C14.ode	@ltx/en_uk_lash/miscellanea:misc.Ode7
ltx/en_uk_lash/oc.m8.d6:ocMA.OdeW7C14.text	
ltx/en_uk_lash/oc.m8.d6:ocMA.OdeW7C1H.greekmelody	@ltx/en_uk_lash/he.h.m8:heHE.EknoonProstagma.greekname
ltx/en_uk_lash/oc.m8.d6:ocMA.OdeW7C1H.incipit	@ltx/en_uk_lash/he.h.m8:heHE.EknoonProstagma.incipit
ltx/en_uk_lash/oc.m8.d6:ocMA.OdeW7C1H.melody	@ltx/en_uk_lash/he.h.m8:heHE.EknoonProstagma.melody
ltx/en_uk_lash/oc.m8.d6:ocMA.OdeW7C1H.mode	@ltx/en_uk_lash/miscellanea:misc.Mode8
ltx/en_uk_lash/oc.m8.d6:ocMA.OdeW7C1H.ode	@ltx/en_uk_lash/miscellanea:misc.Ode7
ltx/en_uk_lash/oc.m8.d6:ocMA.OdeW7C1H.text	@ltx/en_uk_lash/he.h.m8:heHE.EknoonProstagma.text
ltx/en_uk_lash/oc.m8.d6:ocMA.OdeW7C1T.incipit	…
ltx/en_uk_lash/oc.m8.d6:ocMA.OdeW7C1T.melody	@ltx/en_uk_lash/he.h.m8:heHE.EknoonProstagma.name
ltx/en_uk_lash/oc.m8.d6:ocMA.OdeW7C1T.mode	@ltx/en_uk_lash/miscellanea:misc.Mode8
ltx/en_uk_lash/oc.m8.d6:ocMA.OdeW7C1T.ode	@ltx/en_uk_lash/miscellanea:misc.Ode7
ltx/en_uk_lash/oc.m8.d6:ocMA.OdeW7C1T.text	
ltx/en_uk_lash/oc.m8.d6:ocMA.OdeW7C21.greekmelody	@ltx/en_uk_lash/he.h.m8:heHE.TheouSynkatavasin.greekname
ltx/en_uk_lash/oc.m8.d6:ocMA.OdeW7C21.incipit	…
ltx/en_uk_lash/oc.m8.d6:ocMA.OdeW7C21.melody	@ltx/en_uk_lash/he.h.m8:heHE.TheouSynkatavasin.name
ltx/en_uk_lash/oc.m8.d6:ocMA.OdeW7C21.mode	@ltx/en_uk_lash/miscellanea:misc.Mode8
ltx/en_uk_lash/oc.m8.d6:ocMA.OdeW7C21.ode	@ltx/en_uk_lash/miscellanea:misc.Ode7
ltx/en_uk_lash/oc.m8.d6:ocMA.OdeW7C21.text	
ltx/en_uk_lash/oc.m8.d6:ocMA.OdeW7C22.incipit	…
ltx/en_uk_lash/oc.m8.d6:ocMA.OdeW7C22.melody	@ltx/en_uk_lash/he.h.m8:heHE.TheouSynkatavasin.name
ltx/en_uk_lash/oc.m8.d6:ocMA.OdeW7C22.mode	@ltx/en_uk_lash/miscellanea:misc.Mode8
ltx/en_uk_lash/oc.m8.d6:ocMA.OdeW7C22.ode	@ltx/en_uk_lash/miscellanea:misc.Ode7
ltx/en_uk_lash/oc.m8.d6:ocMA.OdeW7C22.text	
ltx/en_uk_lash/oc.m8.d6:ocMA.OdeW7C23.incipit	…
ltx/en_uk_lash/oc.m8.d6:ocMA.OdeW7C23.melody	@ltx/en_uk_lash/he.h.m8:heHE.TheouSynkatavasin.name
ltx/en_uk_lash/oc.m8.d6:ocMA.OdeW7C23.mode	@ltx/en_uk_lash/miscellanea:misc.Mode8
ltx/en_uk_lash/oc.m8.d6:ocMA.OdeW7C23.ode	@ltx/en_uk_lash/miscellanea:misc.Ode7
ltx/en_uk_lash/oc.m8.d6:ocMA.OdeW7C23.text	
ltx/en_uk_lash/oc.m8.d6:ocMA.OdeW7C24.incipit	…
ltx/en_uk_lash/oc.m8.d6:ocMA.OdeW7C24.melody	@ltx/en_uk_lash/he.h.m8:heHE.TheouSynkatavasin.name
ltx/en_uk_lash/oc.m8.d6:ocMA.OdeW7C24.mode	@ltx/en_uk_lash/miscellanea:misc.Mode8
ltx/en_uk_lash/oc.m8.d6:ocMA.OdeW7C24.ode	@ltx/en_uk_lash/miscellanea:misc.Ode7
ltx/en_uk_lash/oc.m8.d6:ocMA.OdeW7C24.text	
ltx/en_uk_lash/oc.m8.d6:ocMA.OdeW8C11.incipit	…
ltx/en_uk_lash/oc.m8.d6:ocMA.OdeW8C11.melody	@ltx/en_uk_lash/he.h.m8:heHE.EvlogeitePaides.name
ltx/en_uk_lash/oc.m8.d6:ocMA.OdeW8C11.mode	@ltx/en_uk_lash/miscellanea:misc.Mode8
ltx/en_uk_lash/oc.m8.d6:ocMA.OdeW8C11.ode	@ltx/en_uk_lash/miscellanea:misc.Ode8
ltx/en_uk_lash/oc.m8.d6:ocMA.OdeW8C11.text	
ltx/en_uk_lash/oc.m8.d6:ocMA.OdeW8C12.incipit	…
ltx/en_uk_lash/oc.m8.d6:ocMA.OdeW8C12.melody	@ltx/en_uk_lash/he.h.m8:heHE.EvlogeitePaides.name
ltx/en_uk_lash/oc.m8.d6:ocMA.OdeW8C12.mode	@ltx/en_uk_lash/miscellanea:misc.Mode8
ltx/en_uk_lash/oc.m8.d6:ocMA.OdeW8C12.ode	@ltx/en_uk_lash/miscellanea:misc.Ode8
ltx/en_uk_lash/oc.m8.d6:ocMA.OdeW8C12.text	
ltx/en_uk_lash/oc.m8.d6:ocMA.OdeW8C13.incipit	…
ltx/en_uk_lash/oc.m8.d6:ocMA.OdeW8C13.melody	@ltx/en_uk_lash/he.h.m8:heHE.EvlogeitePaides.name
ltx/en_uk_lash/oc.m8.d6:ocMA.OdeW8C13.mode	@ltx/en_uk_lash/miscellanea:misc.Mode8
ltx/en_uk_lash/oc.m8.d6:ocMA.OdeW8C13.ode	@ltx/en_uk_lash/miscellanea:misc.Ode8
ltx/en_uk_lash/oc.m8.d6:ocMA.OdeW8C13.text	
ltx/en_uk_lash/oc.m8.d6:ocMA.OdeW8C14.incipit	…
ltx/en_uk_lash/oc.m8.d6:ocMA.OdeW8C14.melody	@ltx/en_uk_lash/he.h.m8:heHE.EvlogeitePaides.name
ltx/en_uk_lash/oc.m8.d6:ocMA.OdeW8C14.mode	@ltx/en_uk_lash/miscellanea:misc.Mode8
ltx/en_uk_lash/oc.m8.d6:ocMA.OdeW8C14.ode	@ltx/en_uk_lash/miscellanea:misc.Ode8
ltx/en_uk_lash/oc.m8.d6:ocMA.OdeW8C14.text	
ltx/en_uk_lash/oc.m8.d6:ocMA.OdeW8C15.incipit	…
ltx/en_uk_lash/oc.m8.d6:ocMA.OdeW8C15.melody	@ltx/en_uk_lash/he.h.m8:heHE.EvlogeitePaides.name
ltx/en_uk_lash/oc.m8.d6:ocMA.OdeW8C15.mode	@ltx/en_uk_lash/miscellanea:misc.Mode8
ltx/en_uk_lash/oc.m8.d6:ocMA.OdeW8C15.ode	@ltx/en_uk_lash/miscellanea:misc.Ode8
ltx/en_uk_lash/oc.m8.d6:ocMA.OdeW8C15.text	
ltx/en_uk_lash/oc.m8.d6:ocMA.OdeW8C1H.greekmelody	@ltx/en_uk_lash/he.h.m8:heHE.EvlogeitePaides.greekname
ltx/en_uk_lash/oc.m8.d6:ocMA.OdeW8C1H.incipit	@ltx/en_uk_lash/he.h.m8:heHE.EvlogeitePaides.incipit
ltx/en_uk_lash/oc.m8.d6:ocMA.OdeW8C1H.melody	@ltx/en_uk_lash/he.h.m8:heHE.EvlogeitePaides.melody
ltx/en_uk_lash/oc.m8.d6:ocMA.OdeW8C1H.mode	@ltx/en_uk_lash/miscellanea:misc.Mode8
ltx/en_uk_lash/oc.m8.d6:ocMA.OdeW8C1H.ode	@ltx/en_uk_lash/miscellanea:misc.Ode8
ltx/en_uk_lash/oc.m8.d6:ocMA.OdeW8C1H.text	@ltx/en_uk_lash/he.h.m8:heHE.EvlogeitePaides.text
ltx/en_uk_lash/oc.m8.d6:ocMA.OdeW8C1T.incipit	…
ltx/en_uk_lash/oc.m8.d6:ocMA.OdeW8C1T.melody	@ltx/en_uk_lash/he.h.m8:heHE.EvlogeitePaides.name
ltx/en_uk_lash/oc.m8.d6:ocMA.OdeW8C1T.mode	@ltx/en_uk_lash/miscellanea:misc.Mode8
ltx/en_uk_lash/oc.m8.d6:ocMA.OdeW8C1T.ode	@ltx/en_uk_lash/miscellanea:misc.Ode8
ltx/en_uk_lash/oc.m8.d6:ocMA.OdeW8C1T.text	
ltx/en_uk_lash/oc.m8.d6:ocMA.OdeW8C21.greekmelody	@ltx/en_uk_lash/he.h.m8:heHE.EptaplasiosKaminon.greekname
ltx/en_uk_lash/oc.m8.d6:ocMA.OdeW8C21.incipit	…
ltx/en_uk_lash/oc.m8.d6:ocMA.OdeW8C21.melody	@ltx/en_uk_lash/he.h.m8:heHE.EptaplasiosKaminon.name
ltx/en_uk_lash/oc.m8.d6:ocMA.OdeW8C21.mode	@ltx/en_uk_lash/miscellanea:misc.Mode8
ltx/en_uk_lash/oc.m8.d6:ocMA.OdeW8C21.ode	@ltx/en_uk_lash/miscellanea:misc.Ode8
ltx/en_uk_lash/oc.m8.d6:ocMA.OdeW8C21.text	
ltx/en_uk_lash/oc.m8.d6:ocMA.OdeW8C22.incipit	…
ltx/en_uk_lash/oc.m8.d6:ocMA.OdeW8C22.melody	@ltx/en_uk_lash/he.h.m8:heHE.EptaplasiosKaminon.name
ltx/en_uk_lash/oc.m8.d6:ocMA.OdeW8C22.mode	@ltx/en_uk_lash/miscellanea:misc.Mode8
ltx/en_uk_lash/oc.m8.d6:ocMA.OdeW8C22.ode	@ltx/en_uk_lash/miscellanea:misc.Ode8
ltx/en_uk_lash/oc.m8.d6:ocMA.OdeW8C22.text	
ltx/en_uk_lash/oc.m8.d6:ocMA.OdeW8C23.incipit	…
ltx/en_uk_lash/oc.m8.d6:ocMA.OdeW8C23.melody	@ltx/en_uk_lash/he.h.m8:heHE.EptaplasiosKaminon.name
ltx/en_uk_lash/oc.m8.d6:ocMA.OdeW8C23.mode	@ltx/en_uk_lash/miscellanea:misc.Mode8
ltx/en_uk_lash/oc.m8.d6:ocMA.OdeW8C23.ode	@ltx/en_uk_lash/miscellanea:misc.Ode8
ltx/en_uk_lash/oc.m8.d6:ocMA.OdeW8C23.text	
ltx/en_uk_lash/oc.m8.d6:ocMA.OdeW8C24.incipit	…
ltx/en_uk_lash/oc.m8.d6:ocMA.OdeW8C24.melody	@ltx/en_uk_lash/he.h.m8:heHE.EptaplasiosKaminon.name
ltx/en_uk_lash/oc.m8.d6:ocMA.OdeW8C24.mode	@ltx/en_uk_lash/miscellanea:misc.Mode8
ltx/en_uk_lash/oc.m8.d6:ocMA.OdeW8C24.ode	@ltx/en_uk_lash/miscellanea:misc.Ode8
ltx/en_uk_lash/oc.m8.d6:ocMA.OdeW8C24.text	
ltx/en_uk_lash/oc.m8.d6:ocMA.OdeW9C11.incipit	…
ltx/en_uk_lash/oc.m8.d6:ocMA.OdeW9C11.melody	@ltx/en_uk_lash/he.h.m8:heHE.ODiaVroseos.name
ltx/en_uk_lash/oc.m8.d6:ocMA.OdeW9C11.mode	@ltx/en_uk_lash/miscellanea:misc.Mode8
ltx/en_uk_lash/oc.m8.d6:ocMA.OdeW9C11.ode	@ltx/en_uk_lash/miscellanea:misc.Ode9
ltx/en_uk_lash/oc.m8.d6:ocMA.OdeW9C11.text	
ltx/en_uk_lash/oc.m8.d6:ocMA.OdeW9C12.incipit	…
ltx/en_uk_lash/oc.m8.d6:ocMA.OdeW9C12.melody	@ltx/en_uk_lash/he.h.m8:heHE.ODiaVroseos.name
ltx/en_uk_lash/oc.m8.d6:ocMA.OdeW9C12.mode	@ltx/en_uk_lash/miscellanea:misc.Mode8
ltx/en_uk_lash/oc.m8.d6:ocMA.OdeW9C12.ode	@ltx/en_uk_lash/miscellanea:misc.Ode9
ltx/en_uk_lash/oc.m8.d6:ocMA.OdeW9C12.text	
ltx/en_uk_lash/oc.m8.d6:ocMA.OdeW9C13.incipit	…
ltx/en_uk_lash/oc.m8.d6:ocMA.OdeW9C13.melody	@ltx/en_uk_lash/he.h.m8:heHE.ODiaVroseos.name
ltx/en_uk_lash/oc.m8.d6:ocMA.OdeW9C13.mode	@ltx/en_uk_lash/miscellanea:misc.Mode8
ltx/en_uk_lash/oc.m8.d6:ocMA.OdeW9C13.ode	@ltx/en_uk_lash/miscellanea:misc.Ode9
ltx/en_uk_lash/oc.m8.d6:ocMA.OdeW9C13.text	
ltx/en_uk_lash/oc.m8.d6:ocMA.OdeW9C14.incipit	…
ltx/en_uk_lash/oc.m8.d6:ocMA.OdeW9C14.melody	@ltx/en_uk_lash/he.h.m8:heHE.ODiaVroseos.name
ltx/en_uk_lash/oc.m8.d6:ocMA.OdeW9C14.mode	@ltx/en_uk_lash/miscellanea:misc.Mode8
ltx/en_uk_lash/oc.m8.d6:ocMA.OdeW9C14.ode	@ltx/en_uk_lash/miscellanea:misc.Ode9
ltx/en_uk_lash/oc.m8.d6:ocMA.OdeW9C14.text	
ltx/en_uk_lash/oc.m8.d6:ocMA.OdeW9C1H.greekmelody	@ltx/en_uk_lash/he.h.m8:heHE.ODiaVroseos.greekname
ltx/en_uk_lash/oc.m8.d6:ocMA.OdeW9C1H.incipit	@ltx/en_uk_lash/he.h.m8:heHE.ODiaVroseos.incipit
ltx/en_uk_lash/oc.m8.d6:ocMA.OdeW9C1H.melody	@ltx/en_uk_lash/he.h.m8:heHE.ODiaVroseos.melody
ltx/en_uk_lash/oc.m8.d6:ocMA.OdeW9C1H.mode	@ltx/en_uk_lash/miscellanea:misc.Mode8
ltx/en_uk_lash/oc.m8.d6:ocMA.OdeW9C1H.ode	@ltx/en_uk_lash/miscellanea:misc.Ode9
ltx/en_uk_lash/oc.m8.d6:ocMA.OdeW9C1H.text	@ltx/en_uk_lash/he.h.m8:heHE.ODiaVroseos.text
ltx/en_uk_lash/oc.m8.d6:ocMA.OdeW9C1T.incipit	…
ltx/en_uk_lash/oc.m8.d6:ocMA.OdeW9C1T.melody	@ltx/en_uk_lash/he.h.m8:heHE.ODiaVroseos.name
ltx/en_uk_lash/oc.m8.d6:ocMA.OdeW9C1T.mode	@ltx/en_uk_lash/miscellanea:misc.Mode8
ltx/en_uk_lash/oc.m8.d6:ocMA.OdeW9C1T.ode	@ltx/en_uk_lash/miscellanea:misc.Ode9
ltx/en_uk_lash/oc.m8.d6:ocMA.OdeW9C1T.text	
ltx/en_uk_lash/oc.m8.d6:ocMA.OdeW9C21.greekmelody	@ltx/en_uk_lash/he.h.m8:heHE.ExestiEpiTouto.greekname
ltx/en_uk_lash/oc.m8.d6:ocMA.OdeW9C21.incipit	…
ltx/en_uk_lash/oc.m8.d6:ocMA.OdeW9C21.melody	@ltx/en_uk_lash/he.h.m8:heHE.ExestiEpiTouto.name
ltx/en_uk_lash/oc.m8.d6:ocMA.OdeW9C21.mode	@ltx/en_uk_lash/miscellanea:misc.Mode8
ltx/en_uk_lash/oc.m8.d6:ocMA.OdeW9C21.ode	@ltx/en_uk_lash/miscellanea:misc.Ode9
ltx/en_uk_lash/oc.m8.d6:ocMA.OdeW9C21.text	
ltx/en_uk_lash/oc.m8.d6:ocMA.OdeW9C22.incipit	…
ltx/en_uk_lash/oc.m8.d6:ocMA.OdeW9C22.melody	@ltx/en_uk_lash/he.h.m8:heHE.ExestiEpiTouto.name
ltx/en_uk_lash/oc.m8.d6:ocMA.OdeW9C22.mode	@ltx/en_uk_lash/miscellanea:misc.Mode8
ltx/en_uk_lash/oc.m8.d6:ocMA.OdeW9C22.ode	@ltx/en_uk_lash/miscellanea:misc.Ode9
ltx/en_uk_lash/oc.m8.d6:ocMA.OdeW9C22.text	
ltx/en_uk_lash/oc.m8.d6:ocMA.OdeW9C23.incipit	…
ltx/en_uk_lash/oc.m8.d6:ocMA.OdeW9C23.melody	@ltx/en_uk_lash/he.h.m8:heHE.ExestiEpiTouto.name
ltx/en_uk_lash/oc.m8.d6:ocMA.OdeW9C23.mode	@ltx/en_uk_lash/miscellanea:misc.Mode8
ltx/en_uk_lash/oc.m8.d6:ocMA.OdeW9C23.ode	@ltx/en_uk_lash/miscellanea:misc.Ode9
ltx/en_uk_lash/oc.m8.d6:ocMA.OdeW9C23.text	
ltx/en_uk_lash/oc.m8.d6:ocMA.OdeW9C24.incipit	…
ltx/en_uk_lash/oc.m8.d6:ocMA.OdeW9C24.melody	@ltx/en_uk_lash/he.h.m8:heHE.ExestiEpiTouto.name
ltx/en_uk_lash/oc.m8.d6:ocMA.OdeW9C24.mode	@ltx/en_uk_lash/miscellanea:misc.Mode8
ltx/en_uk_lash/oc.m8.d6:ocMA.OdeW9C24.ode	@ltx/en_uk_lash/miscellanea:misc.Ode9
ltx/en_uk_lash/oc.m8.d6:ocMA.OdeW9C24.text	
ltx/en_uk_lash/oc.m8.d6:ocVE.ApolTheotokionVM.incipit	@ltx/en_uk_lash/oc.m8.d4:ocVE.ApolTheotokionVM.incipit
ltx/en_uk_lash/oc.m8.d6:ocVE.ApolTheotokionVM.melody	
ltx/en_uk_lash/oc.m8.d6:ocVE.ApolTheotokionVM.mode	@ltx/en_uk_lash/miscellanea:misc.Mode8
ltx/en_uk_lash/oc.m8.d6:ocVE.ApolTheotokionVM.text	@ltx/en_uk_lash/oc.m8.d4:ocVE.ApolTheotokionVM.text
ltx/en_uk_lash/oc.m8.d6:ocVE.AposTheotokion.greekmelody	@ltx/en_uk_lash/he.a.m8:heAU.OiMartyresSouKyrie.greekname
ltx/en_uk_lash/oc.m8.d6:ocVE.AposTheotokion.incipit	As she saw you crucified…
ltx/en_uk_lash/oc.m8.d6:ocVE.AposTheotokion.melody	@ltx/en_uk_lash/he.a.m8:heAU.OiMartyresSouKyrie.notmetered
ltx/en_uk_lash/oc.m8.d6:ocVE.AposTheotokion.mode	@ltx/en_uk_lash/miscellanea:misc.Mode8
ltx/en_uk_lash/oc.m8.d6:ocVE.AposTheotokion.text	As she saw you crucified and put to death, the Mother of God cried: Alas! How do you endure pains, my sweetest Son? The lance strikes my heart, your passion burns my inward parts. But yet I confess you, for willing you suffer all this to save mankind.
ltx/en_uk_lash/oc.m8.d6:ocVE.Aposticha1.incipit	@ltx/en_uk_lash/oc.m8.d4:ocVE.Aposticha1.incipit
ltx/en_uk_lash/oc.m8.d6:ocVE.Aposticha1.melody	
ltx/en_uk_lash/oc.m8.d6:ocVE.Aposticha1.mode	@ltx/en_uk_lash/miscellanea:misc.Mode8
ltx/en_uk_lash/oc.m8.d6:ocVE.Aposticha1.text	@ltx/en_uk_lash/oc.m8.d4:ocVE.Aposticha1.text
ltx/en_uk_lash/oc.m8.d6:ocVE.Aposticha2.incipit	@ltx/en_uk_lash/oc.m8.d4:ocVE.Aposticha2.incipit
ltx/en_uk_lash/oc.m8.d6:ocVE.Aposticha2.melody	
ltx/en_uk_lash/oc.m8.d6:ocVE.Aposticha2.mode	@ltx/en_uk_lash/miscellanea:misc.Mode8
ltx/en_uk_lash/oc.m8.d6:ocVE.Aposticha2.text	@ltx/en_uk_lash/oc.m8.d4:ocVE.Aposticha2.text
ltx/en_uk_lash/oc.m8.d6:ocVE.Aposticha3.incipit	@ltx/en_uk_lash/oc.m8.d2:ocVE.Aposticha3.incipit
ltx/en_uk_lash/oc.m8.d6:ocVE.Aposticha3.melody	
ltx/en_uk_lash/oc.m8.d6:ocVE.Aposticha3.mode	@ltx/en_uk_lash/miscellanea:misc.Mode8
ltx/en_uk_lash/oc.m8.d6:ocVE.Aposticha3.text	@ltx/en_uk_lash/oc.m8.d2:ocVE.Aposticha3.text
ltx/en_uk_lash/oc.m8.d6:ocVE.SticTheotokion.greekmelody	@ltx/en_uk_lash/he.a.m8:heAU.OiMartyresSouKyrie.greekname
ltx/en_uk_lash/oc.m8.d6:ocVE.SticTheotokion.incipit	When the All-pure saw you…
ltx/en_uk_lash/oc.m8.d6:ocVE.SticTheotokion.melody	@ltx/en_uk_lash/he.a.m8:heAU.OiMartyresSouKyrie.notmetered
ltx/en_uk_lash/oc.m8.d6:ocVE.SticTheotokion.mode	@ltx/en_uk_lash/miscellanea:misc.Mode8
ltx/en_uk_lash/oc.m8.d6:ocVE.SticTheotokion.text	When the All-pure saw you, O Christ, willingly hanged on a cross, knowing your power, she was seized with grief and in lamentation cried aloud to you: My Child, do not leave me, who gave you birth; give me a word, my Son; do not pass from your servant in silence, O Word of God.
ltx/en_uk_lash/oc.m8.d6:ocVE.Stichera1.greekmelody	@ltx/en_uk_lash/he.a.m8:heAU.OAngelosSouKyrie.greekname
ltx/en_uk_lash/oc.m8.d6:ocVE.Stichera1.incipit	The lawless people condemned you…
ltx/en_uk_lash/oc.m8.d6:ocVE.Stichera1.melody	@ltx/en_uk_lash/he.a.m8:heAU.OAngelosSouKyrie.notmetered
ltx/en_uk_lash/oc.m8.d6:ocVE.Stichera1.mode	@ltx/en_uk_lash/miscellanea:misc.Mode8
ltx/en_uk_lash/oc.m8.d6:ocVE.Stichera1.text	The lawless people condemned you, my Jesus, the Lord and Creator of the whole world, to be crucified between lawless men; and when it saw their shameless deed the whole earth quaked, revealing you, Master, to be the Maker of all things.
ltx/en_uk_lash/oc.m8.d6:ocVE.Stichera2.incipit	We are all redeemed from…
ltx/en_uk_lash/oc.m8.d6:ocVE.Stichera2.melody	@ltx/en_uk_lash/he.a.m8:heAU.OAngelosSouKyrie.notmetered
ltx/en_uk_lash/oc.m8.d6:ocVE.Stichera2.mode	@ltx/en_uk_lash/miscellanea:misc.Mode8
ltx/en_uk_lash/oc.m8.d6:ocVE.Stichera2.text	We are all redeemed from the curse of the law and from accusations; for the Lord of the law was lifted up on the precious Cross, becoming a source of inexhaustible blessing, grace and mercy for us who hymn his divine sufferings.
ltx/en_uk_lash/oc.m8.d6:ocVE.Stichera3.incipit	When your hands were wounded…
ltx/en_uk_lash/oc.m8.d6:ocVE.Stichera3.melody	@ltx/en_uk_lash/he.a.m8:heAU.OAngelosSouKyrie.notmetered
ltx/en_uk_lash/oc.m8.d6:ocVE.Stichera3.mode	@ltx/en_uk_lash/miscellanea:misc.Mode8
ltx/en_uk_lash/oc.m8.d6:ocVE.Stichera3.text	When your hands were wounded, Lover of mankind, you healed our wounds; you directed all to ways of salvation, Lord, when your feet were gouged through on the Cross, which when the First-formed man saw them in Paradise, he hid himself.
ltx/en_uk_lash/oc.m8.d6:ocVE.Stichera4.greekmelody	@ltx/en_uk_lash/he.a.m8:heAU.OTouParadoxou.greekname
ltx/en_uk_lash/oc.m8.d6:ocVE.Stichera4.incipit	Hail Lady, Mother of God…
ltx/en_uk_lash/oc.m8.d6:ocVE.Stichera4.melody	@ltx/en_uk_lash/he.a.m8:heAU.OTouParadoxou.notmetered
ltx/en_uk_lash/oc.m8.d6:ocVE.Stichera4.mode	@ltx/en_uk_lash/miscellanea:misc.Mode8
ltx/en_uk_lash/oc.m8.d6:ocVE.Stichera4.text	Hail Lady, Mother of God; hail sceptre of David; hail heavenly gate; hail bush unburned; hail shaded mountain; hail lampstand; hail all-immaculate; hail jar; hail palace; hail all-unblemished Mother of our God; hail tongs; hail divine table; hail hope of the world.
ltx/en_uk_lash/oc.m8.d6:ocVE.Stichera5.incipit	The waves of my sins…
ltx/en_uk_lash/oc.m8.d6:ocVE.Stichera5.melody	@ltx/en_uk_lash/he.a.m8:heAU.OTouParadoxou.notmetered
ltx/en_uk_lash/oc.m8.d6:ocVE.Stichera5.mode	@ltx/en_uk_lash/miscellanea:misc.Mode8
ltx/en_uk_lash/oc.m8.d6:ocVE.Stichera5.text	The waves of my sins, Sovereign Lady, as on a dread ocean, lifted high above my head threaten to drown me; but stretch out your hand to me, as one was once to Peter as he was sinking, and save and guide me to a harbour of repentance, I beg, immaculate, all-praised, Mother of God, hope of all the world.
ltx/en_uk_lash/oc.m8.d6:ocVE.Stichera6.incipit	Fearfully darkened by the passions…
ltx/en_uk_lash/oc.m8.d6:ocVE.Stichera6.melody	@ltx/en_uk_lash/he.a.m8:heAU.OTouParadoxou.notmetered
ltx/en_uk_lash/oc.m8.d6:ocVE.Stichera6.mode	@ltx/en_uk_lash/miscellanea:misc.Mode8
ltx/en_uk_lash/oc.m8.d6:ocVE.Stichera6.text	Fearfully darkened by the passions of sin, I am hastening, wretch that I am, to fall into the precipice of despair; but do you, blessed Lady, full of God''s grace, take pity on me; make the light of your compassion shine for me, and guide me to straight ways, I entreat, I fall down, I beg. Do not despise me.
ltx/en_uk_lash/oc.m8.d6:octrMA.Kathisma11.incipit	…
ltx/en_uk_lash/oc.m8.d6:octrMA.Kathisma11.melody	
ltx/en_uk_lash/oc.m8.d6:octrMA.Kathisma11.mode	@ltx/en_uk_lash/miscellanea:misc.Mode8
ltx/en_uk_lash/oc.m8.d6:octrMA.Kathisma11.text	
ltx/en_uk_lash/oc.m8.d6:octrMA.Kathisma12.incipit	…
ltx/en_uk_lash/oc.m8.d6:octrMA.Kathisma12.melody	
ltx/en_uk_lash/oc.m8.d6:octrMA.Kathisma12.mode	@ltx/en_uk_lash/miscellanea:misc.Mode8
ltx/en_uk_lash/oc.m8.d6:octrMA.Kathisma12.text	
ltx/en_uk_lash/oc.m8.d6:octrMA.Kathisma1T.incipit	…
ltx/en_uk_lash/oc.m8.d6:octrMA.Kathisma1T.melody	
ltx/en_uk_lash/oc.m8.d6:octrMA.Kathisma1T.mode	@ltx/en_uk_lash/miscellanea:misc.Mode8
ltx/en_uk_lash/oc.m8.d6:octrMA.Kathisma1T.text	
ltx/en_uk_lash/oc.m8.d6:octrMA.Ode7Martyricon.incipit	…
ltx/en_uk_lash/oc.m8.d6:octrMA.Ode7Martyricon.melody	
ltx/en_uk_lash/oc.m8.d6:octrMA.Ode7Martyricon.mode	@ltx/en_uk_lash/miscellanea:misc.Mode8
ltx/en_uk_lash/oc.m8.d6:octrMA.Ode7Martyricon.text	
ltx/en_uk_lash/oc.m8.d6:octrMA.Photogogic.incipit	@ltx/en_uk_lash/oc.m8.d2:octrMA.Photagogic.incipit
ltx/en_uk_lash/oc.m8.d6:octrMA.Photogogic.mode	@ltx/en_uk_lash/miscellanea:misc.Mode8
ltx/en_uk_lash/oc.m8.d6:octrMA.Photogogic.text	@ltx/en_uk_lash/oc.m8.d2:octrMA.Photagogic.text
ltx/en_uk_lash/oc.m8.d6:octrMA.Triadic1.incipit	@ltx/en_uk_lash/oc.m8.d2:octrMA.Triadic1.incipit
ltx/en_uk_lash/oc.m8.d6:octrMA.Triadic1.mode	@ltx/en_uk_lash/miscellanea:misc.Mode8
ltx/en_uk_lash/oc.m8.d6:octrMA.Triadic1.text	@ltx/en_uk_lash/oc.m8.d2:octrMA.Triadic1.text
ltx/en_uk_lash/oc.m8.d6:octrMA.Triadic2.incipit	@ltx/en_uk_lash/oc.m8.d2:octrMA.Triadic2.incipit
ltx/en_uk_lash/oc.m8.d6:octrMA.Triadic2.mode	@ltx/en_uk_lash/miscellanea:misc.Mode8
ltx/en_uk_lash/oc.m8.d6:octrMA.Triadic2.text	@ltx/en_uk_lash/oc.m8.d2:octrMA.Triadic2.text
ltx/en_uk_lash/oc.m8.d6:octrMA.Triadic3.incipit	@ltx/en_uk_lash/oc.m8.d2:octrMA.Triadic3.incipit
ltx/en_uk_lash/oc.m8.d6:octrMA.Triadic3.mode	@ltx/en_uk_lash/miscellanea:misc.Mode8
ltx/en_uk_lash/oc.m8.d6:octrMA.Triadic3.text	@ltx/en_uk_lash/oc.m8.d2:octrMA.Triadic3.text
