ltx/en_uk_lash/me.m04.d04:meDA.commemoration.first	
ltx/en_uk_lash/me.m04.d04:meDA.commemoration.first_name	
ltx/en_uk_lash/me.m04.d04:meDA.commemoration.first_short	
ltx/en_uk_lash/me.m04.d04:meDA.commemoration.first_title	
ltx/en_uk_lash/me.m04.d04:meDA.commemoration.full	
ltx/en_uk_lash/me.m04.d04:meDA.commemoration.second_name	
ltx/en_uk_lash/me.m04.d04:meDA.commemoration.second_title	
ltx/en_uk_lash/me.m04.d04:meDA.date	
ltx/en_uk_lash/me.m04.d04:meDA.insert1	
ltx/en_uk_lash/me.m04.d04:meDA.insert2	
ltx/en_uk_lash/me.m04.d04:meDA.note	
ltx/en_uk_lash/me.m04.d04:meHO.commemorations	
ltx/en_uk_lash/me.m04.d04:meHO.note1	
ltx/en_uk_lash/me.m04.d04:meHO.note2	
ltx/en_uk_lash/me.m04.d04:meHO.number	
ltx/en_uk_lash/me.m04.d04:meHO.rank	
ltx/en_uk_lash/me.m04.d04:meLE.commemoration1	
ltx/en_uk_lash/me.m04.d04:meLE.commemoration2	
ltx/en_uk_lash/me.m04.d04:meLI.Kontakion1.greekmelody	@ltx/en_uk_lash/me.m04.d04:meMA.Kontakion1.greekmelody
ltx/en_uk_lash/me.m04.d04:meLI.Kontakion1.incipit	@ltx/en_uk_lash/me.m04.d04:meMA.Kontakion1.incipit
ltx/en_uk_lash/me.m04.d04:meLI.Kontakion1.melody	@ltx/en_uk_lash/me.m04.d04:meMA.Kontakion1.melody
ltx/en_uk_lash/me.m04.d04:meLI.Kontakion1.mode	@ltx/en_uk_lash/me.m04.d04:meMA.Kontakion1.mode
ltx/en_uk_lash/me.m04.d04:meLI.Kontakion1.text	@ltx/en_uk_lash/me.m04.d04:meMA.Kontakion1.text
ltx/en_uk_lash/me.m04.d04:meLI.MM.CommunionHymn.text	@ltx/en_uk_lash/properties:media.key
ltx/en_uk_lash/me.m04.d04:meLI.Megalynarion.text	
ltx/en_uk_lash/me.m04.d04:meMA.C1.acrostic.notice1	
ltx/en_uk_lash/me.m04.d04:meMA.C1.acrostic.text	
ltx/en_uk_lash/me.m04.d04:meMA.C1.acrostic.title	
ltx/en_uk_lash/me.m04.d04:meMA.C1.poet	@ltx/en_uk_lash/poets:po.Theofanous
ltx/en_uk_lash/me.m04.d04:meMA.C1.title	@ltx/en_uk_lash/titles:ti.CanonSaintM
ltx/en_uk_lash/me.m04.d04:meMA.C1.verse	@ltx/en_uk_lash/prayers:pr.verse_DevoutMan.text
ltx/en_uk_lash/me.m04.d04:meMA.Kontakion1.greekmelody	@ltx/en_uk_lash/he.a.m3:heAU.IParthenosSimeron.greekname
ltx/en_uk_lash/me.m04.d04:meMA.Kontakion1.incipit	…
ltx/en_uk_lash/me.m04.d04:meMA.Kontakion1.melody	@ltx/en_uk_lash/he.a.m3:heAU.IParthenosSimeron.name
ltx/en_uk_lash/me.m04.d04:meMA.Kontakion1.mode	@ltx/en_uk_lash/miscellanea:misc.Mode3
ltx/en_uk_lash/me.m04.d04:meMA.Kontakion1.poet	
ltx/en_uk_lash/me.m04.d04:meMA.Kontakion1.text	
ltx/en_uk_lash/me.m04.d04:meMA.Ode1C11.greekmelody	@ltx/en_uk_lash/he.h.m2:heHE.DefteLaoi.greekname
ltx/en_uk_lash/me.m04.d04:meMA.Ode1C11.incipit	…
ltx/en_uk_lash/me.m04.d04:meMA.Ode1C11.melody	@ltx/en_uk_lash/he.h.m2:heHE.DefteLaoi.name
ltx/en_uk_lash/me.m04.d04:meMA.Ode1C11.mode	@ltx/en_uk_lash/miscellanea:misc.Mode2
ltx/en_uk_lash/me.m04.d04:meMA.Ode1C11.ode	@ltx/en_uk_lash/miscellanea:misc.Ode1
ltx/en_uk_lash/me.m04.d04:meMA.Ode1C11.text	
ltx/en_uk_lash/me.m04.d04:meMA.Ode1C12.incipit	…
ltx/en_uk_lash/me.m04.d04:meMA.Ode1C12.melody	@ltx/en_uk_lash/he.h.m2:heHE.DefteLaoi.name
ltx/en_uk_lash/me.m04.d04:meMA.Ode1C12.mode	@ltx/en_uk_lash/miscellanea:misc.Mode2
ltx/en_uk_lash/me.m04.d04:meMA.Ode1C12.ode	@ltx/en_uk_lash/miscellanea:misc.Ode1
ltx/en_uk_lash/me.m04.d04:meMA.Ode1C12.text	
ltx/en_uk_lash/me.m04.d04:meMA.Ode1C13.incipit	…
ltx/en_uk_lash/me.m04.d04:meMA.Ode1C13.melody	@ltx/en_uk_lash/he.h.m2:heHE.DefteLaoi.name
ltx/en_uk_lash/me.m04.d04:meMA.Ode1C13.mode	@ltx/en_uk_lash/miscellanea:misc.Mode2
ltx/en_uk_lash/me.m04.d04:meMA.Ode1C13.ode	@ltx/en_uk_lash/miscellanea:misc.Ode1
ltx/en_uk_lash/me.m04.d04:meMA.Ode1C13.text	
ltx/en_uk_lash/me.m04.d04:meMA.Ode1C1H.greekmelody	@ltx/en_uk_lash/he.h.m2:heHE.DefteLaoi.greekname
ltx/en_uk_lash/me.m04.d04:meMA.Ode1C1H.incipit	@ltx/en_uk_lash/he.h.m2:heHE.DefteLaoi.incipit
ltx/en_uk_lash/me.m04.d04:meMA.Ode1C1H.melody	@ltx/en_uk_lash/he.h.m2:heHE.DefteLaoi.melody
ltx/en_uk_lash/me.m04.d04:meMA.Ode1C1H.mode	@ltx/en_uk_lash/miscellanea:misc.Mode2
ltx/en_uk_lash/me.m04.d04:meMA.Ode1C1H.ode	@ltx/en_uk_lash/miscellanea:misc.Ode1
ltx/en_uk_lash/me.m04.d04:meMA.Ode1C1H.text	@ltx/en_uk_lash/he.h.m2:heHE.DefteLaoi.text
ltx/en_uk_lash/me.m04.d04:meMA.Ode1C1T.incipit	…
ltx/en_uk_lash/me.m04.d04:meMA.Ode1C1T.melody	@ltx/en_uk_lash/he.h.m2:heHE.DefteLaoi.name
ltx/en_uk_lash/me.m04.d04:meMA.Ode1C1T.mode	@ltx/en_uk_lash/miscellanea:misc.Mode2
ltx/en_uk_lash/me.m04.d04:meMA.Ode1C1T.ode	@ltx/en_uk_lash/miscellanea:misc.Ode1
ltx/en_uk_lash/me.m04.d04:meMA.Ode1C1T.text	
ltx/en_uk_lash/me.m04.d04:meMA.Ode3C11.greekmelody	@ltx/en_uk_lash/he.h.m2:heHE.StereosonImasEnSoiKyrie.greekname
ltx/en_uk_lash/me.m04.d04:meMA.Ode3C11.incipit	…
ltx/en_uk_lash/me.m04.d04:meMA.Ode3C11.melody	@ltx/en_uk_lash/he.h.m2:heHE.StereosonImasEnSoiKyrie.name
ltx/en_uk_lash/me.m04.d04:meMA.Ode3C11.mode	@ltx/en_uk_lash/miscellanea:misc.Mode2
ltx/en_uk_lash/me.m04.d04:meMA.Ode3C11.ode	@ltx/en_uk_lash/miscellanea:misc.Ode3
ltx/en_uk_lash/me.m04.d04:meMA.Ode3C11.text	
ltx/en_uk_lash/me.m04.d04:meMA.Ode3C12.incipit	…
ltx/en_uk_lash/me.m04.d04:meMA.Ode3C12.melody	@ltx/en_uk_lash/he.h.m2:heHE.StereosonImasEnSoiKyrie.name
ltx/en_uk_lash/me.m04.d04:meMA.Ode3C12.mode	@ltx/en_uk_lash/miscellanea:misc.Mode2
ltx/en_uk_lash/me.m04.d04:meMA.Ode3C12.ode	@ltx/en_uk_lash/miscellanea:misc.Ode3
ltx/en_uk_lash/me.m04.d04:meMA.Ode3C12.text	
ltx/en_uk_lash/me.m04.d04:meMA.Ode3C13.incipit	…
ltx/en_uk_lash/me.m04.d04:meMA.Ode3C13.melody	@ltx/en_uk_lash/he.h.m2:heHE.StereosonImasEnSoiKyrie.name
ltx/en_uk_lash/me.m04.d04:meMA.Ode3C13.mode	@ltx/en_uk_lash/miscellanea:misc.Mode2
ltx/en_uk_lash/me.m04.d04:meMA.Ode3C13.ode	@ltx/en_uk_lash/miscellanea:misc.Ode3
ltx/en_uk_lash/me.m04.d04:meMA.Ode3C13.text	
ltx/en_uk_lash/me.m04.d04:meMA.Ode3C1H.greekmelody	@ltx/en_uk_lash/he.h.m2:heHE.StereosonImasEnSoiKyrie.greekname
ltx/en_uk_lash/me.m04.d04:meMA.Ode3C1H.incipit	@ltx/en_uk_lash/he.h.m2:heHE.StereosonImasEnSoiKyrie.incipit
ltx/en_uk_lash/me.m04.d04:meMA.Ode3C1H.melody	@ltx/en_uk_lash/he.h.m2:heHE.StereosonImasEnSoiKyrie.melody
ltx/en_uk_lash/me.m04.d04:meMA.Ode3C1H.mode	@ltx/en_uk_lash/miscellanea:misc.Mode2
ltx/en_uk_lash/me.m04.d04:meMA.Ode3C1H.ode	@ltx/en_uk_lash/miscellanea:misc.Ode3
ltx/en_uk_lash/me.m04.d04:meMA.Ode3C1H.text	@ltx/en_uk_lash/he.h.m2:heHE.StereosonImasEnSoiKyrie.text
ltx/en_uk_lash/me.m04.d04:meMA.Ode3C1T.incipit	…
ltx/en_uk_lash/me.m04.d04:meMA.Ode3C1T.melody	@ltx/en_uk_lash/he.h.m2:heHE.StereosonImasEnSoiKyrie.name
ltx/en_uk_lash/me.m04.d04:meMA.Ode3C1T.mode	@ltx/en_uk_lash/miscellanea:misc.Mode2
ltx/en_uk_lash/me.m04.d04:meMA.Ode3C1T.ode	@ltx/en_uk_lash/miscellanea:misc.Ode3
ltx/en_uk_lash/me.m04.d04:meMA.Ode3C1T.text	
ltx/en_uk_lash/me.m04.d04:meMA.Ode3Kathisma1.greekmelody	@ltx/en_uk_lash/he.a.m3:heAU.TinOraiotita.greekname
ltx/en_uk_lash/me.m04.d04:meMA.Ode3Kathisma1.incipit	…
ltx/en_uk_lash/me.m04.d04:meMA.Ode3Kathisma1.melody	@ltx/en_uk_lash/he.a.m3:heAU.TinOraiotita.name
ltx/en_uk_lash/me.m04.d04:meMA.Ode3Kathisma1.mode	@ltx/en_uk_lash/miscellanea:misc.Mode3
ltx/en_uk_lash/me.m04.d04:meMA.Ode3Kathisma1.text	
ltx/en_uk_lash/me.m04.d04:meMA.Ode3KathismaSt.incipit	@ltx/en_uk_lash/oc.m3.d4:ocMA.Kathisma23.incipit
ltx/en_uk_lash/me.m04.d04:meMA.Ode3KathismaSt.melody	@ltx/en_uk_lash/he.a.m3:heAU.TinOraiotita.notmetered
ltx/en_uk_lash/me.m04.d04:meMA.Ode3KathismaSt.mode	@ltx/en_uk_lash/miscellanea:misc.Mode3
ltx/en_uk_lash/me.m04.d04:meMA.Ode3KathismaSt.text	@ltx/en_uk_lash/oc.m3.d4:ocMA.Kathisma23.text
ltx/en_uk_lash/me.m04.d04:meMA.Ode3KathismaT.incipit	@ltx/en_uk_lash/oc.m3.d2:ocMA.Kathisma33.incipit
ltx/en_uk_lash/me.m04.d04:meMA.Ode3KathismaT.melody	@ltx/en_uk_lash/he.a.m3:heAU.TinOraiotita.notmetered
ltx/en_uk_lash/me.m04.d04:meMA.Ode3KathismaT.mode	@ltx/en_uk_lash/miscellanea:misc.Mode3
ltx/en_uk_lash/me.m04.d04:meMA.Ode3KathismaT.text	@ltx/en_uk_lash/oc.m3.d2:ocMA.Kathisma33.text
ltx/en_uk_lash/me.m04.d04:meMA.Ode4C11.greekmelody	@ltx/en_uk_lash/he.h.m2:heHE.EisakikoaKyrieTinAkoin.greekname
ltx/en_uk_lash/me.m04.d04:meMA.Ode4C11.incipit	…
ltx/en_uk_lash/me.m04.d04:meMA.Ode4C11.melody	@ltx/en_uk_lash/he.h.m2:heHE.EisakikoaKyrieTinAkoin.name
ltx/en_uk_lash/me.m04.d04:meMA.Ode4C11.mode	@ltx/en_uk_lash/miscellanea:misc.Mode2
ltx/en_uk_lash/me.m04.d04:meMA.Ode4C11.ode	@ltx/en_uk_lash/miscellanea:misc.Ode4
ltx/en_uk_lash/me.m04.d04:meMA.Ode4C11.text	
ltx/en_uk_lash/me.m04.d04:meMA.Ode4C12.incipit	…
ltx/en_uk_lash/me.m04.d04:meMA.Ode4C12.melody	@ltx/en_uk_lash/he.h.m2:heHE.EisakikoaKyrieTinAkoin.name
ltx/en_uk_lash/me.m04.d04:meMA.Ode4C12.mode	@ltx/en_uk_lash/miscellanea:misc.Mode2
ltx/en_uk_lash/me.m04.d04:meMA.Ode4C12.ode	@ltx/en_uk_lash/miscellanea:misc.Ode4
ltx/en_uk_lash/me.m04.d04:meMA.Ode4C12.text	
ltx/en_uk_lash/me.m04.d04:meMA.Ode4C13.incipit	…
ltx/en_uk_lash/me.m04.d04:meMA.Ode4C13.melody	@ltx/en_uk_lash/he.h.m2:heHE.EisakikoaKyrieTinAkoin.name
ltx/en_uk_lash/me.m04.d04:meMA.Ode4C13.mode	@ltx/en_uk_lash/miscellanea:misc.Mode2
ltx/en_uk_lash/me.m04.d04:meMA.Ode4C13.ode	@ltx/en_uk_lash/miscellanea:misc.Ode4
ltx/en_uk_lash/me.m04.d04:meMA.Ode4C13.text	
ltx/en_uk_lash/me.m04.d04:meMA.Ode4C14.incipit	…
ltx/en_uk_lash/me.m04.d04:meMA.Ode4C14.melody	@ltx/en_uk_lash/he.h.m2:heHE.EisakikoaKyrieTinAkoin.name
ltx/en_uk_lash/me.m04.d04:meMA.Ode4C14.mode	@ltx/en_uk_lash/miscellanea:misc.Mode2
ltx/en_uk_lash/me.m04.d04:meMA.Ode4C14.ode	@ltx/en_uk_lash/miscellanea:misc.Ode4
ltx/en_uk_lash/me.m04.d04:meMA.Ode4C14.text	
ltx/en_uk_lash/me.m04.d04:meMA.Ode4C1H.greekmelody	@ltx/en_uk_lash/he.h.m2:heHE.EisakikoaKyrieTinAkoin.greekname
ltx/en_uk_lash/me.m04.d04:meMA.Ode4C1H.incipit	@ltx/en_uk_lash/he.h.m2:heHE.EisakikoaKyrieTinAkoin.incipit
ltx/en_uk_lash/me.m04.d04:meMA.Ode4C1H.melody	@ltx/en_uk_lash/he.h.m2:heHE.EisakikoaKyrieTinAkoin.melody
ltx/en_uk_lash/me.m04.d04:meMA.Ode4C1H.mode	@ltx/en_uk_lash/miscellanea:misc.Mode2
ltx/en_uk_lash/me.m04.d04:meMA.Ode4C1H.ode	@ltx/en_uk_lash/miscellanea:misc.Ode4
ltx/en_uk_lash/me.m04.d04:meMA.Ode4C1H.text	@ltx/en_uk_lash/he.h.m2:heHE.EisakikoaKyrieTinAkoin.text
ltx/en_uk_lash/me.m04.d04:meMA.Ode4C1T.incipit	…
ltx/en_uk_lash/me.m04.d04:meMA.Ode4C1T.melody	@ltx/en_uk_lash/he.h.m2:heHE.EisakikoaKyrieTinAkoin.name
ltx/en_uk_lash/me.m04.d04:meMA.Ode4C1T.mode	@ltx/en_uk_lash/miscellanea:misc.Mode2
ltx/en_uk_lash/me.m04.d04:meMA.Ode4C1T.ode	@ltx/en_uk_lash/miscellanea:misc.Ode4
ltx/en_uk_lash/me.m04.d04:meMA.Ode4C1T.text	
ltx/en_uk_lash/me.m04.d04:meMA.Ode5C11.greekmelody	@ltx/en_uk_lash/he.h.m2:heHE.OTouFotosChorigos.greekname
ltx/en_uk_lash/me.m04.d04:meMA.Ode5C11.incipit	…
ltx/en_uk_lash/me.m04.d04:meMA.Ode5C11.melody	@ltx/en_uk_lash/he.h.m2:heHE.OTouFotosChorigos.name
ltx/en_uk_lash/me.m04.d04:meMA.Ode5C11.mode	@ltx/en_uk_lash/miscellanea:misc.Mode2
ltx/en_uk_lash/me.m04.d04:meMA.Ode5C11.ode	@ltx/en_uk_lash/miscellanea:misc.Ode5
ltx/en_uk_lash/me.m04.d04:meMA.Ode5C11.text	
ltx/en_uk_lash/me.m04.d04:meMA.Ode5C12.incipit	…
ltx/en_uk_lash/me.m04.d04:meMA.Ode5C12.melody	@ltx/en_uk_lash/he.h.m2:heHE.OTouFotosChorigos.name
ltx/en_uk_lash/me.m04.d04:meMA.Ode5C12.mode	@ltx/en_uk_lash/miscellanea:misc.Mode2
ltx/en_uk_lash/me.m04.d04:meMA.Ode5C12.ode	@ltx/en_uk_lash/miscellanea:misc.Ode5
ltx/en_uk_lash/me.m04.d04:meMA.Ode5C12.text	
ltx/en_uk_lash/me.m04.d04:meMA.Ode5C13.incipit	…
ltx/en_uk_lash/me.m04.d04:meMA.Ode5C13.melody	@ltx/en_uk_lash/he.h.m2:heHE.OTouFotosChorigos.name
ltx/en_uk_lash/me.m04.d04:meMA.Ode5C13.mode	@ltx/en_uk_lash/miscellanea:misc.Mode2
ltx/en_uk_lash/me.m04.d04:meMA.Ode5C13.ode	@ltx/en_uk_lash/miscellanea:misc.Ode5
ltx/en_uk_lash/me.m04.d04:meMA.Ode5C13.text	
ltx/en_uk_lash/me.m04.d04:meMA.Ode5C1H.greekmelody	@ltx/en_uk_lash/he.h.m2:heHE.OTouFotosChorigos.greekname
ltx/en_uk_lash/me.m04.d04:meMA.Ode5C1H.incipit	@ltx/en_uk_lash/he.h.m2:heHE.OTouFotosChorigos.incipit
ltx/en_uk_lash/me.m04.d04:meMA.Ode5C1H.melody	@ltx/en_uk_lash/he.h.m2:heHE.OTouFotosChorigos.melody
ltx/en_uk_lash/me.m04.d04:meMA.Ode5C1H.mode	@ltx/en_uk_lash/miscellanea:misc.Mode2
ltx/en_uk_lash/me.m04.d04:meMA.Ode5C1H.ode	@ltx/en_uk_lash/miscellanea:misc.Ode5
ltx/en_uk_lash/me.m04.d04:meMA.Ode5C1H.text	@ltx/en_uk_lash/he.h.m2:heHE.OTouFotosChorigos.text
ltx/en_uk_lash/me.m04.d04:meMA.Ode5C1T.incipit	…
ltx/en_uk_lash/me.m04.d04:meMA.Ode5C1T.melody	@ltx/en_uk_lash/he.h.m2:heHE.OTouFotosChorigos.name
ltx/en_uk_lash/me.m04.d04:meMA.Ode5C1T.mode	@ltx/en_uk_lash/miscellanea:misc.Mode2
ltx/en_uk_lash/me.m04.d04:meMA.Ode5C1T.ode	@ltx/en_uk_lash/miscellanea:misc.Ode5
ltx/en_uk_lash/me.m04.d04:meMA.Ode5C1T.text	
ltx/en_uk_lash/me.m04.d04:meMA.Ode6C11.greekmelody	@ltx/en_uk_lash/he.h.m2:heHE.EnAvyssoPtaismaton.greekname
ltx/en_uk_lash/me.m04.d04:meMA.Ode6C11.incipit	…
ltx/en_uk_lash/me.m04.d04:meMA.Ode6C11.melody	@ltx/en_uk_lash/he.h.m2:heHE.EnAvyssoPtaismaton.name
ltx/en_uk_lash/me.m04.d04:meMA.Ode6C11.mode	@ltx/en_uk_lash/miscellanea:misc.Mode2
ltx/en_uk_lash/me.m04.d04:meMA.Ode6C11.ode	@ltx/en_uk_lash/miscellanea:misc.Ode6
ltx/en_uk_lash/me.m04.d04:meMA.Ode6C11.text	
ltx/en_uk_lash/me.m04.d04:meMA.Ode6C12.incipit	…
ltx/en_uk_lash/me.m04.d04:meMA.Ode6C12.melody	@ltx/en_uk_lash/he.h.m2:heHE.EnAvyssoPtaismaton.name
ltx/en_uk_lash/me.m04.d04:meMA.Ode6C12.mode	@ltx/en_uk_lash/miscellanea:misc.Mode2
ltx/en_uk_lash/me.m04.d04:meMA.Ode6C12.ode	@ltx/en_uk_lash/miscellanea:misc.Ode6
ltx/en_uk_lash/me.m04.d04:meMA.Ode6C12.text	
ltx/en_uk_lash/me.m04.d04:meMA.Ode6C13.incipit	…
ltx/en_uk_lash/me.m04.d04:meMA.Ode6C13.melody	@ltx/en_uk_lash/he.h.m2:heHE.EnAvyssoPtaismaton.name
ltx/en_uk_lash/me.m04.d04:meMA.Ode6C13.mode	@ltx/en_uk_lash/miscellanea:misc.Mode2
ltx/en_uk_lash/me.m04.d04:meMA.Ode6C13.ode	@ltx/en_uk_lash/miscellanea:misc.Ode6
ltx/en_uk_lash/me.m04.d04:meMA.Ode6C13.text	
ltx/en_uk_lash/me.m04.d04:meMA.Ode6C1H.greekmelody	@ltx/en_uk_lash/he.h.m2:heHE.EnAvyssoPtaismaton.greekname
ltx/en_uk_lash/me.m04.d04:meMA.Ode6C1H.incipit	@ltx/en_uk_lash/he.h.m2:heHE.EnAvyssoPtaismaton.incipit
ltx/en_uk_lash/me.m04.d04:meMA.Ode6C1H.melody	@ltx/en_uk_lash/he.h.m2:heHE.EnAvyssoPtaismaton.melody
ltx/en_uk_lash/me.m04.d04:meMA.Ode6C1H.mode	@ltx/en_uk_lash/miscellanea:misc.Mode2
ltx/en_uk_lash/me.m04.d04:meMA.Ode6C1H.ode	@ltx/en_uk_lash/miscellanea:misc.Ode6
ltx/en_uk_lash/me.m04.d04:meMA.Ode6C1H.text	@ltx/en_uk_lash/he.h.m2:heHE.EnAvyssoPtaismaton.text
ltx/en_uk_lash/me.m04.d04:meMA.Ode6C1T.incipit	…
ltx/en_uk_lash/me.m04.d04:meMA.Ode6C1T.melody	@ltx/en_uk_lash/he.h.m2:heHE.EnAvyssoPtaismaton.name
ltx/en_uk_lash/me.m04.d04:meMA.Ode6C1T.mode	@ltx/en_uk_lash/miscellanea:misc.Mode2
ltx/en_uk_lash/me.m04.d04:meMA.Ode6C1T.ode	@ltx/en_uk_lash/miscellanea:misc.Ode6
ltx/en_uk_lash/me.m04.d04:meMA.Ode6C1T.text	
ltx/en_uk_lash/me.m04.d04:meMA.Ode7C11.greekmelody	@ltx/en_uk_lash/he.h.m2:heHE.EikonosChrysis.greekname
ltx/en_uk_lash/me.m04.d04:meMA.Ode7C11.incipit	…
ltx/en_uk_lash/me.m04.d04:meMA.Ode7C11.melody	@ltx/en_uk_lash/he.h.m2:heHE.EikonosChrysis.name
ltx/en_uk_lash/me.m04.d04:meMA.Ode7C11.mode	@ltx/en_uk_lash/miscellanea:misc.Mode2
ltx/en_uk_lash/me.m04.d04:meMA.Ode7C11.ode	@ltx/en_uk_lash/miscellanea:misc.Ode7
ltx/en_uk_lash/me.m04.d04:meMA.Ode7C11.text	
ltx/en_uk_lash/me.m04.d04:meMA.Ode7C12.incipit	…
ltx/en_uk_lash/me.m04.d04:meMA.Ode7C12.melody	@ltx/en_uk_lash/he.h.m2:heHE.EikonosChrysis.name
ltx/en_uk_lash/me.m04.d04:meMA.Ode7C12.mode	@ltx/en_uk_lash/miscellanea:misc.Mode2
ltx/en_uk_lash/me.m04.d04:meMA.Ode7C12.ode	@ltx/en_uk_lash/miscellanea:misc.Ode7
ltx/en_uk_lash/me.m04.d04:meMA.Ode7C12.text	
ltx/en_uk_lash/me.m04.d04:meMA.Ode7C13.incipit	…
ltx/en_uk_lash/me.m04.d04:meMA.Ode7C13.melody	@ltx/en_uk_lash/he.h.m2:heHE.EikonosChrysis.name
ltx/en_uk_lash/me.m04.d04:meMA.Ode7C13.mode	@ltx/en_uk_lash/miscellanea:misc.Mode2
ltx/en_uk_lash/me.m04.d04:meMA.Ode7C13.ode	@ltx/en_uk_lash/miscellanea:misc.Ode7
ltx/en_uk_lash/me.m04.d04:meMA.Ode7C13.text	
ltx/en_uk_lash/me.m04.d04:meMA.Ode7C1H.greekmelody	@ltx/en_uk_lash/he.h.m2:heHE.EikonosChrysis.greekname
ltx/en_uk_lash/me.m04.d04:meMA.Ode7C1H.incipit	@ltx/en_uk_lash/he.h.m2:heHE.EikonosChrysis.incipit
ltx/en_uk_lash/me.m04.d04:meMA.Ode7C1H.melody	@ltx/en_uk_lash/he.h.m2:heHE.EikonosChrysis.melody
ltx/en_uk_lash/me.m04.d04:meMA.Ode7C1H.mode	@ltx/en_uk_lash/miscellanea:misc.Mode2
ltx/en_uk_lash/me.m04.d04:meMA.Ode7C1H.ode	@ltx/en_uk_lash/miscellanea:misc.Ode7
ltx/en_uk_lash/me.m04.d04:meMA.Ode7C1H.text	@ltx/en_uk_lash/he.h.m2:heHE.EikonosChrysis.text
ltx/en_uk_lash/me.m04.d04:meMA.Ode7C1T.incipit	…
ltx/en_uk_lash/me.m04.d04:meMA.Ode7C1T.melody	@ltx/en_uk_lash/he.h.m2:heHE.EikonosChrysis.name
ltx/en_uk_lash/me.m04.d04:meMA.Ode7C1T.mode	@ltx/en_uk_lash/miscellanea:misc.Mode2
ltx/en_uk_lash/me.m04.d04:meMA.Ode7C1T.ode	@ltx/en_uk_lash/miscellanea:misc.Ode7
ltx/en_uk_lash/me.m04.d04:meMA.Ode7C1T.text	
ltx/en_uk_lash/me.m04.d04:meMA.Ode8C11.greekmelody	@ltx/en_uk_lash/he.h.m2:heHE.TonEnKaminoTouPyros.greekname
ltx/en_uk_lash/me.m04.d04:meMA.Ode8C11.incipit	…
ltx/en_uk_lash/me.m04.d04:meMA.Ode8C11.melody	@ltx/en_uk_lash/he.h.m2:heHE.TonEnKaminoTouPyros.name
ltx/en_uk_lash/me.m04.d04:meMA.Ode8C11.mode	@ltx/en_uk_lash/miscellanea:misc.Mode2
ltx/en_uk_lash/me.m04.d04:meMA.Ode8C11.ode	@ltx/en_uk_lash/miscellanea:misc.Ode8
ltx/en_uk_lash/me.m04.d04:meMA.Ode8C11.text	
ltx/en_uk_lash/me.m04.d04:meMA.Ode8C12.incipit	…
ltx/en_uk_lash/me.m04.d04:meMA.Ode8C12.melody	@ltx/en_uk_lash/he.h.m2:heHE.TonEnKaminoTouPyros.name
ltx/en_uk_lash/me.m04.d04:meMA.Ode8C12.mode	@ltx/en_uk_lash/miscellanea:misc.Mode2
ltx/en_uk_lash/me.m04.d04:meMA.Ode8C12.ode	@ltx/en_uk_lash/miscellanea:misc.Ode8
ltx/en_uk_lash/me.m04.d04:meMA.Ode8C12.text	
ltx/en_uk_lash/me.m04.d04:meMA.Ode8C13.incipit	…
ltx/en_uk_lash/me.m04.d04:meMA.Ode8C13.melody	@ltx/en_uk_lash/he.h.m2:heHE.TonEnKaminoTouPyros.name
ltx/en_uk_lash/me.m04.d04:meMA.Ode8C13.mode	@ltx/en_uk_lash/miscellanea:misc.Mode2
ltx/en_uk_lash/me.m04.d04:meMA.Ode8C13.ode	@ltx/en_uk_lash/miscellanea:misc.Ode8
ltx/en_uk_lash/me.m04.d04:meMA.Ode8C13.text	
ltx/en_uk_lash/me.m04.d04:meMA.Ode8C1H.greekmelody	@ltx/en_uk_lash/he.h.m2:heHE.TonEnKaminoTouPyros.greekname
ltx/en_uk_lash/me.m04.d04:meMA.Ode8C1H.incipit	@ltx/en_uk_lash/he.h.m2:heHE.TonEnKaminoTouPyros.incipit
ltx/en_uk_lash/me.m04.d04:meMA.Ode8C1H.melody	@ltx/en_uk_lash/he.h.m2:heHE.TonEnKaminoTouPyros.melody
ltx/en_uk_lash/me.m04.d04:meMA.Ode8C1H.mode	@ltx/en_uk_lash/miscellanea:misc.Mode2
ltx/en_uk_lash/me.m04.d04:meMA.Ode8C1H.ode	@ltx/en_uk_lash/miscellanea:misc.Ode8
ltx/en_uk_lash/me.m04.d04:meMA.Ode8C1H.text	@ltx/en_uk_lash/he.h.m2:heHE.TonEnKaminoTouPyros.text
ltx/en_uk_lash/me.m04.d04:meMA.Ode8C1T.incipit	…
ltx/en_uk_lash/me.m04.d04:meMA.Ode8C1T.melody	@ltx/en_uk_lash/he.h.m2:heHE.TonEnKaminoTouPyros.name
ltx/en_uk_lash/me.m04.d04:meMA.Ode8C1T.mode	@ltx/en_uk_lash/miscellanea:misc.Mode2
ltx/en_uk_lash/me.m04.d04:meMA.Ode8C1T.ode	@ltx/en_uk_lash/miscellanea:misc.Ode8
ltx/en_uk_lash/me.m04.d04:meMA.Ode8C1T.text	
ltx/en_uk_lash/me.m04.d04:meMA.Ode9C11.greekmelody	@ltx/en_uk_lash/he.h.m2:heHE.TonEkTheouTheonLogon.greekname
ltx/en_uk_lash/me.m04.d04:meMA.Ode9C11.incipit	…
ltx/en_uk_lash/me.m04.d04:meMA.Ode9C11.melody	@ltx/en_uk_lash/he.h.m2:heHE.TonEkTheouTheonLogon.name
ltx/en_uk_lash/me.m04.d04:meMA.Ode9C11.mode	@ltx/en_uk_lash/miscellanea:misc.Mode2
ltx/en_uk_lash/me.m04.d04:meMA.Ode9C11.ode	@ltx/en_uk_lash/miscellanea:misc.Ode9
ltx/en_uk_lash/me.m04.d04:meMA.Ode9C11.text	
ltx/en_uk_lash/me.m04.d04:meMA.Ode9C12.incipit	…
ltx/en_uk_lash/me.m04.d04:meMA.Ode9C12.melody	@ltx/en_uk_lash/he.h.m2:heHE.TonEkTheouTheonLogon.name
ltx/en_uk_lash/me.m04.d04:meMA.Ode9C12.mode	@ltx/en_uk_lash/miscellanea:misc.Mode2
ltx/en_uk_lash/me.m04.d04:meMA.Ode9C12.ode	@ltx/en_uk_lash/miscellanea:misc.Ode9
ltx/en_uk_lash/me.m04.d04:meMA.Ode9C12.text	
ltx/en_uk_lash/me.m04.d04:meMA.Ode9C13.incipit	…
ltx/en_uk_lash/me.m04.d04:meMA.Ode9C13.melody	@ltx/en_uk_lash/he.h.m2:heHE.TonEkTheouTheonLogon.name
ltx/en_uk_lash/me.m04.d04:meMA.Ode9C13.mode	@ltx/en_uk_lash/miscellanea:misc.Mode2
ltx/en_uk_lash/me.m04.d04:meMA.Ode9C13.ode	@ltx/en_uk_lash/miscellanea:misc.Ode9
ltx/en_uk_lash/me.m04.d04:meMA.Ode9C13.text	
ltx/en_uk_lash/me.m04.d04:meMA.Ode9C1H.greekmelody	@ltx/en_uk_lash/he.h.m2:heHE.TonEkTheouTheonLogon.greekname
ltx/en_uk_lash/me.m04.d04:meMA.Ode9C1H.incipit	@ltx/en_uk_lash/he.h.m2:heHE.TonEkTheouTheonLogon.incipit
ltx/en_uk_lash/me.m04.d04:meMA.Ode9C1H.melody	@ltx/en_uk_lash/he.h.m2:heHE.TonEkTheouTheonLogon.melody
ltx/en_uk_lash/me.m04.d04:meMA.Ode9C1H.mode	@ltx/en_uk_lash/miscellanea:misc.Mode2
ltx/en_uk_lash/me.m04.d04:meMA.Ode9C1H.ode	@ltx/en_uk_lash/miscellanea:misc.Ode9
ltx/en_uk_lash/me.m04.d04:meMA.Ode9C1H.text	@ltx/en_uk_lash/he.h.m2:heHE.TonEkTheouTheonLogon.text
ltx/en_uk_lash/me.m04.d04:meMA.Ode9C1T.incipit	…
ltx/en_uk_lash/me.m04.d04:meMA.Ode9C1T.melody	@ltx/en_uk_lash/he.h.m2:heHE.TonEkTheouTheonLogon.name
ltx/en_uk_lash/me.m04.d04:meMA.Ode9C1T.mode	@ltx/en_uk_lash/miscellanea:misc.Mode2
ltx/en_uk_lash/me.m04.d04:meMA.Ode9C1T.ode	@ltx/en_uk_lash/miscellanea:misc.Ode9
ltx/en_uk_lash/me.m04.d04:meMA.Ode9C1T.text	
ltx/en_uk_lash/me.m04.d04:meVE.Apolytikion1.greekmelody	@ltx/en_uk_lash/he.a.m4:heAU.TachyProkatalave.greekname
ltx/en_uk_lash/me.m04.d04:meVE.Apolytikion1.incipit	…
ltx/en_uk_lash/me.m04.d04:meVE.Apolytikion1.melody	@ltx/en_uk_lash/he.a.m4:heAU.TachyProkatalave.name
ltx/en_uk_lash/me.m04.d04:meVE.Apolytikion1.mode	@ltx/en_uk_lash/miscellanea:misc.Mode4
ltx/en_uk_lash/me.m04.d04:meVE.Apolytikion1.poet	
ltx/en_uk_lash/me.m04.d04:meVE.Apolytikion1.text	
ltx/en_uk_lash/me.m04.d04:meVE.SticStavrotheotokion.greekmelody	@ltx/en_uk_lash/he.a.m2:heAU.OteEkTouXylou.greekname
ltx/en_uk_lash/me.m04.d04:meVE.SticStavrotheotokion.incipit	…
ltx/en_uk_lash/me.m04.d04:meVE.SticStavrotheotokion.melody	@ltx/en_uk_lash/he.a.m2:heAU.OteEkTouXylou.name
ltx/en_uk_lash/me.m04.d04:meVE.SticStavrotheotokion.mode	@ltx/en_uk_lash/miscellanea:misc.Mode2
ltx/en_uk_lash/me.m04.d04:meVE.SticStavrotheotokion.text	
ltx/en_uk_lash/me.m04.d04:meVE.SticTheotokion.greekmelody	@ltx/en_uk_lash/he.a.m2:heAU.OteEkTouXylou.greekname
ltx/en_uk_lash/me.m04.d04:meVE.SticTheotokion.incipit	…
ltx/en_uk_lash/me.m04.d04:meVE.SticTheotokion.melody	@ltx/en_uk_lash/he.a.m2:heAU.OteEkTouXylou.name
ltx/en_uk_lash/me.m04.d04:meVE.SticTheotokion.mode	@ltx/en_uk_lash/miscellanea:misc.Mode2
ltx/en_uk_lash/me.m04.d04:meVE.SticTheotokion.text	
ltx/en_uk_lash/me.m04.d04:meVE.Stichera01.incipit	…
ltx/en_uk_lash/me.m04.d04:meVE.Stichera01.melody	@ltx/en_uk_lash/he.a.m2:heAU.OteEkTouXylou.name
ltx/en_uk_lash/me.m04.d04:meVE.Stichera01.mode	@ltx/en_uk_lash/miscellanea:misc.Mode2
ltx/en_uk_lash/me.m04.d04:meVE.Stichera01.text	
ltx/en_uk_lash/me.m04.d04:meVE.Stichera02.incipit	…
ltx/en_uk_lash/me.m04.d04:meVE.Stichera02.melody	@ltx/en_uk_lash/he.a.m2:heAU.OteEkTouXylou.name
ltx/en_uk_lash/me.m04.d04:meVE.Stichera02.mode	@ltx/en_uk_lash/miscellanea:misc.Mode2
ltx/en_uk_lash/me.m04.d04:meVE.Stichera02.text	
ltx/en_uk_lash/me.m04.d04:meVE.Stichera03.incipit	…
ltx/en_uk_lash/me.m04.d04:meVE.Stichera03.melody	@ltx/en_uk_lash/he.a.m2:heAU.OteEkTouXylou.name
ltx/en_uk_lash/me.m04.d04:meVE.Stichera03.mode	@ltx/en_uk_lash/miscellanea:misc.Mode2
ltx/en_uk_lash/me.m04.d04:meVE.Stichera03.text	
