ltx/en_uk_lash/le.pr.me.r38:leprVE.reading.book_abbr	@ltx/en_uk_lash/bible:Isaiah.abbr
ltx/en_uk_lash/le.pr.me.r38:leprVE.reading.book_string	@ltx/en_uk_lash/bible:Isaiah.text
ltx/en_uk_lash/le.pr.me.r38:leprVE.reading.chapverse	[43:9-14a]
ltx/en_uk_lash/le.pr.me.r38:leprVE.reading.text	Thus says the Lord: All the nations have been assembled and rulers from them shall be assembled; who will declare these things among them? or who will make heard to you the things from the beginning? Let them bring their witnesses and let them be justified, and them hear and let them speak what is true. Be my witnesses, and I too am a witness, says the Lord God, and my servant whom I have chosen; that you may know and believe me, and understand that I AM; before me there was no other God, and after me there will not be. I am God, and apart from me there is none who saves. I have declared and I have saved; I reproved, and there was no strange god among you. You are my witnesses and I am a witness, says the Lord God. Again from the beginning I AM, and there is none who can deliver from my hands; I will make, and who will turn it back? Thus says the Lord God who redeems us, the holy one of Israel.
ltx/en_uk_lash/le.pr.me.r38:leprVE.reading.title	
ltx/en_uk_lash/le.pr.me.r38:leprVE.reading.version	@ltx/en_uk_lash/properties:version.designation
