ltx/en_uk_lash/gm.foramartyr:meMA.C1.acrostic.notice1	of which the Acrostic is:
ltx/en_uk_lash/gm.foramartyr:meMA.C1.acrostic.text	Accept my eighth ode, O All-blessed. Joseph.
ltx/en_uk_lash/gm.foramartyr:meMA.C1.acrostic.title	The Canon,
ltx/en_uk_lash/gm.foramartyr:meMA.C1.title	@ltx/en_uk_lash/titles:ti.TheCanonGeneralMenaion
ltx/en_uk_lash/gm.foramartyr:meMA.C1.verse	@ltx/en_uk_lash/prayers:pr.verse_SaintM.text
ltx/en_uk_lash/gm.foramartyr:meMA.Ode1C11.greekmelody	@ltx/en_uk_lash/he.h.m8:heHE.YgranDiodefsas.greekname
ltx/en_uk_lash/gm.foramartyr:meMA.Ode1C11.incipit	Revered Martyr of Christ, having…
ltx/en_uk_lash/gm.foramartyr:meMA.Ode1C11.melody	@ltx/en_uk_lash/he.h.m8:heHE.YgranDiodefsas.name
ltx/en_uk_lash/gm.foramartyr:meMA.Ode1C11.mode	@ltx/en_uk_lash/miscellanea:misc.Mode8
ltx/en_uk_lash/gm.foramartyr:meMA.Ode1C11.ode	@ltx/en_uk_lash/miscellanea:misc.Ode1
ltx/en_uk_lash/gm.foramartyr:meMA.Ode1C11.text	Revered Martyr of Christ, having accomplished the godly contest, you have been found worthy of the heavenly kingdom, as you intercede on behalf of the world.
ltx/en_uk_lash/gm.foramartyr:meMA.Ode1C12.incipit	By godly struggles you changed…
ltx/en_uk_lash/gm.foramartyr:meMA.Ode1C12.melody	@ltx/en_uk_lash/he.h.m8:heHE.YgranDiodefsas.name
ltx/en_uk_lash/gm.foramartyr:meMA.Ode1C12.mode	@ltx/en_uk_lash/miscellanea:misc.Mode8
ltx/en_uk_lash/gm.foramartyr:meMA.Ode1C12.ode	@ltx/en_uk_lash/miscellanea:misc.Ode1
ltx/en_uk_lash/gm.foramartyr:meMA.Ode1C12.text	By godly struggles you changed the tyrant''s decree; but, brave athlete, I beg you by your mediations take pity on me, who am always being changed for the worse.
ltx/en_uk_lash/gm.foramartyr:meMA.Ode1C13.incipit	You were declared to be…
ltx/en_uk_lash/gm.foramartyr:meMA.Ode1C13.melody	@ltx/en_uk_lash/he.h.m8:heHE.YgranDiodefsas.name
ltx/en_uk_lash/gm.foramartyr:meMA.Ode1C13.mode	@ltx/en_uk_lash/miscellanea:misc.Mode8
ltx/en_uk_lash/gm.foramartyr:meMA.Ode1C13.ode	@ltx/en_uk_lash/miscellanea:misc.Ode1
ltx/en_uk_lash/gm.foramartyr:meMA.Ode1C13.text	You were declared to be a temple of the all-powerful, O Martyr of Christ; by your prayers show those who sing your praises in your honoured shrine to be the dwellings of the Spirit.
ltx/en_uk_lash/gm.foramartyr:meMA.Ode1C1H.incipit	@ltx/en_uk_lash/he.h.m8:heHE.YgranDiodefsas.incipit
ltx/en_uk_lash/gm.foramartyr:meMA.Ode1C1H.melody	@ltx/en_uk_lash/he.h.m8:heHE.YgranDiodefsas.melody
ltx/en_uk_lash/gm.foramartyr:meMA.Ode1C1H.mode	@ltx/en_uk_lash/miscellanea:misc.Mode8
ltx/en_uk_lash/gm.foramartyr:meMA.Ode1C1H.ode	@ltx/en_uk_lash/miscellanea:misc.Ode1
ltx/en_uk_lash/gm.foramartyr:meMA.Ode1C1H.text	@ltx/en_uk_lash/he.h.m8:heHE.YgranDiodefsas.text
ltx/en_uk_lash/gm.foramartyr:meMA.Ode1C1T.incipit	He who is full empties…
ltx/en_uk_lash/gm.foramartyr:meMA.Ode1C1T.melody	@ltx/en_uk_lash/he.h.m8:heHE.YgranDiodefsas.name
ltx/en_uk_lash/gm.foramartyr:meMA.Ode1C1T.mode	@ltx/en_uk_lash/miscellanea:misc.Mode8
ltx/en_uk_lash/gm.foramartyr:meMA.Ode1C1T.ode	@ltx/en_uk_lash/miscellanea:misc.Ode1
ltx/en_uk_lash/gm.foramartyr:meMA.Ode1C1T.text	He who is full empties himself, O Pure one, in your womb, yet does not empty his Father''s bosom; implore him therefore to grant salvation to those who honour you with faith.
ltx/en_uk_lash/gm.foramartyr:meMA.Ode3C11.greekmelody	@ltx/en_uk_lash/he.h.m8:heHE.SyEiToStereoma.greekname
ltx/en_uk_lash/gm.foramartyr:meMA.Ode3C11.incipit	Abandoning race and fame, Martyr…
ltx/en_uk_lash/gm.foramartyr:meMA.Ode3C11.melody	@ltx/en_uk_lash/he.h.m8:heHE.SyEiToStereoma.name
ltx/en_uk_lash/gm.foramartyr:meMA.Ode3C11.mode	@ltx/en_uk_lash/miscellanea:misc.Mode8
ltx/en_uk_lash/gm.foramartyr:meMA.Ode3C11.ode	@ltx/en_uk_lash/miscellanea:misc.Ode3
ltx/en_uk_lash/gm.foramartyr:meMA.Ode3C11.text	Abandoning race and fame, Martyr of Christ, you were eager to die; and so you enjoy eternal life.
ltx/en_uk_lash/gm.foramartyr:meMA.Ode3C12.incipit	Give help, O Martyr, to…
ltx/en_uk_lash/gm.foramartyr:meMA.Ode3C12.melody	@ltx/en_uk_lash/he.h.m8:heHE.SyEiToStereoma.name
ltx/en_uk_lash/gm.foramartyr:meMA.Ode3C12.mode	@ltx/en_uk_lash/miscellanea:misc.Mode8
ltx/en_uk_lash/gm.foramartyr:meMA.Ode3C12.ode	@ltx/en_uk_lash/miscellanea:misc.Ode3
ltx/en_uk_lash/gm.foramartyr:meMA.Ode3C12.text	Give help, O Martyr, to us who are always endangered by the insults of the world and by fearful troubles.
ltx/en_uk_lash/gm.foramartyr:meMA.Ode3C13.incipit	You have found bliss and…
ltx/en_uk_lash/gm.foramartyr:meMA.Ode3C13.melody	@ltx/en_uk_lash/he.h.m8:heHE.SyEiToStereoma.name
ltx/en_uk_lash/gm.foramartyr:meMA.Ode3C13.mode	@ltx/en_uk_lash/miscellanea:misc.Mode8
ltx/en_uk_lash/gm.foramartyr:meMA.Ode3C13.ode	@ltx/en_uk_lash/miscellanea:misc.Ode3
ltx/en_uk_lash/gm.foramartyr:meMA.Ode3C13.text	You have found bliss and are full of every illumination; intercede then, O Champion, that all may be enriched with righteousness.
ltx/en_uk_lash/gm.foramartyr:meMA.Ode3C1H.incipit	@ltx/en_uk_lash/he.h.m8:heHE.SyEiToStereoma.incipit
ltx/en_uk_lash/gm.foramartyr:meMA.Ode3C1H.melody	@ltx/en_uk_lash/he.h.m8:heHE.SyEiToStereoma.melody
ltx/en_uk_lash/gm.foramartyr:meMA.Ode3C1H.mode	@ltx/en_uk_lash/miscellanea:misc.Mode8
ltx/en_uk_lash/gm.foramartyr:meMA.Ode3C1H.ode	@ltx/en_uk_lash/miscellanea:misc.Ode3
ltx/en_uk_lash/gm.foramartyr:meMA.Ode3C1H.text	@ltx/en_uk_lash/he.h.m8:heHE.SyEiToStereoma.text
ltx/en_uk_lash/gm.foramartyr:meMA.Ode3C1T.incipit	You carried the ear of…
ltx/en_uk_lash/gm.foramartyr:meMA.Ode3C1T.melody	@ltx/en_uk_lash/he.h.m8:heHE.SyEiToStereoma.name
ltx/en_uk_lash/gm.foramartyr:meMA.Ode3C1T.mode	@ltx/en_uk_lash/miscellanea:misc.Mode8
ltx/en_uk_lash/gm.foramartyr:meMA.Ode3C1T.ode	@ltx/en_uk_lash/miscellanea:misc.Ode3
ltx/en_uk_lash/gm.foramartyr:meMA.Ode3C1T.text	You carried the ear of corn that had not been husbanded, O Immaculate, which nourishes the hearts of all of us who faithfully sing your praise.
ltx/en_uk_lash/gm.foramartyr:meMA.Ode3Kathisma1.greekmelody	@ltx/en_uk_lash/he.a.m5:heAU.TonSynanarchonLogon.greekname
ltx/en_uk_lash/gm.foramartyr:meMA.Ode3Kathisma1.incipit	Radiant with the forms of…
ltx/en_uk_lash/gm.foramartyr:meMA.Ode3Kathisma1.melody	@ltx/en_uk_lash/he.a.m5:heAU.TonSynanarchonLogon.notmetered
ltx/en_uk_lash/gm.foramartyr:meMA.Ode3Kathisma1.mode	@ltx/en_uk_lash/miscellanea:misc.Mode5
ltx/en_uk_lash/gm.foramartyr:meMA.Ode3Kathisma1.text	Radiant with the forms of virtues, made beautiful by the light of martyrdom, you shine more brightly than the sun, wise Martyr, strong as steel, and you truly illumine those who faithfully celebrate your light-bearing memorial, all-glorious Champion, and who venerate your relics.
ltx/en_uk_lash/gm.foramartyr:meMA.Ode3KathismaSt.incipit	By the Cross of your…
ltx/en_uk_lash/gm.foramartyr:meMA.Ode3KathismaSt.melody	@ltx/en_uk_lash/he.a.m5:heAU.TonSynanarchonLogon.notmetered
ltx/en_uk_lash/gm.foramartyr:meMA.Ode3KathismaSt.mode	@ltx/en_uk_lash/miscellanea:misc.Mode5
ltx/en_uk_lash/gm.foramartyr:meMA.Ode3KathismaSt.text	By the Cross of your Son, O full of God''s grace, all the error of idols has been destroyed and the strength of the demons trampled down; and so we faithful, as is fitting, ever hymn and bless you, and confessing you to be Mother of God, magnify you.
ltx/en_uk_lash/gm.foramartyr:meMA.Ode3KathismaT.incipit	Hail gate of the Lord…
ltx/en_uk_lash/gm.foramartyr:meMA.Ode3KathismaT.melody	@ltx/en_uk_lash/he.a.m5:heAU.TonSynanarchonLogon.notmetered
ltx/en_uk_lash/gm.foramartyr:meMA.Ode3KathismaT.mode	@ltx/en_uk_lash/miscellanea:misc.Mode5
ltx/en_uk_lash/gm.foramartyr:meMA.Ode3KathismaT.text	Hail gate of the Lord, through which none may pass; hail wall and protection of those who flee to you; hail haven without storms and who did not know wedlock; who bore in the flesh your Maker and God, do not cease to intercede for those who hymn and worship your offspring.
ltx/en_uk_lash/gm.foramartyr:meMA.Ode4C11.greekmelody	@ltx/en_uk_lash/he.h.m8:heHE.EisakikoaKyrie.greekname
ltx/en_uk_lash/gm.foramartyr:meMA.Ode4C11.incipit	I have disregarded God''s laws…
ltx/en_uk_lash/gm.foramartyr:meMA.Ode4C11.melody	@ltx/en_uk_lash/he.h.m8:heHE.EisakikoaKyrie.name
ltx/en_uk_lash/gm.foramartyr:meMA.Ode4C11.mode	@ltx/en_uk_lash/miscellanea:misc.Mode8
ltx/en_uk_lash/gm.foramartyr:meMA.Ode4C11.ode	@ltx/en_uk_lash/miscellanea:misc.Ode4
ltx/en_uk_lash/gm.foramartyr:meMA.Ode4C11.text	I have disregarded God''s laws, I have lived in every lawlessness; hasten, holy Martyr, help me, who am under condemnation, I implore you.
ltx/en_uk_lash/gm.foramartyr:meMA.Ode4C12.incipit	Bound for the Lord''s sake…
ltx/en_uk_lash/gm.foramartyr:meMA.Ode4C12.melody	@ltx/en_uk_lash/he.h.m8:heHE.EisakikoaKyrie.name
ltx/en_uk_lash/gm.foramartyr:meMA.Ode4C12.mode	@ltx/en_uk_lash/miscellanea:misc.Mode8
ltx/en_uk_lash/gm.foramartyr:meMA.Ode4C12.ode	@ltx/en_uk_lash/miscellanea:misc.Ode4
ltx/en_uk_lash/gm.foramartyr:meMA.Ode4C12.text	Bound for the Lord''s sake, you undid all the wickedness of the foe; from which save, O Martyr, all those who faithfully make their prayer to you.
ltx/en_uk_lash/gm.foramartyr:meMA.Ode4C13.incipit	On the day of judgement…
ltx/en_uk_lash/gm.foramartyr:meMA.Ode4C13.melody	@ltx/en_uk_lash/he.h.m8:heHE.EisakikoaKyrie.name
ltx/en_uk_lash/gm.foramartyr:meMA.Ode4C13.mode	@ltx/en_uk_lash/miscellanea:misc.Mode8
ltx/en_uk_lash/gm.foramartyr:meMA.Ode4C13.ode	@ltx/en_uk_lash/miscellanea:misc.Ode4
ltx/en_uk_lash/gm.foramartyr:meMA.Ode4C13.text	On the day of judgement, when we stand before the Lord to be judged, become a helper for us who are under condemnation, glorious Martyr.
ltx/en_uk_lash/gm.foramartyr:meMA.Ode4C1H.incipit	@ltx/en_uk_lash/he.h.m8:heHE.EisakikoaKyrie.incipit
ltx/en_uk_lash/gm.foramartyr:meMA.Ode4C1H.melody	@ltx/en_uk_lash/he.h.m8:heHE.EisakikoaKyrie.melody
ltx/en_uk_lash/gm.foramartyr:meMA.Ode4C1H.mode	@ltx/en_uk_lash/miscellanea:misc.Mode8
ltx/en_uk_lash/gm.foramartyr:meMA.Ode4C1H.ode	@ltx/en_uk_lash/miscellanea:misc.Ode4
ltx/en_uk_lash/gm.foramartyr:meMA.Ode4C1H.text	@ltx/en_uk_lash/he.h.m8:heHE.EisakikoaKyrie.text
ltx/en_uk_lash/gm.foramartyr:meMA.Ode4C1T.incipit	You gave a body to…
ltx/en_uk_lash/gm.foramartyr:meMA.Ode4C1T.melody	@ltx/en_uk_lash/he.h.m8:heHE.EisakikoaKyrie.name
ltx/en_uk_lash/gm.foramartyr:meMA.Ode4C1T.mode	@ltx/en_uk_lash/miscellanea:misc.Mode8
ltx/en_uk_lash/gm.foramartyr:meMA.Ode4C1T.ode	@ltx/en_uk_lash/miscellanea:misc.Ode4
ltx/en_uk_lash/gm.foramartyr:meMA.Ode4C1T.text	You gave a body to God, who dwelt in you in a manner past understanding; ask him, O All-blameless, that we may be found worthy of eternal glory.
ltx/en_uk_lash/gm.foramartyr:meMA.Ode5C11.greekmelody	@ltx/en_uk_lash/he.h.m8:heHE.OrthrizontesVoomenSoi.greekname
ltx/en_uk_lash/gm.foramartyr:meMA.Ode5C11.incipit	United with the heavenly powers…
ltx/en_uk_lash/gm.foramartyr:meMA.Ode5C11.melody	@ltx/en_uk_lash/he.h.m8:heHE.OrthrizontesVoomenSoi.name
ltx/en_uk_lash/gm.foramartyr:meMA.Ode5C11.mode	@ltx/en_uk_lash/miscellanea:misc.Mode8
ltx/en_uk_lash/gm.foramartyr:meMA.Ode5C11.ode	@ltx/en_uk_lash/miscellanea:misc.Ode5
ltx/en_uk_lash/gm.foramartyr:meMA.Ode5C11.text	United with the heavenly powers, brave Champion, intercede that those who sing your praise on earth may be saved.
ltx/en_uk_lash/gm.foramartyr:meMA.Ode5C12.incipit	Heal, I cry to you…
ltx/en_uk_lash/gm.foramartyr:meMA.Ode5C12.melody	@ltx/en_uk_lash/he.h.m8:heHE.OrthrizontesVoomenSoi.name
ltx/en_uk_lash/gm.foramartyr:meMA.Ode5C12.mode	@ltx/en_uk_lash/miscellanea:misc.Mode8
ltx/en_uk_lash/gm.foramartyr:meMA.Ode5C12.ode	@ltx/en_uk_lash/miscellanea:misc.Ode5
ltx/en_uk_lash/gm.foramartyr:meMA.Ode5C12.text	Heal, I cry to you, revered Martyr, the chronic passions of my soul, by making supplication to the Lover of mankind.
ltx/en_uk_lash/gm.foramartyr:meMA.Ode5C13.incipit	In accordance with laws you…
ltx/en_uk_lash/gm.foramartyr:meMA.Ode5C13.melody	@ltx/en_uk_lash/he.h.m8:heHE.OrthrizontesVoomenSoi.name
ltx/en_uk_lash/gm.foramartyr:meMA.Ode5C13.mode	@ltx/en_uk_lash/miscellanea:misc.Mode8
ltx/en_uk_lash/gm.foramartyr:meMA.Ode5C13.ode	@ltx/en_uk_lash/miscellanea:misc.Ode5
ltx/en_uk_lash/gm.foramartyr:meMA.Ode5C13.text	In accordance with laws you competed; empower us then to keep the laws of the Almighty, glorious Martyr.
ltx/en_uk_lash/gm.foramartyr:meMA.Ode5C1H.incipit	@ltx/en_uk_lash/he.h.m8:heHE.OrthrizontesVoomenSoi.incipit
ltx/en_uk_lash/gm.foramartyr:meMA.Ode5C1H.melody	@ltx/en_uk_lash/he.h.m8:heHE.OrthrizontesVoomenSoi.melody
ltx/en_uk_lash/gm.foramartyr:meMA.Ode5C1H.mode	@ltx/en_uk_lash/miscellanea:misc.Mode8
ltx/en_uk_lash/gm.foramartyr:meMA.Ode5C1H.ode	@ltx/en_uk_lash/miscellanea:misc.Ode5
ltx/en_uk_lash/gm.foramartyr:meMA.Ode5C1H.text	@ltx/en_uk_lash/he.h.m8:heHE.OrthrizontesVoomenSoi.text
ltx/en_uk_lash/gm.foramartyr:meMA.Ode5C1T.incipit	Virgin Mother of God, implore…
ltx/en_uk_lash/gm.foramartyr:meMA.Ode5C1T.melody	@ltx/en_uk_lash/he.h.m8:heHE.OrthrizontesVoomenSoi.name
ltx/en_uk_lash/gm.foramartyr:meMA.Ode5C1T.mode	@ltx/en_uk_lash/miscellanea:misc.Mode8
ltx/en_uk_lash/gm.foramartyr:meMA.Ode5C1T.ode	@ltx/en_uk_lash/miscellanea:misc.Ode5
ltx/en_uk_lash/gm.foramartyr:meMA.Ode5C1T.text	Virgin Mother of God, implore your Son to give us pardon of faults and his mercy.
ltx/en_uk_lash/gm.foramartyr:meMA.Ode6C11.greekmelody	@ltx/en_uk_lash/he.h.m8:heHE.IlasthitiMoiSotir.greekname
ltx/en_uk_lash/gm.foramartyr:meMA.Ode6C11.incipit	Wise Martyr, a light which…
ltx/en_uk_lash/gm.foramartyr:meMA.Ode6C11.melody	@ltx/en_uk_lash/he.h.m8:heHE.IlasthitiMoiSotir.name
ltx/en_uk_lash/gm.foramartyr:meMA.Ode6C11.mode	@ltx/en_uk_lash/miscellanea:misc.Mode8
ltx/en_uk_lash/gm.foramartyr:meMA.Ode6C11.ode	@ltx/en_uk_lash/miscellanea:misc.Ode6
ltx/en_uk_lash/gm.foramartyr:meMA.Ode6C11.text	Wise Martyr, a light which never sets has dawned for you who struggled, and holy tents of joy received you. As you dwell in them remember those who sing your praise on earth.
ltx/en_uk_lash/gm.foramartyr:meMA.Ode6C12.incipit	Revered Martyr, you accomplished great…
ltx/en_uk_lash/gm.foramartyr:meMA.Ode6C12.melody	@ltx/en_uk_lash/he.h.m8:heHE.IlasthitiMoiSotir.name
ltx/en_uk_lash/gm.foramartyr:meMA.Ode6C12.mode	@ltx/en_uk_lash/miscellanea:misc.Mode8
ltx/en_uk_lash/gm.foramartyr:meMA.Ode6C12.ode	@ltx/en_uk_lash/miscellanea:misc.Ode6
ltx/en_uk_lash/gm.foramartyr:meMA.Ode6C12.text	Revered Martyr, you accomplished great struggles on earth; by your sacred prayers rescue us from great evils, dangers and tribulations, that we may glorify you with love.
ltx/en_uk_lash/gm.foramartyr:meMA.Ode6C13.incipit	Do not declare me, Jesus…
ltx/en_uk_lash/gm.foramartyr:meMA.Ode6C13.melody	@ltx/en_uk_lash/he.h.m8:heHE.IlasthitiMoiSotir.name
ltx/en_uk_lash/gm.foramartyr:meMA.Ode6C13.mode	@ltx/en_uk_lash/miscellanea:misc.Mode8
ltx/en_uk_lash/gm.foramartyr:meMA.Ode6C13.ode	@ltx/en_uk_lash/miscellanea:misc.Ode6
ltx/en_uk_lash/gm.foramartyr:meMA.Ode6C13.text	Do not declare me, Jesus, to be one condemned when I stand before your dread throne, O Word; but take pity, save me at the godly mediations of your Saint, O you of many mercies.
ltx/en_uk_lash/gm.foramartyr:meMA.Ode6C1H.incipit	@ltx/en_uk_lash/he.h.m8:heHE.IlasthitiMoiSotir.incipit
ltx/en_uk_lash/gm.foramartyr:meMA.Ode6C1H.melody	@ltx/en_uk_lash/he.h.m8:heHE.IlasthitiMoiSotir.melody
ltx/en_uk_lash/gm.foramartyr:meMA.Ode6C1H.mode	@ltx/en_uk_lash/miscellanea:misc.Mode8
ltx/en_uk_lash/gm.foramartyr:meMA.Ode6C1H.ode	@ltx/en_uk_lash/miscellanea:misc.Ode6
ltx/en_uk_lash/gm.foramartyr:meMA.Ode6C1H.text	@ltx/en_uk_lash/he.h.m8:heHE.IlasthitiMoiSotir.text
ltx/en_uk_lash/gm.foramartyr:meMA.Ode6C1T.incipit	Hallow my mind and guide…
ltx/en_uk_lash/gm.foramartyr:meMA.Ode6C1T.melody	@ltx/en_uk_lash/he.h.m8:heHE.IlasthitiMoiSotir.name
ltx/en_uk_lash/gm.foramartyr:meMA.Ode6C1T.mode	@ltx/en_uk_lash/miscellanea:misc.Mode8
ltx/en_uk_lash/gm.foramartyr:meMA.Ode6C1T.ode	@ltx/en_uk_lash/miscellanea:misc.Ode6
ltx/en_uk_lash/gm.foramartyr:meMA.Ode6C1T.text	Hallow my mind and guide my soul to light, All-holy Maiden, Mother of God and ever-Virgin who ineffably bore God who rests among the saints.
ltx/en_uk_lash/gm.foramartyr:meMA.Ode7C11.greekmelody	@ltx/en_uk_lash/he.h.m8:heHE.OiEkTisIoudaias.greekname
ltx/en_uk_lash/gm.foramartyr:meMA.Ode7C11.incipit	Joy of Martyrs, save me…
ltx/en_uk_lash/gm.foramartyr:meMA.Ode7C11.melody	@ltx/en_uk_lash/he.h.m8:heHE.OiEkTisIoudaias.name
ltx/en_uk_lash/gm.foramartyr:meMA.Ode7C11.mode	@ltx/en_uk_lash/miscellanea:misc.Mode8
ltx/en_uk_lash/gm.foramartyr:meMA.Ode7C11.ode	@ltx/en_uk_lash/miscellanea:misc.Ode7
ltx/en_uk_lash/gm.foramartyr:meMA.Ode7C11.text	Joy of Martyrs, save me from the world''s stumbling blocks, the dishonour of passions and every tribulation, and grant that I may sing each day: God of our fathers, blessed are you!
ltx/en_uk_lash/gm.foramartyr:meMA.Ode7C12.incipit	My good protector, do not…
ltx/en_uk_lash/gm.foramartyr:meMA.Ode7C12.melody	@ltx/en_uk_lash/he.h.m8:heHE.OiEkTisIoudaias.name
ltx/en_uk_lash/gm.foramartyr:meMA.Ode7C12.mode	@ltx/en_uk_lash/miscellanea:misc.Mode8
ltx/en_uk_lash/gm.foramartyr:meMA.Ode7C12.ode	@ltx/en_uk_lash/miscellanea:misc.Ode7
ltx/en_uk_lash/gm.foramartyr:meMA.Ode7C12.text	My good protector, do not utterly despise me who am storm-tossed by the troubles of life, but take pity on me by your prayers, and save me who sing: God of our fathers, blessed are you!
ltx/en_uk_lash/gm.foramartyr:meMA.Ode7C13.incipit	Save me, all-blessed one, by…
ltx/en_uk_lash/gm.foramartyr:meMA.Ode7C13.melody	@ltx/en_uk_lash/he.h.m8:heHE.OiEkTisIoudaias.name
ltx/en_uk_lash/gm.foramartyr:meMA.Ode7C13.mode	@ltx/en_uk_lash/miscellanea:misc.Mode8
ltx/en_uk_lash/gm.foramartyr:meMA.Ode7C13.ode	@ltx/en_uk_lash/miscellanea:misc.Ode7
ltx/en_uk_lash/gm.foramartyr:meMA.Ode7C13.text	Save me, all-blessed one, by your fervent help from foul sloth, dread sin and blackness, for I have recourse to you in faith, that I may faithfully honour you to all the ages.
ltx/en_uk_lash/gm.foramartyr:meMA.Ode7C1H.incipit	@ltx/en_uk_lash/he.h.m8:heHE.OiEkTisIoudaias.incipit
ltx/en_uk_lash/gm.foramartyr:meMA.Ode7C1H.melody	@ltx/en_uk_lash/he.h.m8:heHE.OiEkTisIoudaias.melody
ltx/en_uk_lash/gm.foramartyr:meMA.Ode7C1H.mode	@ltx/en_uk_lash/miscellanea:misc.Mode8
ltx/en_uk_lash/gm.foramartyr:meMA.Ode7C1H.ode	@ltx/en_uk_lash/miscellanea:misc.Ode7
ltx/en_uk_lash/gm.foramartyr:meMA.Ode7C1H.text	@ltx/en_uk_lash/he.h.m8:heHE.OiEkTisIoudaias.text
ltx/en_uk_lash/gm.foramartyr:meMA.Ode7C1T.incipit	Having squandered the years of…
ltx/en_uk_lash/gm.foramartyr:meMA.Ode7C1T.melody	@ltx/en_uk_lash/he.h.m8:heHE.OiEkTisIoudaias.name
ltx/en_uk_lash/gm.foramartyr:meMA.Ode7C1T.mode	@ltx/en_uk_lash/miscellanea:misc.Mode8
ltx/en_uk_lash/gm.foramartyr:meMA.Ode7C1T.ode	@ltx/en_uk_lash/miscellanea:misc.Ode7
ltx/en_uk_lash/gm.foramartyr:meMA.Ode7C1T.text	Having squandered the years of my life in great indifference, O Virgin, I fall down before you and cry out: Rouse me, save me, as I cry to your Son: God of our fathers, blessed are you!
ltx/en_uk_lash/gm.foramartyr:meMA.Ode8C11.greekmelody	@ltx/en_uk_lash/he.h.m8:heHE.NikitaiTyrannou.greekname
ltx/en_uk_lash/gm.foramartyr:meMA.Ode8C11.incipit	You were tried, O invincible…
ltx/en_uk_lash/gm.foramartyr:meMA.Ode8C11.melody	@ltx/en_uk_lash/he.h.m8:heHE.NikitaiTyrannou.name
ltx/en_uk_lash/gm.foramartyr:meMA.Ode8C11.mode	@ltx/en_uk_lash/miscellanea:misc.Mode8
ltx/en_uk_lash/gm.foramartyr:meMA.Ode8C11.ode	@ltx/en_uk_lash/miscellanea:misc.Ode8
ltx/en_uk_lash/gm.foramartyr:meMA.Ode8C11.text	You were tried, O invincible, like gold in a fire of torments, and were revealed as an imprint of the sufferings of Christ as you cried out: All you works of the Lord, bless the Lord!
ltx/en_uk_lash/gm.foramartyr:meMA.Ode8C12.incipit	By your prayers, holy Martyr…
ltx/en_uk_lash/gm.foramartyr:meMA.Ode8C12.melody	@ltx/en_uk_lash/he.h.m8:heHE.NikitaiTyrannou.name
ltx/en_uk_lash/gm.foramartyr:meMA.Ode8C12.mode	@ltx/en_uk_lash/miscellanea:misc.Mode8
ltx/en_uk_lash/gm.foramartyr:meMA.Ode8C12.ode	@ltx/en_uk_lash/miscellanea:misc.Ode8
ltx/en_uk_lash/gm.foramartyr:meMA.Ode8C12.text	By your prayers, holy Martyr, save me who am storm-tossed and trapped by the dread deceptions of the Stranger, as I cry out: All you works of the Lord, bless the Lord!
ltx/en_uk_lash/gm.foramartyr:meMA.Ode8C13.incipit	You abolished all the power…
ltx/en_uk_lash/gm.foramartyr:meMA.Ode8C13.melody	@ltx/en_uk_lash/he.h.m8:heHE.NikitaiTyrannou.name
ltx/en_uk_lash/gm.foramartyr:meMA.Ode8C13.mode	@ltx/en_uk_lash/miscellanea:misc.Mode8
ltx/en_uk_lash/gm.foramartyr:meMA.Ode8C13.ode	@ltx/en_uk_lash/miscellanea:misc.Ode8
ltx/en_uk_lash/gm.foramartyr:meMA.Ode8C13.text	You abolished all the power of the boaster, deliver me, glorious Martyr, from his wickedness as I cry aloud: All you works of the Lord, bless the Lord!
ltx/en_uk_lash/gm.foramartyr:meMA.Ode8C1H.incipit	@ltx/en_uk_lash/he.h.m8:heHE.NikitaiTyrannou.incipit
ltx/en_uk_lash/gm.foramartyr:meMA.Ode8C1H.melody	@ltx/en_uk_lash/he.h.m8:heHE.NikitaiTyrannou.melody
ltx/en_uk_lash/gm.foramartyr:meMA.Ode8C1H.mode	@ltx/en_uk_lash/miscellanea:misc.Mode8
ltx/en_uk_lash/gm.foramartyr:meMA.Ode8C1H.ode	@ltx/en_uk_lash/miscellanea:misc.Ode8
ltx/en_uk_lash/gm.foramartyr:meMA.Ode8C1H.text	@ltx/en_uk_lash/he.h.m8:heHE.NikitaiTyrannou.text
ltx/en_uk_lash/gm.foramartyr:meMA.Ode8C1T.incipit	You gave birth ineffably to…
ltx/en_uk_lash/gm.foramartyr:meMA.Ode8C1T.melody	@ltx/en_uk_lash/he.h.m8:heHE.NikitaiTyrannou.name
ltx/en_uk_lash/gm.foramartyr:meMA.Ode8C1T.mode	@ltx/en_uk_lash/miscellanea:misc.Mode8
ltx/en_uk_lash/gm.foramartyr:meMA.Ode8C1T.ode	@ltx/en_uk_lash/miscellanea:misc.Ode8
ltx/en_uk_lash/gm.foramartyr:meMA.Ode8C1T.text	You gave birth ineffably to the benefactor who became man through compassion, Mother of God, and who saves those who sing: All you works of the Lord, bless the Lord!
ltx/en_uk_lash/gm.foramartyr:meMA.Ode9C11.greekmelody	@ltx/en_uk_lash/he.h.m8:heHE.EfrixePasaAkoi.greekname
ltx/en_uk_lash/gm.foramartyr:meMA.Ode9C11.incipit	That with godly voices we…
ltx/en_uk_lash/gm.foramartyr:meMA.Ode9C11.melody	@ltx/en_uk_lash/he.h.m8:heHE.EfrixePasaAkoi.name
ltx/en_uk_lash/gm.foramartyr:meMA.Ode9C11.mode	@ltx/en_uk_lash/miscellanea:misc.Mode8
ltx/en_uk_lash/gm.foramartyr:meMA.Ode9C11.ode	@ltx/en_uk_lash/miscellanea:misc.Ode9
ltx/en_uk_lash/gm.foramartyr:meMA.Ode9C11.text	That with godly voices we may call you blessed, revered Martyr, who nobly struggled and smashed the goads of the deceiver, save us, who have gained you as our noble protector, from dangers, afflictions and troubles of many kinds.
ltx/en_uk_lash/gm.foramartyr:meMA.Ode9C12.incipit	Like the dawn, like the…
ltx/en_uk_lash/gm.foramartyr:meMA.Ode9C12.melody	@ltx/en_uk_lash/he.h.m8:heHE.EfrixePasaAkoi.name
ltx/en_uk_lash/gm.foramartyr:meMA.Ode9C12.mode	@ltx/en_uk_lash/miscellanea:misc.Mode8
ltx/en_uk_lash/gm.foramartyr:meMA.Ode9C12.ode	@ltx/en_uk_lash/miscellanea:misc.Ode9
ltx/en_uk_lash/gm.foramartyr:meMA.Ode9C12.text	Like the dawn, like the morning star you have dawned, revered Martyr, and enlightened by your teachings all the ends of the earth, and banished the dread darkness of the demons; and so enlighten me, darkened in soul by sloth.
ltx/en_uk_lash/gm.foramartyr:meMA.Ode9C13.incipit	Establish all those who faithfully…
ltx/en_uk_lash/gm.foramartyr:meMA.Ode9C13.melody	@ltx/en_uk_lash/he.h.m8:heHE.EfrixePasaAkoi.name
ltx/en_uk_lash/gm.foramartyr:meMA.Ode9C13.mode	@ltx/en_uk_lash/miscellanea:misc.Mode8
ltx/en_uk_lash/gm.foramartyr:meMA.Ode9C13.ode	@ltx/en_uk_lash/miscellanea:misc.Ode9
ltx/en_uk_lash/gm.foramartyr:meMA.Ode9C13.text	Establish all those who faithfully ever take refuge under your protection, revered Martyr, lest we be overwhelmed by life''s troubles and the wiles of the evil one, who year by year magnify and glorify you.
ltx/en_uk_lash/gm.foramartyr:meMA.Ode9C14.incipit	Take care, my soul, the…
ltx/en_uk_lash/gm.foramartyr:meMA.Ode9C14.melody	@ltx/en_uk_lash/he.h.m8:heHE.EfrixePasaAkoi.name
ltx/en_uk_lash/gm.foramartyr:meMA.Ode9C14.mode	@ltx/en_uk_lash/miscellanea:misc.Mode8
ltx/en_uk_lash/gm.foramartyr:meMA.Ode9C14.ode	@ltx/en_uk_lash/miscellanea:misc.Ode9
ltx/en_uk_lash/gm.foramartyr:meMA.Ode9C14.text	Take care, my soul, the great day of judgement has drawn near, when what is made is brought to judgement. And what will you do, as you persist in evil works? Make and cry out: At the prayers of your Saint save me, O Lord!
ltx/en_uk_lash/gm.foramartyr:meMA.Ode9C1H.incipit	@ltx/en_uk_lash/he.h.m8:heHE.EfrixePasaAkoi.incipit
ltx/en_uk_lash/gm.foramartyr:meMA.Ode9C1H.melody	@ltx/en_uk_lash/he.h.m8:heHE.EfrixePasaAkoi.melody
ltx/en_uk_lash/gm.foramartyr:meMA.Ode9C1H.mode	@ltx/en_uk_lash/miscellanea:misc.Mode8
ltx/en_uk_lash/gm.foramartyr:meMA.Ode9C1H.ode	@ltx/en_uk_lash/miscellanea:misc.Ode9
ltx/en_uk_lash/gm.foramartyr:meMA.Ode9C1H.text	@ltx/en_uk_lash/he.h.m8:heHE.EfrixePasaAkoi.text
ltx/en_uk_lash/gm.foramartyr:meMA.Ode9C1T.incipit	Wretch that I am, I…
ltx/en_uk_lash/gm.foramartyr:meMA.Ode9C1T.melody	@ltx/en_uk_lash/he.h.m8:heHE.EfrixePasaAkoi.name
ltx/en_uk_lash/gm.foramartyr:meMA.Ode9C1T.mode	@ltx/en_uk_lash/miscellanea:misc.Mode8
ltx/en_uk_lash/gm.foramartyr:meMA.Ode9C1T.ode	@ltx/en_uk_lash/miscellanea:misc.Ode9
ltx/en_uk_lash/gm.foramartyr:meMA.Ode9C1T.text	Wretch that I am, I tremble at your impartial tribunal, O only King; keep me then uncondemned in your compassion, the all-pure Lady, who ineffably gave you a body, implore s you insistently, O Christ of many mercies.
ltx/en_uk_lash/gm.foramartyr:meVE.SticStavrotheotokion.incipit	When the Ewe-lamb, your Mother…
ltx/en_uk_lash/gm.foramartyr:meVE.SticStavrotheotokion.melody	@ltx/en_uk_lash/he.a.m4:heAU.OsGennaionEnMartysi.notmetered
ltx/en_uk_lash/gm.foramartyr:meVE.SticStavrotheotokion.mode	@ltx/en_uk_lash/miscellanea:misc.Mode4
ltx/en_uk_lash/gm.foramartyr:meVE.SticStavrotheotokion.text	When the Ewe-lamb, your Mother, saw you nailed to the Cross, Lord, she was struck with amazement, and cried out: What is this sight, my Son so greatly loved? Is this how the disobedient, lawless people repays your many wonders? But glory, Master, to your ineffable condescension!
ltx/en_uk_lash/gm.foramartyr:meVE.SticTheotokion.incipit	As I sail by sea…
ltx/en_uk_lash/gm.foramartyr:meVE.SticTheotokion.melody	@ltx/en_uk_lash/he.a.m4:heAU.OsGennaionEnMartysi.notmetered
ltx/en_uk_lash/gm.foramartyr:meVE.SticTheotokion.mode	@ltx/en_uk_lash/miscellanea:misc.Mode4
ltx/en_uk_lash/gm.foramartyr:meVE.SticTheotokion.text	As I sail by sea, travel by road, sleep by night, watch over me; give me the grace of a watchful mind, All-blameless, and grant that I may do the Lord''s will; that on the day of sentence I may find release from all that I have done in life, I who flee to your protection.
ltx/en_uk_lash/gm.foramartyr:meVE.Stichera01.incipit	You put on the purple…
ltx/en_uk_lash/gm.foramartyr:meVE.Stichera01.melody	@ltx/en_uk_lash/he.a.m4:heAU.OsGennaionEnMartysi.notmetered
ltx/en_uk_lash/gm.foramartyr:meVE.Stichera01.mode	@ltx/en_uk_lash/miscellanea:misc.Mode4
ltx/en_uk_lash/gm.foramartyr:meVE.Stichera01.text	You put on the purple garment of your flesh, made scarlet with blood by divine grace, glorious, all wise Martyr, and, having bound your head with a diadem of incorruption and life, holding in your right hand the trophy of the Cross like a sceptre, you reign with Christ rejoicing for ever.
ltx/en_uk_lash/gm.foramartyr:meVE.Stichera02.incipit	You have become known, revered…
ltx/en_uk_lash/gm.foramartyr:meVE.Stichera02.melody	@ltx/en_uk_lash/he.a.m4:heAU.OsGennaionEnMartysi.notmetered
ltx/en_uk_lash/gm.foramartyr:meVE.Stichera02.mode	@ltx/en_uk_lash/miscellanea:misc.Mode4
ltx/en_uk_lash/gm.foramartyr:meVE.Stichera02.text	You have become known, revered Martyr, as an invincible warrior, for having armoured yourself with the weapon of the Cross you went out to single combat with the hostile champion and utterly defeated him, triumphing brilliantly and receiving the crown of victory from the only judge and Master of the contest, who reigns as king for ever.
ltx/en_uk_lash/gm.foramartyr:meVE.Stichera03.incipit	By your honoured sufferings, glorious…
ltx/en_uk_lash/gm.foramartyr:meVE.Stichera03.melody	@ltx/en_uk_lash/he.a.m4:heAU.OsGennaionEnMartysi.notmetered
ltx/en_uk_lash/gm.foramartyr:meVE.Stichera03.mode	@ltx/en_uk_lash/miscellanea:misc.Mode4
ltx/en_uk_lash/gm.foramartyr:meVE.Stichera03.text	By your honoured sufferings, glorious, invincible Athlete, you were an image of the honoured suffering of Christ, and becoming a victor you dwell with all the saints in the city on high, glad champion, and by participation in God are made divine; and so we celebrate your honoured and holy festival.
