ltx/en_uk_lash/tr.d022:trCO.header	
ltx/en_uk_lash/tr.d022:trDA.commemoration.full	CHEESE SUNDAY - THE CASTING OUT OF ADAM FROM PARADISE
ltx/en_uk_lash/tr.d022:trDA.commemoration.short	
ltx/en_uk_lash/tr.d022:trDA.dismissal	@ltx/en_uk_lash/dismissals:dis00.resurrection
ltx/en_uk_lash/tr.d022:trDA.insert1	
ltx/en_uk_lash/tr.d022:trDA.insert2	
ltx/en_uk_lash/tr.d022:trDA.note	
ltx/en_uk_lash/tr.d022:trDA.title	
ltx/en_uk_lash/tr.d022:trHO.commemorations	
ltx/en_uk_lash/tr.d022:trHO.daytitle	
ltx/en_uk_lash/tr.d022:trHO.description1	
ltx/en_uk_lash/tr.d022:trHO.description2	
ltx/en_uk_lash/tr.d022:trHO.note1	
ltx/en_uk_lash/tr.d022:trHO.note2	
ltx/en_uk_lash/tr.d022:trLI.Kontakion1.incipit	@ltx/en_uk_lash/tr.d022:trMA.Kontakion1.incipit
ltx/en_uk_lash/tr.d022:trLI.Kontakion1.melody	@ltx/en_uk_lash/tr.d022:trMA.Kontakion1.melody
ltx/en_uk_lash/tr.d022:trLI.Kontakion1.mode	@ltx/en_uk_lash/tr.d022:trMA.Kontakion1.mode
ltx/en_uk_lash/tr.d022:trLI.Kontakion1.text	@ltx/en_uk_lash/tr.d022:trMA.Kontakion1.text
ltx/en_uk_lash/tr.d022:trLI.Megalynarion.text	
ltx/en_uk_lash/tr.d022:trMA.C1.poet	@ltx/en_uk_lash/poets:po.ChristoforouTouProtasikritou
ltx/en_uk_lash/tr.d022:trMA.C1.title	@ltx/en_uk_lash/titles:ti.CanonTriodion
ltx/en_uk_lash/tr.d022:trMA.C1.verse	@ltx/en_uk_lash/prayers:pr.verse_God.text
ltx/en_uk_lash/tr.d022:trMA.Exaposteilarion1.greekmelody	@ltx/en_uk_lash/he.a.m2:heAU.GynaikesAkoutisthite.greekname
ltx/en_uk_lash/tr.d022:trMA.Exaposteilarion1.incipit	…
ltx/en_uk_lash/tr.d022:trMA.Exaposteilarion1.melody	@ltx/en_uk_lash/he.a.m2:heAU.GynaikesAkoutisthite.notmetered
ltx/en_uk_lash/tr.d022:trMA.Exaposteilarion1.mode	@ltx/en_uk_lash/miscellanea:misc.Mode2
ltx/en_uk_lash/tr.d022:trMA.Exaposteilarion1.text	
ltx/en_uk_lash/tr.d022:trMA.Exaposteilarion2.greekmelody	@ltx/en_uk_lash/he.a.m2:heAU.ToisMathitaisSynelthomen.greekname
ltx/en_uk_lash/tr.d022:trMA.Exaposteilarion2.incipit	…
ltx/en_uk_lash/tr.d022:trMA.Exaposteilarion2.melody	@ltx/en_uk_lash/he.a.m2:heAU.ToisMathitaisSynelthomen.notmetered
ltx/en_uk_lash/tr.d022:trMA.Exaposteilarion2.mode	@ltx/en_uk_lash/miscellanea:misc.Mode2
ltx/en_uk_lash/tr.d022:trMA.Exaposteilarion2.text	
ltx/en_uk_lash/tr.d022:trMA.Kontakion1.incipit	A Master, Guide to wisdom…
ltx/en_uk_lash/tr.d022:trMA.Kontakion1.melody	@ltx/en_uk_lash/miscellanea:misc.AutomelonNotMetered
ltx/en_uk_lash/tr.d022:trMA.Kontakion1.mode	@ltx/en_uk_lash/miscellanea:misc.Mode6
ltx/en_uk_lash/tr.d022:trMA.Kontakion1.text	A Master, Guide to wisdom, Giver of prudent counsel, Instructor of the foolish and Champion of the poor, make firm my heart, and give it understanding. Word of the Father, give me a word: for see, I shall not stop my lips from crying out to you: In your mercy, have mercy on me who have fallen!
ltx/en_uk_lash/tr.d022:trMA.Lauds1.incipit	…
ltx/en_uk_lash/tr.d022:trMA.Lauds1.melody	@ltx/en_uk_lash/miscellanea:misc.Idiomelon
ltx/en_uk_lash/tr.d022:trMA.Lauds1.mode	@ltx/en_uk_lash/miscellanea:misc.Mode5
ltx/en_uk_lash/tr.d022:trMA.Lauds1.text	
ltx/en_uk_lash/tr.d022:trMA.Lauds2.incipit	…
ltx/en_uk_lash/tr.d022:trMA.Lauds2.melody	@ltx/en_uk_lash/miscellanea:misc.Idiomelon
ltx/en_uk_lash/tr.d022:trMA.Lauds2.mode	@ltx/en_uk_lash/miscellanea:misc.Mode5
ltx/en_uk_lash/tr.d022:trMA.Lauds2.text	
ltx/en_uk_lash/tr.d022:trMA.Lauds3.incipit	…
ltx/en_uk_lash/tr.d022:trMA.Lauds3.melody	@ltx/en_uk_lash/miscellanea:misc.Idiomelon
ltx/en_uk_lash/tr.d022:trMA.Lauds3.mode	@ltx/en_uk_lash/miscellanea:misc.Mode6
ltx/en_uk_lash/tr.d022:trMA.Lauds3.text	
ltx/en_uk_lash/tr.d022:trMA.LaudsGlory.incipit	…
ltx/en_uk_lash/tr.d022:trMA.LaudsGlory.melody	@ltx/en_uk_lash/miscellanea:misc.Idiomelon
ltx/en_uk_lash/tr.d022:trMA.LaudsGlory.mode	@ltx/en_uk_lash/miscellanea:misc.Mode6
ltx/en_uk_lash/tr.d022:trMA.LaudsGlory.text	
ltx/en_uk_lash/tr.d022:trMA.LaudsTheotokion.incipit	@ltx/en_uk_lash/oc.m2.d1:ocMA.Kathisma23.incipit
ltx/en_uk_lash/tr.d022:trMA.LaudsTheotokion.melody	
ltx/en_uk_lash/tr.d022:trMA.LaudsTheotokion.mode	
ltx/en_uk_lash/tr.d022:trMA.LaudsTheotokion.text	@ltx/en_uk_lash/oc.m2.d1:ocMA.Kathisma23.text
ltx/en_uk_lash/tr.d022:trMA.Ode1C11.greekmelody	@ltx/en_uk_lash/he.h.m6:heHE.OsEnIpeiroPezefsas.greekname
ltx/en_uk_lash/tr.d022:trMA.Ode1C11.incipit	…
ltx/en_uk_lash/tr.d022:trMA.Ode1C11.melody	@ltx/en_uk_lash/he.h.m6:heHE.OsEnIpeiroPezefsas.name
ltx/en_uk_lash/tr.d022:trMA.Ode1C11.mode	@ltx/en_uk_lash/miscellanea:misc.Mode6
ltx/en_uk_lash/tr.d022:trMA.Ode1C11.ode	@ltx/en_uk_lash/miscellanea:misc.Ode1
ltx/en_uk_lash/tr.d022:trMA.Ode1C11.text	
ltx/en_uk_lash/tr.d022:trMA.Ode1C12.incipit	…
ltx/en_uk_lash/tr.d022:trMA.Ode1C12.melody	@ltx/en_uk_lash/he.h.m6:heHE.OsEnIpeiroPezefsas.name
ltx/en_uk_lash/tr.d022:trMA.Ode1C12.mode	@ltx/en_uk_lash/miscellanea:misc.Mode6
ltx/en_uk_lash/tr.d022:trMA.Ode1C12.ode	@ltx/en_uk_lash/miscellanea:misc.Ode1
ltx/en_uk_lash/tr.d022:trMA.Ode1C12.text	
ltx/en_uk_lash/tr.d022:trMA.Ode1C13.incipit	…
ltx/en_uk_lash/tr.d022:trMA.Ode1C13.melody	@ltx/en_uk_lash/he.h.m6:heHE.OsEnIpeiroPezefsas.name
ltx/en_uk_lash/tr.d022:trMA.Ode1C13.mode	@ltx/en_uk_lash/miscellanea:misc.Mode6
ltx/en_uk_lash/tr.d022:trMA.Ode1C13.ode	@ltx/en_uk_lash/miscellanea:misc.Ode1
ltx/en_uk_lash/tr.d022:trMA.Ode1C13.text	
ltx/en_uk_lash/tr.d022:trMA.Ode1C14.incipit	…
ltx/en_uk_lash/tr.d022:trMA.Ode1C14.melody	@ltx/en_uk_lash/he.h.m6:heHE.OsEnIpeiroPezefsas.name
ltx/en_uk_lash/tr.d022:trMA.Ode1C14.mode	@ltx/en_uk_lash/miscellanea:misc.Mode6
ltx/en_uk_lash/tr.d022:trMA.Ode1C14.ode	@ltx/en_uk_lash/miscellanea:misc.Ode1
ltx/en_uk_lash/tr.d022:trMA.Ode1C14.text	
ltx/en_uk_lash/tr.d022:trMA.Ode1C1T.incipit	…
ltx/en_uk_lash/tr.d022:trMA.Ode1C1T.melody	@ltx/en_uk_lash/he.h.m6:heHE.OsEnIpeiroPezefsas.name
ltx/en_uk_lash/tr.d022:trMA.Ode1C1T.mode	@ltx/en_uk_lash/miscellanea:misc.Mode6
ltx/en_uk_lash/tr.d022:trMA.Ode1C1T.ode	@ltx/en_uk_lash/miscellanea:misc.Ode1
ltx/en_uk_lash/tr.d022:trMA.Ode1C1T.text	
ltx/en_uk_lash/tr.d022:trMA.Ode3C11.greekmelody	@ltx/en_uk_lash/he.h.m6:heHE.OukEstinAgios.greekname
ltx/en_uk_lash/tr.d022:trMA.Ode3C11.incipit	…
ltx/en_uk_lash/tr.d022:trMA.Ode3C11.melody	@ltx/en_uk_lash/he.h.m6:heHE.OukEstinAgios.name
ltx/en_uk_lash/tr.d022:trMA.Ode3C11.mode	@ltx/en_uk_lash/miscellanea:misc.Mode6
ltx/en_uk_lash/tr.d022:trMA.Ode3C11.ode	@ltx/en_uk_lash/miscellanea:misc.Ode3
ltx/en_uk_lash/tr.d022:trMA.Ode3C11.text	
ltx/en_uk_lash/tr.d022:trMA.Ode3C12.incipit	…
ltx/en_uk_lash/tr.d022:trMA.Ode3C12.melody	@ltx/en_uk_lash/he.h.m6:heHE.OukEstinAgios.name
ltx/en_uk_lash/tr.d022:trMA.Ode3C12.mode	@ltx/en_uk_lash/miscellanea:misc.Mode6
ltx/en_uk_lash/tr.d022:trMA.Ode3C12.ode	@ltx/en_uk_lash/miscellanea:misc.Ode3
ltx/en_uk_lash/tr.d022:trMA.Ode3C12.text	
ltx/en_uk_lash/tr.d022:trMA.Ode3C13.incipit	…
ltx/en_uk_lash/tr.d022:trMA.Ode3C13.melody	@ltx/en_uk_lash/he.h.m6:heHE.OukEstinAgios.name
ltx/en_uk_lash/tr.d022:trMA.Ode3C13.mode	@ltx/en_uk_lash/miscellanea:misc.Mode6
ltx/en_uk_lash/tr.d022:trMA.Ode3C13.ode	@ltx/en_uk_lash/miscellanea:misc.Ode3
ltx/en_uk_lash/tr.d022:trMA.Ode3C13.text	
ltx/en_uk_lash/tr.d022:trMA.Ode3C1T.incipit	…
ltx/en_uk_lash/tr.d022:trMA.Ode3C1T.melody	@ltx/en_uk_lash/he.h.m6:heHE.OukEstinAgios.name
ltx/en_uk_lash/tr.d022:trMA.Ode3C1T.mode	@ltx/en_uk_lash/miscellanea:misc.Mode6
ltx/en_uk_lash/tr.d022:trMA.Ode3C1T.ode	@ltx/en_uk_lash/miscellanea:misc.Ode3
ltx/en_uk_lash/tr.d022:trMA.Ode3C1T.text	
ltx/en_uk_lash/tr.d022:trMA.Ode3Kathisma1.greekmelody	@ltx/en_uk_lash/he.a.m4:heAU.KateplagiIosif.greekname
ltx/en_uk_lash/tr.d022:trMA.Ode3Kathisma1.incipit	…
ltx/en_uk_lash/tr.d022:trMA.Ode3Kathisma1.melody	@ltx/en_uk_lash/he.a.m4:heAU.KateplagiIosif.notmetered
ltx/en_uk_lash/tr.d022:trMA.Ode3Kathisma1.mode	@ltx/en_uk_lash/miscellanea:misc.Mode4
ltx/en_uk_lash/tr.d022:trMA.Ode3Kathisma1.text	
ltx/en_uk_lash/tr.d022:trMA.Ode3Kathisma2.greekmelody	@ltx/en_uk_lash/he.a.m4:heAU.OYpsotheisEnToStavro.greekname
ltx/en_uk_lash/tr.d022:trMA.Ode3Kathisma2.incipit	…
ltx/en_uk_lash/tr.d022:trMA.Ode3Kathisma2.melody	@ltx/en_uk_lash/he.a.m4:heAU.OYpsotheisEnToStavro.notmetered
ltx/en_uk_lash/tr.d022:trMA.Ode3Kathisma2.mode	@ltx/en_uk_lash/miscellanea:misc.Mode4
ltx/en_uk_lash/tr.d022:trMA.Ode3Kathisma2.text	
ltx/en_uk_lash/tr.d022:trMA.Ode3Kathisma3.greekmelody	@ltx/en_uk_lash/he.a.m4:heAU.OYpsotheisEnToStavro.greekname
ltx/en_uk_lash/tr.d022:trMA.Ode3Kathisma3.incipit	…
ltx/en_uk_lash/tr.d022:trMA.Ode3Kathisma3.melody	@ltx/en_uk_lash/he.a.m4:heAU.OYpsotheisEnToStavro.notmetered
ltx/en_uk_lash/tr.d022:trMA.Ode3Kathisma3.mode	@ltx/en_uk_lash/miscellanea:misc.Mode4
ltx/en_uk_lash/tr.d022:trMA.Ode3Kathisma3.text	
ltx/en_uk_lash/tr.d022:trMA.Ode4C11.greekmelody	@ltx/en_uk_lash/he.h.m6:heHE.ChristosMouDynamis.greekname
ltx/en_uk_lash/tr.d022:trMA.Ode4C11.incipit	…
ltx/en_uk_lash/tr.d022:trMA.Ode4C11.melody	@ltx/en_uk_lash/he.h.m6:heHE.ChristosMouDynamis.name
ltx/en_uk_lash/tr.d022:trMA.Ode4C11.mode	@ltx/en_uk_lash/miscellanea:misc.Mode6
ltx/en_uk_lash/tr.d022:trMA.Ode4C11.ode	@ltx/en_uk_lash/miscellanea:misc.Ode4
ltx/en_uk_lash/tr.d022:trMA.Ode4C11.text	
ltx/en_uk_lash/tr.d022:trMA.Ode4C12.incipit	…
ltx/en_uk_lash/tr.d022:trMA.Ode4C12.melody	@ltx/en_uk_lash/he.h.m6:heHE.ChristosMouDynamis.name
ltx/en_uk_lash/tr.d022:trMA.Ode4C12.mode	@ltx/en_uk_lash/miscellanea:misc.Mode6
ltx/en_uk_lash/tr.d022:trMA.Ode4C12.ode	@ltx/en_uk_lash/miscellanea:misc.Ode4
ltx/en_uk_lash/tr.d022:trMA.Ode4C12.text	
ltx/en_uk_lash/tr.d022:trMA.Ode4C13.incipit	…
ltx/en_uk_lash/tr.d022:trMA.Ode4C13.melody	@ltx/en_uk_lash/he.h.m6:heHE.ChristosMouDynamis.name
ltx/en_uk_lash/tr.d022:trMA.Ode4C13.mode	@ltx/en_uk_lash/miscellanea:misc.Mode6
ltx/en_uk_lash/tr.d022:trMA.Ode4C13.ode	@ltx/en_uk_lash/miscellanea:misc.Ode4
ltx/en_uk_lash/tr.d022:trMA.Ode4C13.text	
ltx/en_uk_lash/tr.d022:trMA.Ode4C14.incipit	…
ltx/en_uk_lash/tr.d022:trMA.Ode4C14.melody	@ltx/en_uk_lash/he.h.m6:heHE.ChristosMouDynamis.name
ltx/en_uk_lash/tr.d022:trMA.Ode4C14.mode	@ltx/en_uk_lash/miscellanea:misc.Mode6
ltx/en_uk_lash/tr.d022:trMA.Ode4C14.ode	@ltx/en_uk_lash/miscellanea:misc.Ode4
ltx/en_uk_lash/tr.d022:trMA.Ode4C14.text	
ltx/en_uk_lash/tr.d022:trMA.Ode4C1T.incipit	…
ltx/en_uk_lash/tr.d022:trMA.Ode4C1T.melody	@ltx/en_uk_lash/he.h.m6:heHE.ChristosMouDynamis.name
ltx/en_uk_lash/tr.d022:trMA.Ode4C1T.mode	@ltx/en_uk_lash/miscellanea:misc.Mode6
ltx/en_uk_lash/tr.d022:trMA.Ode4C1T.ode	@ltx/en_uk_lash/miscellanea:misc.Ode4
ltx/en_uk_lash/tr.d022:trMA.Ode4C1T.text	
ltx/en_uk_lash/tr.d022:trMA.Ode5C11.greekmelody	@ltx/en_uk_lash/he.h.m6:heHE.ToTheioFengeiSou.greekname
ltx/en_uk_lash/tr.d022:trMA.Ode5C11.incipit	…
ltx/en_uk_lash/tr.d022:trMA.Ode5C11.melody	@ltx/en_uk_lash/he.h.m6:heHE.ToTheioFengeiSou.name
ltx/en_uk_lash/tr.d022:trMA.Ode5C11.mode	@ltx/en_uk_lash/miscellanea:misc.Mode6
ltx/en_uk_lash/tr.d022:trMA.Ode5C11.ode	@ltx/en_uk_lash/miscellanea:misc.Ode5
ltx/en_uk_lash/tr.d022:trMA.Ode5C11.text	
ltx/en_uk_lash/tr.d022:trMA.Ode5C12.incipit	…
ltx/en_uk_lash/tr.d022:trMA.Ode5C12.melody	@ltx/en_uk_lash/he.h.m6:heHE.ToTheioFengeiSou.name
ltx/en_uk_lash/tr.d022:trMA.Ode5C12.mode	@ltx/en_uk_lash/miscellanea:misc.Mode6
ltx/en_uk_lash/tr.d022:trMA.Ode5C12.ode	@ltx/en_uk_lash/miscellanea:misc.Ode5
ltx/en_uk_lash/tr.d022:trMA.Ode5C12.text	
ltx/en_uk_lash/tr.d022:trMA.Ode5C13.incipit	…
ltx/en_uk_lash/tr.d022:trMA.Ode5C13.melody	@ltx/en_uk_lash/he.h.m6:heHE.ToTheioFengeiSou.name
ltx/en_uk_lash/tr.d022:trMA.Ode5C13.mode	@ltx/en_uk_lash/miscellanea:misc.Mode6
ltx/en_uk_lash/tr.d022:trMA.Ode5C13.ode	@ltx/en_uk_lash/miscellanea:misc.Ode5
ltx/en_uk_lash/tr.d022:trMA.Ode5C13.text	
ltx/en_uk_lash/tr.d022:trMA.Ode5C1T.incipit	…
ltx/en_uk_lash/tr.d022:trMA.Ode5C1T.melody	@ltx/en_uk_lash/he.h.m6:heHE.ToTheioFengeiSou.name
ltx/en_uk_lash/tr.d022:trMA.Ode5C1T.mode	@ltx/en_uk_lash/miscellanea:misc.Mode6
ltx/en_uk_lash/tr.d022:trMA.Ode5C1T.ode	@ltx/en_uk_lash/miscellanea:misc.Ode5
ltx/en_uk_lash/tr.d022:trMA.Ode5C1T.text	
ltx/en_uk_lash/tr.d022:trMA.Ode6C11.greekmelody	@ltx/en_uk_lash/he.h.m6:heHE.TouViouTinThalassan.greekname
ltx/en_uk_lash/tr.d022:trMA.Ode6C11.incipit	…
ltx/en_uk_lash/tr.d022:trMA.Ode6C11.melody	@ltx/en_uk_lash/he.h.m6:heHE.TouViouTinThalassan.name
ltx/en_uk_lash/tr.d022:trMA.Ode6C11.mode	@ltx/en_uk_lash/miscellanea:misc.Mode6
ltx/en_uk_lash/tr.d022:trMA.Ode6C11.ode	@ltx/en_uk_lash/miscellanea:misc.Ode6
ltx/en_uk_lash/tr.d022:trMA.Ode6C11.text	
ltx/en_uk_lash/tr.d022:trMA.Ode6C12.incipit	…
ltx/en_uk_lash/tr.d022:trMA.Ode6C12.melody	@ltx/en_uk_lash/he.h.m6:heHE.TouViouTinThalassan.name
ltx/en_uk_lash/tr.d022:trMA.Ode6C12.mode	@ltx/en_uk_lash/miscellanea:misc.Mode6
ltx/en_uk_lash/tr.d022:trMA.Ode6C12.ode	@ltx/en_uk_lash/miscellanea:misc.Ode6
ltx/en_uk_lash/tr.d022:trMA.Ode6C12.text	
ltx/en_uk_lash/tr.d022:trMA.Ode6C13.incipit	…
ltx/en_uk_lash/tr.d022:trMA.Ode6C13.melody	@ltx/en_uk_lash/he.h.m6:heHE.TouViouTinThalassan.name
ltx/en_uk_lash/tr.d022:trMA.Ode6C13.mode	@ltx/en_uk_lash/miscellanea:misc.Mode6
ltx/en_uk_lash/tr.d022:trMA.Ode6C13.ode	@ltx/en_uk_lash/miscellanea:misc.Ode6
ltx/en_uk_lash/tr.d022:trMA.Ode6C13.text	
ltx/en_uk_lash/tr.d022:trMA.Ode6C1T.incipit	…
ltx/en_uk_lash/tr.d022:trMA.Ode6C1T.melody	@ltx/en_uk_lash/he.h.m6:heHE.TouViouTinThalassan.name
ltx/en_uk_lash/tr.d022:trMA.Ode6C1T.mode	@ltx/en_uk_lash/miscellanea:misc.Mode6
ltx/en_uk_lash/tr.d022:trMA.Ode6C1T.ode	@ltx/en_uk_lash/miscellanea:misc.Ode6
ltx/en_uk_lash/tr.d022:trMA.Ode6C1T.text	
ltx/en_uk_lash/tr.d022:trMA.Ode7C11.greekmelody	@ltx/en_uk_lash/he.h.m6:heHE.DrosovolonMenTinKaminon.greekname
ltx/en_uk_lash/tr.d022:trMA.Ode7C11.incipit	…
ltx/en_uk_lash/tr.d022:trMA.Ode7C11.melody	@ltx/en_uk_lash/he.h.m6:heHE.DrosovolonMenTinKaminon.name
ltx/en_uk_lash/tr.d022:trMA.Ode7C11.mode	@ltx/en_uk_lash/miscellanea:misc.Mode6
ltx/en_uk_lash/tr.d022:trMA.Ode7C11.ode	@ltx/en_uk_lash/miscellanea:misc.Ode7
ltx/en_uk_lash/tr.d022:trMA.Ode7C11.text	
ltx/en_uk_lash/tr.d022:trMA.Ode7C12.incipit	…
ltx/en_uk_lash/tr.d022:trMA.Ode7C12.melody	@ltx/en_uk_lash/he.h.m6:heHE.DrosovolonMenTinKaminon.name
ltx/en_uk_lash/tr.d022:trMA.Ode7C12.mode	@ltx/en_uk_lash/miscellanea:misc.Mode6
ltx/en_uk_lash/tr.d022:trMA.Ode7C12.ode	@ltx/en_uk_lash/miscellanea:misc.Ode7
ltx/en_uk_lash/tr.d022:trMA.Ode7C12.text	
ltx/en_uk_lash/tr.d022:trMA.Ode7C13.incipit	…
ltx/en_uk_lash/tr.d022:trMA.Ode7C13.melody	@ltx/en_uk_lash/he.h.m6:heHE.DrosovolonMenTinKaminon.name
ltx/en_uk_lash/tr.d022:trMA.Ode7C13.mode	@ltx/en_uk_lash/miscellanea:misc.Mode6
ltx/en_uk_lash/tr.d022:trMA.Ode7C13.ode	@ltx/en_uk_lash/miscellanea:misc.Ode7
ltx/en_uk_lash/tr.d022:trMA.Ode7C13.text	
ltx/en_uk_lash/tr.d022:trMA.Ode7C1T.incipit	…
ltx/en_uk_lash/tr.d022:trMA.Ode7C1T.melody	@ltx/en_uk_lash/he.h.m6:heHE.DrosovolonMenTinKaminon.name
ltx/en_uk_lash/tr.d022:trMA.Ode7C1T.mode	@ltx/en_uk_lash/miscellanea:misc.Mode6
ltx/en_uk_lash/tr.d022:trMA.Ode7C1T.ode	@ltx/en_uk_lash/miscellanea:misc.Ode7
ltx/en_uk_lash/tr.d022:trMA.Ode7C1T.text	
ltx/en_uk_lash/tr.d022:trMA.Ode8C11.greekmelody	@ltx/en_uk_lash/he.h.m6:heHE.EkFlogosToisOsiois.greekname
ltx/en_uk_lash/tr.d022:trMA.Ode8C11.incipit	…
ltx/en_uk_lash/tr.d022:trMA.Ode8C11.melody	@ltx/en_uk_lash/he.h.m6:heHE.EkFlogosToisOsiois.name
ltx/en_uk_lash/tr.d022:trMA.Ode8C11.mode	@ltx/en_uk_lash/miscellanea:misc.Mode6
ltx/en_uk_lash/tr.d022:trMA.Ode8C11.ode	@ltx/en_uk_lash/miscellanea:misc.Ode8
ltx/en_uk_lash/tr.d022:trMA.Ode8C11.text	
ltx/en_uk_lash/tr.d022:trMA.Ode8C12.incipit	…
ltx/en_uk_lash/tr.d022:trMA.Ode8C12.melody	@ltx/en_uk_lash/he.h.m6:heHE.EkFlogosToisOsiois.name
ltx/en_uk_lash/tr.d022:trMA.Ode8C12.mode	@ltx/en_uk_lash/miscellanea:misc.Mode6
ltx/en_uk_lash/tr.d022:trMA.Ode8C12.ode	@ltx/en_uk_lash/miscellanea:misc.Ode8
ltx/en_uk_lash/tr.d022:trMA.Ode8C12.text	
ltx/en_uk_lash/tr.d022:trMA.Ode8C13.incipit	…
ltx/en_uk_lash/tr.d022:trMA.Ode8C13.melody	@ltx/en_uk_lash/he.h.m6:heHE.EkFlogosToisOsiois.name
ltx/en_uk_lash/tr.d022:trMA.Ode8C13.mode	@ltx/en_uk_lash/miscellanea:misc.Mode6
ltx/en_uk_lash/tr.d022:trMA.Ode8C13.ode	@ltx/en_uk_lash/miscellanea:misc.Ode8
ltx/en_uk_lash/tr.d022:trMA.Ode8C13.text	
ltx/en_uk_lash/tr.d022:trMA.Ode8C1T.incipit	…
ltx/en_uk_lash/tr.d022:trMA.Ode8C1T.melody	@ltx/en_uk_lash/he.h.m6:heHE.EkFlogosToisOsiois.name
ltx/en_uk_lash/tr.d022:trMA.Ode8C1T.mode	@ltx/en_uk_lash/miscellanea:misc.Mode6
ltx/en_uk_lash/tr.d022:trMA.Ode8C1T.ode	@ltx/en_uk_lash/miscellanea:misc.Ode8
ltx/en_uk_lash/tr.d022:trMA.Ode8C1T.text	
ltx/en_uk_lash/tr.d022:trMA.Ode9C11.greekmelody	@ltx/en_uk_lash/he.h.m6:heHE.TheonAnthropois.greekname
ltx/en_uk_lash/tr.d022:trMA.Ode9C11.incipit	…
ltx/en_uk_lash/tr.d022:trMA.Ode9C11.melody	@ltx/en_uk_lash/he.h.m6:heHE.TheonAnthropois.name
ltx/en_uk_lash/tr.d022:trMA.Ode9C11.mode	@ltx/en_uk_lash/miscellanea:misc.Mode6
ltx/en_uk_lash/tr.d022:trMA.Ode9C11.ode	@ltx/en_uk_lash/miscellanea:misc.Ode9
ltx/en_uk_lash/tr.d022:trMA.Ode9C11.text	
ltx/en_uk_lash/tr.d022:trMA.Ode9C12.incipit	…
ltx/en_uk_lash/tr.d022:trMA.Ode9C12.melody	@ltx/en_uk_lash/he.h.m6:heHE.TheonAnthropois.name
ltx/en_uk_lash/tr.d022:trMA.Ode9C12.mode	@ltx/en_uk_lash/miscellanea:misc.Mode6
ltx/en_uk_lash/tr.d022:trMA.Ode9C12.ode	@ltx/en_uk_lash/miscellanea:misc.Ode9
ltx/en_uk_lash/tr.d022:trMA.Ode9C12.text	
ltx/en_uk_lash/tr.d022:trMA.Ode9C13.incipit	…
ltx/en_uk_lash/tr.d022:trMA.Ode9C13.melody	@ltx/en_uk_lash/he.h.m6:heHE.TheonAnthropois.name
ltx/en_uk_lash/tr.d022:trMA.Ode9C13.mode	@ltx/en_uk_lash/miscellanea:misc.Mode6
ltx/en_uk_lash/tr.d022:trMA.Ode9C13.ode	@ltx/en_uk_lash/miscellanea:misc.Ode9
ltx/en_uk_lash/tr.d022:trMA.Ode9C13.text	
ltx/en_uk_lash/tr.d022:trMA.Ode9C14.incipit	…
ltx/en_uk_lash/tr.d022:trMA.Ode9C14.melody	@ltx/en_uk_lash/he.h.m6:heHE.TheonAnthropois.name
ltx/en_uk_lash/tr.d022:trMA.Ode9C14.mode	@ltx/en_uk_lash/miscellanea:misc.Mode6
ltx/en_uk_lash/tr.d022:trMA.Ode9C14.ode	@ltx/en_uk_lash/miscellanea:misc.Ode9
ltx/en_uk_lash/tr.d022:trMA.Ode9C14.text	
ltx/en_uk_lash/tr.d022:trMA.Ode9C1T.incipit	…
ltx/en_uk_lash/tr.d022:trMA.Ode9C1T.melody	@ltx/en_uk_lash/he.h.m6:heHE.TheonAnthropois.name
ltx/en_uk_lash/tr.d022:trMA.Ode9C1T.mode	@ltx/en_uk_lash/miscellanea:misc.Mode6
ltx/en_uk_lash/tr.d022:trMA.Ode9C1T.ode	@ltx/en_uk_lash/miscellanea:misc.Ode9
ltx/en_uk_lash/tr.d022:trMA.Ode9C1T.text	
ltx/en_uk_lash/tr.d022:trMA.Oikos1.text	
ltx/en_uk_lash/tr.d022:trMA.Oikos12.text	
ltx/en_uk_lash/tr.d022:trMA.Oikos13.text	
ltx/en_uk_lash/tr.d022:trMA.Oikos14.text	
ltx/en_uk_lash/tr.d022:trMA.PostGospelBoth.incipit	@ltx/en_uk_lash/tr.d001:trMA.PostGospelBoth.incipit
ltx/en_uk_lash/tr.d022:trMA.PostGospelBoth.melody	
ltx/en_uk_lash/tr.d022:trMA.PostGospelBoth.mode	@ltx/en_uk_lash/miscellanea:misc.Mode8
ltx/en_uk_lash/tr.d022:trMA.PostGospelBoth.text	@ltx/en_uk_lash/tr.d001:trMA.PostGospelBoth.text
ltx/en_uk_lash/tr.d022:trMA.PostGospelGlory.incipit	@ltx/en_uk_lash/tr.d001:trMA.PostGospelGlory.incipit
ltx/en_uk_lash/tr.d022:trMA.PostGospelGlory.melody	
ltx/en_uk_lash/tr.d022:trMA.PostGospelGlory.mode	@ltx/en_uk_lash/miscellanea:misc.Mode8
ltx/en_uk_lash/tr.d022:trMA.PostGospelGlory.text	@ltx/en_uk_lash/tr.d001:trMA.PostGospelGlory.text
ltx/en_uk_lash/tr.d022:trMA.PostGospelIdiomelon.incipit	@ltx/en_uk_lash/tr.d001:trMA.PostGospelIdiomelon.incipit
ltx/en_uk_lash/tr.d022:trMA.PostGospelIdiomelon.melody	
ltx/en_uk_lash/tr.d022:trMA.PostGospelIdiomelon.mode	@ltx/en_uk_lash/miscellanea:misc.Mode6
ltx/en_uk_lash/tr.d022:trMA.PostGospelIdiomelon.text	@ltx/en_uk_lash/tr.d001:trMA.PostGospelIdiomelon.text
ltx/en_uk_lash/tr.d022:trSY.commemoration.couplet1.title	
ltx/en_uk_lash/tr.d022:trSY.commemoration.couplet1.verse1	
ltx/en_uk_lash/tr.d022:trSY.commemoration.couplet1.verse2	
ltx/en_uk_lash/tr.d022:trSY.commemoration.narration.p01	
ltx/en_uk_lash/tr.d022:trSY.commemoration.narration.p02	
ltx/en_uk_lash/tr.d022:trSY.commemoration.narration.p03	
ltx/en_uk_lash/tr.d022:trSY.commemoration.narration.p04	
ltx/en_uk_lash/tr.d022:trSY.commemoration.narration.p05	
ltx/en_uk_lash/tr.d022:trSY.commemoration.narration.p06	
ltx/en_uk_lash/tr.d022:trSY.commemoration.narration.p07	
ltx/en_uk_lash/tr.d022:trSY.commemoration.text	
ltx/en_uk_lash/tr.d022:trSY.lastline	
ltx/en_uk_lash/tr.d022:trVE.AposGlory.incipit	Through eating Adam was cast…
ltx/en_uk_lash/tr.d022:trVE.AposGlory.melody	@ltx/en_uk_lash/miscellanea:misc.Idiomelon
ltx/en_uk_lash/tr.d022:trVE.AposGlory.mode	@ltx/en_uk_lash/miscellanea:misc.Mode6
ltx/en_uk_lash/tr.d022:trVE.AposGlory.text	Through eating Adam was cast out of Paradise. And so, as he sat in front of it, he wept, lamenting with a pitiful voice and saying, ''Woe is me, what have I suffered, wretch that I am! I transgressed one commandment of the Master, and now I am deprived of every good thing. Most holy Paradise, planted because of me and shut because of Eve, pray to him who made you and fashioned me, that once more I be filled with your flowers.'' Then the Saviour said to him, ''I do not want the creature which I fashioned to perish, but to be saved and come to knowledge of the truth, because the one who comes to me I will in no way cast out.''
ltx/en_uk_lash/tr.d022:trVE.AposTheotokion.incipit	@ltx/en_uk_lash/oc.m6.d1:ocVE.AposTheotokion.incipit
ltx/en_uk_lash/tr.d022:trVE.AposTheotokion.melody	
ltx/en_uk_lash/tr.d022:trVE.AposTheotokion.mode	@ltx/en_uk_lash/miscellanea:misc.Mode6
ltx/en_uk_lash/tr.d022:trVE.AposTheotokion.text	@ltx/en_uk_lash/oc.m6.d1:ocVE.AposTheotokion.text
ltx/en_uk_lash/tr.d022:trVE.LityBoth.incipit	…
ltx/en_uk_lash/tr.d022:trVE.LityBoth.melody	
ltx/en_uk_lash/tr.d022:trVE.LityBoth.mode	@ltx/en_uk_lash/miscellanea:misc.Mode6
ltx/en_uk_lash/tr.d022:trVE.LityBoth.text	
ltx/en_uk_lash/tr.d022:trVE.LityGlory.incipit	…
ltx/en_uk_lash/tr.d022:trVE.LityGlory.melody	@ltx/en_uk_lash/miscellanea:misc.Idiomelon
ltx/en_uk_lash/tr.d022:trVE.LityGlory.mode	@ltx/en_uk_lash/miscellanea:misc.Mode6
ltx/en_uk_lash/tr.d022:trVE.LityGlory.text	
ltx/en_uk_lash/tr.d022:trVE.MM.Stichera123as567.text	@ltx/en_uk_lash/properties:media.key
ltx/en_uk_lash/tr.d022:trVE.SticGlory.incipit	Adam sat opposite Paradise and…
ltx/en_uk_lash/tr.d022:trVE.SticGlory.melody	@ltx/en_uk_lash/miscellanea:misc.Idiomelon
ltx/en_uk_lash/tr.d022:trVE.SticGlory.mode	@ltx/en_uk_lash/miscellanea:misc.Mode6
ltx/en_uk_lash/tr.d022:trVE.SticGlory.text	Adam sat opposite Paradise and, lamenting his nakedness, he wept, ''Woe is me! By evil deceit was I persuaded and robbed, and exiled far from glory. Woe is me! Once naked in my simplicity, now I am in want. But, Paradise, no longer shall I enjoy your delight; no more shall I look upon the Lord my God and Maker, for I shall return to the earth whence I was taken. Merciful and compassionate Lord, I cry to you, ''Have mercy on me who am fallen''.
ltx/en_uk_lash/tr.d022:trVE.Stichera01.greekmelody	@ltx/en_uk_lash/he.a.m6:heAU.OlinApothemenoi.greekname
ltx/en_uk_lash/tr.d022:trVE.Stichera01.incipit	The Lord my Creator took…
ltx/en_uk_lash/tr.d022:trVE.Stichera01.melody	@ltx/en_uk_lash/he.a.m6:heAU.OlinApothemenoi.notmetered
ltx/en_uk_lash/tr.d022:trVE.Stichera01.mode	@ltx/en_uk_lash/miscellanea:misc.Mode6
ltx/en_uk_lash/tr.d022:trVE.Stichera01.text	The Lord my Creator took me as dust from the earth, and with the breath of life he gave me a soul and made me a living creature. He honoured me as ruler on earth over all things visible and as a companion of the Angels. But Satan the deceiver, using the serpent as his instrument, enticed me by food, separated me from the glory of God and gave me over to the earth and to the lowest depths of death. But as Master and compassionate call me back again.
ltx/en_uk_lash/tr.d022:trVE.Stichera02.greekmelody	@ltx/en_uk_lash/he.a.m6:heAU.OlinApothemenoi.greekname
ltx/en_uk_lash/tr.d022:trVE.Stichera02.incipit	Wretch that I am, I…
ltx/en_uk_lash/tr.d022:trVE.Stichera02.melody	@ltx/en_uk_lash/he.a.m6:heAU.OlinApothemenoi.notmetered
ltx/en_uk_lash/tr.d022:trVE.Stichera02.mode	@ltx/en_uk_lash/miscellanea:misc.Mode6
ltx/en_uk_lash/tr.d022:trVE.Stichera02.text	Wretch that I am, I have cast off the robe woven by God, disobeying your divine command, Lord, at the counsel of the enemy, and I am clothed now in fig leaves and in garments of skin. I am condemned to eat the bread of toil in the sweat of my brow, and the earth has been cursed so that it bears thorns and thistles for me. But, Lord, who in the last times were made flesh of a Virgin, call me back and bring me into Paradise again.
ltx/en_uk_lash/tr.d022:trVE.Stichera03.greekmelody	@ltx/en_uk_lash/he.a.m6:heAU.OlinApothemenoi.greekname
ltx/en_uk_lash/tr.d022:trVE.Stichera03.incipit	O precious Paradise, unsurpassed beauty…
ltx/en_uk_lash/tr.d022:trVE.Stichera03.melody	@ltx/en_uk_lash/he.a.m6:heAU.OlinApothemenoi.notmetered
ltx/en_uk_lash/tr.d022:trVE.Stichera03.mode	@ltx/en_uk_lash/miscellanea:misc.Mode6
ltx/en_uk_lash/tr.d022:trVE.Stichera03.text	O precious Paradise, unsurpassed beauty, tabernacle built by God, unending gladness and delight, glory of the just, joy of prophets, and dwelling place of saints, with the sound of your leaves implore to the Maker of all to open for me the gates which I closed by my transgression, and may count me worthy to partake of the Tree of Life and of the joy in which I delighted when I dwelt in you before
ltx/en_uk_lash/tr.d022:trVE.Stichera04.greekmelody	@ltx/en_uk_lash/he.a.m6:heAU.OlinApothemenoi.greekname
ltx/en_uk_lash/tr.d022:trVE.Stichera04.incipit	Adam was banished from Paradise…
ltx/en_uk_lash/tr.d022:trVE.Stichera04.melody	@ltx/en_uk_lash/he.a.m6:heAU.OlinApothemenoi.notmetered
ltx/en_uk_lash/tr.d022:trVE.Stichera04.mode	@ltx/en_uk_lash/miscellanea:misc.Mode6
ltx/en_uk_lash/tr.d022:trVE.Stichera04.text	Adam was banished from Paradise through disobedience and cast out from delight, beguiled by the words of a woman. Naked he sat opposite the place, lamenting ''Woe is me!'' Therefore let us all make haste to accept the season of the Fast and obey the traditions of the Gospel, that through them we may become well-pleasing to Christ and once more receive Paradise as our dwelling.
