ltx/en_uk_lash/pe.d081:peDA.commemoration.full	
ltx/en_uk_lash/pe.d081:peDA.commemoration.short	
ltx/en_uk_lash/pe.d081:peDA.dismissal	@ltx/en_uk_lash/dismissals:dis00.resurrection
ltx/en_uk_lash/pe.d081:peDA.insert1	
ltx/en_uk_lash/pe.d081:peDA.insert2	
ltx/en_uk_lash/pe.d081:peDA.note	
ltx/en_uk_lash/pe.d081:peHO.commemorations	
ltx/en_uk_lash/pe.d081:peHO.daytitle	
ltx/en_uk_lash/pe.d081:peHO.description1	
ltx/en_uk_lash/pe.d081:peHO.description2	
ltx/en_uk_lash/pe.d081:peHO.note1	
ltx/en_uk_lash/pe.d081:peHO.note2	
ltx/en_uk_lash/pe.d081:peMA.AposGlory.incipit	…
ltx/en_uk_lash/pe.d081:peMA.AposGlory.melody	@ltx/en_uk_lash/he.a.m2:heAU.OikosTouEfratha.name
ltx/en_uk_lash/pe.d081:peMA.AposGlory.mode	@ltx/en_uk_lash/miscellanea:misc.Mode2
ltx/en_uk_lash/pe.d081:peMA.AposGlory.text	
ltx/en_uk_lash/pe.d081:peMA.Aposticha1.greekmelody	@ltx/en_uk_lash/he.a.m2:heAU.OikosTouEfratha.greekname
ltx/en_uk_lash/pe.d081:peMA.Aposticha1.incipit	…
ltx/en_uk_lash/pe.d081:peMA.Aposticha1.melody	@ltx/en_uk_lash/he.a.m2:heAU.OikosTouEfratha.name
ltx/en_uk_lash/pe.d081:peMA.Aposticha1.mode	@ltx/en_uk_lash/miscellanea:misc.Mode2
ltx/en_uk_lash/pe.d081:peMA.Aposticha1.text	
ltx/en_uk_lash/pe.d081:peMA.Aposticha2.incipit	…
ltx/en_uk_lash/pe.d081:peMA.Aposticha2.melody	@ltx/en_uk_lash/he.a.m2:heAU.OikosTouEfratha.name
ltx/en_uk_lash/pe.d081:peMA.Aposticha2.mode	@ltx/en_uk_lash/miscellanea:misc.Mode2
ltx/en_uk_lash/pe.d081:peMA.Aposticha2.text	
ltx/en_uk_lash/pe.d081:peMA.Aposticha3.incipit	…
ltx/en_uk_lash/pe.d081:peMA.Aposticha3.melody	@ltx/en_uk_lash/he.a.m2:heAU.OikosTouEfratha.name
ltx/en_uk_lash/pe.d081:peMA.Aposticha3.mode	@ltx/en_uk_lash/miscellanea:misc.Mode2
ltx/en_uk_lash/pe.d081:peMA.Aposticha3.text	
ltx/en_uk_lash/pe.d081:peMA.Kathisma11.incipit	@ltx/en_uk_lash/oc.m1.d4:ocMA.Kathisma12.incipit
ltx/en_uk_lash/pe.d081:peMA.Kathisma11.melody	
ltx/en_uk_lash/pe.d081:peMA.Kathisma11.mode	@ltx/en_uk_lash/miscellanea:misc.Mode1
ltx/en_uk_lash/pe.d081:peMA.Kathisma11.text	@ltx/en_uk_lash/oc.m1.d4:ocMA.Kathisma12.text
ltx/en_uk_lash/pe.d081:peMA.Kathisma12.incipit	…
ltx/en_uk_lash/pe.d081:peMA.Kathisma12.melody	
ltx/en_uk_lash/pe.d081:peMA.Kathisma12.mode	@ltx/en_uk_lash/miscellanea:misc.Mode1
ltx/en_uk_lash/pe.d081:peMA.Kathisma12.text	
ltx/en_uk_lash/pe.d081:peMA.Kathisma13.incipit	@ltx/en_uk_lash/oc.m1.d4:ocMA.Kathisma32.incipit
ltx/en_uk_lash/pe.d081:peMA.Kathisma13.melody	
ltx/en_uk_lash/pe.d081:peMA.Kathisma13.mode	@ltx/en_uk_lash/miscellanea:misc.Mode1
ltx/en_uk_lash/pe.d081:peMA.Kathisma13.text	@ltx/en_uk_lash/oc.m1.d4:ocMA.Kathisma32.text
ltx/en_uk_lash/pe.d081:peMA.Kathisma1T.incipit	@ltx/en_uk_lash/oc.m1.d4:ocMA.Kathisma13.incipit
ltx/en_uk_lash/pe.d081:peMA.Kathisma1T.melody	
ltx/en_uk_lash/pe.d081:peMA.Kathisma1T.mode	@ltx/en_uk_lash/miscellanea:misc.Mode1
ltx/en_uk_lash/pe.d081:peMA.Kathisma1T.text	@ltx/en_uk_lash/oc.m1.d4:ocMA.Kathisma13.text
ltx/en_uk_lash/pe.d081:peMA.Kathisma21.greekmelody	@ltx/en_uk_lash/pe.d079:peMA.Kathisma21.greekmelody
ltx/en_uk_lash/pe.d081:peMA.Kathisma21.incipit	@ltx/en_uk_lash/pe.d079:peMA.Kathisma21.incipit
ltx/en_uk_lash/pe.d081:peMA.Kathisma21.melody	@ltx/en_uk_lash/pe.d079:peMA.Kathisma21.melody
ltx/en_uk_lash/pe.d081:peMA.Kathisma21.mode	@ltx/en_uk_lash/miscellanea:misc.Mode1
ltx/en_uk_lash/pe.d081:peMA.Kathisma21.text	@ltx/en_uk_lash/pe.d079:peMA.Kathisma21.text
ltx/en_uk_lash/pe.d081:peMA.Lauds1.incipit	@ltx/en_uk_lash/oc.m1.d4:ocMA.Aposticha1.incipit
ltx/en_uk_lash/pe.d081:peMA.Lauds1.melody	
ltx/en_uk_lash/pe.d081:peMA.Lauds1.mode	@ltx/en_uk_lash/miscellanea:misc.Mode1
ltx/en_uk_lash/pe.d081:peMA.Lauds1.text	@ltx/en_uk_lash/oc.m1.d4:ocMA.Aposticha1.text
ltx/en_uk_lash/pe.d081:peMA.Lauds2.incipit	@ltx/en_uk_lash/oc.m1.d1:ocMA.Lauds3.incipit
ltx/en_uk_lash/pe.d081:peMA.Lauds2.melody	
ltx/en_uk_lash/pe.d081:peMA.Lauds2.mode	@ltx/en_uk_lash/miscellanea:misc.Mode1
ltx/en_uk_lash/pe.d081:peMA.Lauds2.text	@ltx/en_uk_lash/oc.m1.d1:ocMA.Lauds3.text
ltx/en_uk_lash/pe.d081:peMA.Lauds3.incipit	@ltx/en_uk_lash/oc.m1.d4:ocMA.Aposticha3.incipit
ltx/en_uk_lash/pe.d081:peMA.Lauds3.melody	
ltx/en_uk_lash/pe.d081:peMA.Lauds3.mode	@ltx/en_uk_lash/miscellanea:misc.Mode1
ltx/en_uk_lash/pe.d081:peMA.Lauds3.text	@ltx/en_uk_lash/oc.m1.d4:ocMA.Aposticha3.text
ltx/en_uk_lash/pe.d081:peMA.LaudsGlory.incipit	@ltx/en_uk_lash/pe.d078:peVE.LityGlory.incipit
ltx/en_uk_lash/pe.d081:peMA.LaudsGlory.melody	@ltx/en_uk_lash/miscellanea:misc.Idiomelon
ltx/en_uk_lash/pe.d081:peMA.LaudsGlory.mode	@ltx/en_uk_lash/miscellanea:misc.Mode8
ltx/en_uk_lash/pe.d081:peMA.LaudsGlory.text	@ltx/en_uk_lash/pe.d078:peVE.LityGlory.text
ltx/en_uk_lash/pe.d081:peVE.AposGlory.incipit	@ltx/en_uk_lash/pe.d078:peVE.Lity2.incipit
ltx/en_uk_lash/pe.d081:peVE.AposGlory.melody	@ltx/en_uk_lash/miscellanea:misc.Idiomelon
ltx/en_uk_lash/pe.d081:peVE.AposGlory.mode	@ltx/en_uk_lash/miscellanea:misc.Mode8
ltx/en_uk_lash/pe.d081:peVE.AposGlory.text	@ltx/en_uk_lash/pe.d078:peVE.Lity2.text
ltx/en_uk_lash/pe.d081:peVE.Aposticha1.incipit	@ltx/en_uk_lash/oc.m1.d4:ocVE.Aposticha1.incipit
ltx/en_uk_lash/pe.d081:peVE.Aposticha1.melody	
ltx/en_uk_lash/pe.d081:peVE.Aposticha1.mode	@ltx/en_uk_lash/miscellanea:misc.Mode1
ltx/en_uk_lash/pe.d081:peVE.Aposticha1.text	@ltx/en_uk_lash/oc.m1.d4:ocVE.Aposticha1.text
ltx/en_uk_lash/pe.d081:peVE.Aposticha2.incipit	@ltx/en_uk_lash/oc.m1.d1:ocVE.Stichera3.incipit
ltx/en_uk_lash/pe.d081:peVE.Aposticha2.melody	
ltx/en_uk_lash/pe.d081:peVE.Aposticha2.mode	@ltx/en_uk_lash/miscellanea:misc.Mode1
ltx/en_uk_lash/pe.d081:peVE.Aposticha2.text	@ltx/en_uk_lash/oc.m1.d1:ocVE.Stichera3.text
ltx/en_uk_lash/pe.d081:peVE.Aposticha3.incipit	@ltx/en_uk_lash/oc.m1.d4:ocVE.Aposticha3.incipit
ltx/en_uk_lash/pe.d081:peVE.Aposticha3.melody	
ltx/en_uk_lash/pe.d081:peVE.Aposticha3.mode	@ltx/en_uk_lash/miscellanea:misc.Mode1
ltx/en_uk_lash/pe.d081:peVE.Aposticha3.text	@ltx/en_uk_lash/oc.m1.d4:ocVE.Aposticha3.text
ltx/en_uk_lash/pe.d081:peVE.SticGlory.incipit	@ltx/en_uk_lash/pe.d078:peVE.Lity1.incipit
ltx/en_uk_lash/pe.d081:peVE.SticGlory.melody	@ltx/en_uk_lash/miscellanea:misc.Idiomelon
ltx/en_uk_lash/pe.d081:peVE.SticGlory.mode	@ltx/en_uk_lash/miscellanea:misc.Mode4
ltx/en_uk_lash/pe.d081:peVE.SticGlory.text	@ltx/en_uk_lash/pe.d078:peVE.Lity1.text
ltx/en_uk_lash/pe.d081:peVE.Stichera01.greekmelody	@ltx/en_uk_lash/he.a.m1:heAU.PaneffimoiMartyres.greekname
ltx/en_uk_lash/pe.d081:peVE.Stichera01.incipit	…
ltx/en_uk_lash/pe.d081:peVE.Stichera01.melody	@ltx/en_uk_lash/he.a.m1:heAU.PaneffimoiMartyres.name
ltx/en_uk_lash/pe.d081:peVE.Stichera01.mode	@ltx/en_uk_lash/miscellanea:misc.Mode1
ltx/en_uk_lash/pe.d081:peVE.Stichera01.text	
ltx/en_uk_lash/pe.d081:peVE.Stichera02.incipit	…
ltx/en_uk_lash/pe.d081:peVE.Stichera02.melody	@ltx/en_uk_lash/he.a.m1:heAU.PaneffimoiMartyres.name
ltx/en_uk_lash/pe.d081:peVE.Stichera02.mode	@ltx/en_uk_lash/miscellanea:misc.Mode1
ltx/en_uk_lash/pe.d081:peVE.Stichera02.text	
ltx/en_uk_lash/pe.d081:peVE.Stichera03.incipit	…
ltx/en_uk_lash/pe.d081:peVE.Stichera03.melody	@ltx/en_uk_lash/he.a.m1:heAU.PaneffimoiMartyres.name
ltx/en_uk_lash/pe.d081:peVE.Stichera03.mode	@ltx/en_uk_lash/miscellanea:misc.Mode1
ltx/en_uk_lash/pe.d081:peVE.Stichera03.text	
