ltx/en_uk_lash/me.m09.d14:meDA.commemoration.first	
ltx/en_uk_lash/me.m09.d14:meDA.commemoration.first_name	
ltx/en_uk_lash/me.m09.d14:meDA.commemoration.first_short	
ltx/en_uk_lash/me.m09.d14:meDA.commemoration.first_title	
ltx/en_uk_lash/me.m09.d14:meDA.commemoration.full	
ltx/en_uk_lash/me.m09.d14:meDA.commemoration.second_name	
ltx/en_uk_lash/me.m09.d14:meDA.commemoration.second_title	
ltx/en_uk_lash/me.m09.d14:meDA.date	
ltx/en_uk_lash/me.m09.d14:meDA.dismissal	@ltx/en_uk_lash/dismissals:dis00.resurrection
ltx/en_uk_lash/me.m09.d14:meDA.insert1	
ltx/en_uk_lash/me.m09.d14:meDA.insert2	
ltx/en_uk_lash/me.m09.d14:meDA.note	
ltx/en_uk_lash/me.m09.d14:meHO.commemorations	
ltx/en_uk_lash/me.m09.d14:meHO.note1	
ltx/en_uk_lash/me.m09.d14:meHO.note2	
ltx/en_uk_lash/me.m09.d14:meHO.number	
ltx/en_uk_lash/me.m09.d14:meHO.rank	
ltx/en_uk_lash/me.m09.d14:meLE.commemoration1	
ltx/en_uk_lash/me.m09.d14:meLE.commemoration2	
ltx/en_uk_lash/me.m09.d14:meLI.Kontakion1.greekmelody	@ltx/en_uk_lash/me.m09.d14:meMA.Kontakion1.greekmelody
ltx/en_uk_lash/me.m09.d14:meLI.Kontakion1.incipit	@ltx/en_uk_lash/me.m09.d14:meMA.Kontakion1.incipit
ltx/en_uk_lash/me.m09.d14:meLI.Kontakion1.melody	@ltx/en_uk_lash/me.m09.d14:meMA.Kontakion1.melody
ltx/en_uk_lash/me.m09.d14:meLI.Kontakion1.mode	@ltx/en_uk_lash/me.m09.d14:meMA.Kontakion1.mode
ltx/en_uk_lash/me.m09.d14:meLI.Kontakion1.text	@ltx/en_uk_lash/me.m09.d14:meMA.Kontakion1.text
ltx/en_uk_lash/me.m09.d14:meLI.MM.CommunionHymn.text	
ltx/en_uk_lash/me.m09.d14:meLI.MM.EntranceHymn.text	
ltx/en_uk_lash/me.m09.d14:meLI.Megalynarion.text	
ltx/en_uk_lash/me.m09.d14:meLI.TheotokosHymn.incipit	@ltx/en_uk_lash/me.m09.d14:meMA.Ode9C1H.incipit
ltx/en_uk_lash/me.m09.d14:meLI.TheotokosHymn.mode	@ltx/en_uk_lash/me.m09.d14:meMA.Ode9C1H.mode
ltx/en_uk_lash/me.m09.d14:meLI.TheotokosHymn.text	@ltx/en_uk_lash/me.m09.d14:meMA.Ode9C1H.text
ltx/en_uk_lash/me.m09.d14:meMA.AdditionalIdiomelon1.incipit	Come, believers, let worship the…
ltx/en_uk_lash/me.m09.d14:meMA.AdditionalIdiomelon1.melody	
ltx/en_uk_lash/me.m09.d14:meMA.AdditionalIdiomelon1.mode	@ltx/en_uk_lash/miscellanea:misc.Mode2
ltx/en_uk_lash/me.m09.d14:meMA.AdditionalIdiomelon1.text	Come, believers, let worship the life-giving Tree on which Christ the King of glory willing stretched out his hands and raised up to the ancient blessedness us whom of old the foe, luring us through pleasure, had made exiles from God. Come, believers, let us worship the Tree though which we have counted worthy to crush the heads of invisible enemies. Come, all you families of nations, let us honour with hymns the Cross of the Lord. Hail, O Cross, the complete redemption of Adam. In you our faithful Sovereigns boast, as by your power they mightily defeat the people of Ishmael. We Christians, as with fear we now lovingly greet you, glorify God who was nailed to you, as we say, ‘O Lord, who were nailed upon it, have mercy on us as you are good and love mankind’.
ltx/en_uk_lash/me.m09.d14:meMA.AdditionalIdiomelon2.incipit	…
ltx/en_uk_lash/me.m09.d14:meMA.AdditionalIdiomelon2.melody	
ltx/en_uk_lash/me.m09.d14:meMA.AdditionalIdiomelon2.mode	@ltx/en_uk_lash/miscellanea:misc.Mode5
ltx/en_uk_lash/me.m09.d14:meMA.AdditionalIdiomelon2.text	
ltx/en_uk_lash/me.m09.d14:meMA.AdditionalIdiomelon3.incipit	…
ltx/en_uk_lash/me.m09.d14:meMA.AdditionalIdiomelon3.melody	
ltx/en_uk_lash/me.m09.d14:meMA.AdditionalIdiomelon3.mode	@ltx/en_uk_lash/miscellanea:misc.Mode5
ltx/en_uk_lash/me.m09.d14:meMA.AdditionalIdiomelon3.text	
ltx/en_uk_lash/me.m09.d14:meMA.AdditionalIdiomelon4.incipit	…
ltx/en_uk_lash/me.m09.d14:meMA.AdditionalIdiomelon4.melody	
ltx/en_uk_lash/me.m09.d14:meMA.AdditionalIdiomelon4.mode	@ltx/en_uk_lash/miscellanea:misc.Mode6
ltx/en_uk_lash/me.m09.d14:meMA.AdditionalIdiomelon4.text	
ltx/en_uk_lash/me.m09.d14:meMA.AdditionalIdiomelon5.incipit	…
ltx/en_uk_lash/me.m09.d14:meMA.AdditionalIdiomelon5.melody	
ltx/en_uk_lash/me.m09.d14:meMA.AdditionalIdiomelon5.mode	@ltx/en_uk_lash/miscellanea:misc.Mode6
ltx/en_uk_lash/me.m09.d14:meMA.AdditionalIdiomelon5.text	
ltx/en_uk_lash/me.m09.d14:meMA.AdditionalIdiomelon6.incipit	…
ltx/en_uk_lash/me.m09.d14:meMA.AdditionalIdiomelon6.melody	
ltx/en_uk_lash/me.m09.d14:meMA.AdditionalIdiomelon6.mode	@ltx/en_uk_lash/miscellanea:misc.Mode6
ltx/en_uk_lash/me.m09.d14:meMA.AdditionalIdiomelon6.text	
ltx/en_uk_lash/me.m09.d14:meMA.AdditionalIdiomelonGlory.incipit	The saying of your Prophet…
ltx/en_uk_lash/me.m09.d14:meMA.AdditionalIdiomelonGlory.melody	
ltx/en_uk_lash/me.m09.d14:meMA.AdditionalIdiomelonGlory.mode	@ltx/en_uk_lash/miscellanea:misc.Mode8
ltx/en_uk_lash/me.m09.d14:meMA.AdditionalIdiomelonGlory.text	The saying of your Prophet Moses has been fulfilled, O God, which said, ''See your life hanging before your eyes.'' Today the Cross is exalted and world is freed from error. Today the Resurrection of Christ is consecrated, and the ends of the earth rejoice as with David’s cymbals they offer you their hymn and say, ''You have wrought salvation in midst of the earth, O God, good and the lover of mankind: the Cross and Resurrection, through which you have saved us. All-powerful Lord, glory to you.''
ltx/en_uk_lash/me.m09.d14:meMA.C1.acrostic.notice1	·
ltx/en_uk_lash/me.m09.d14:meMA.C1.acrostic.text	
ltx/en_uk_lash/me.m09.d14:meMA.C1.acrostic.title	
ltx/en_uk_lash/me.m09.d14:meMA.C1.poet	@ltx/en_uk_lash/poets:po.KyriouKosma
ltx/en_uk_lash/me.m09.d14:meMA.C1.title	@ltx/en_uk_lash/titles:ti.CanonFeast
ltx/en_uk_lash/me.m09.d14:meMA.C1.verse	@ltx/en_uk_lash/prayers:pr.verse_Cross.text
ltx/en_uk_lash/me.m09.d14:meMA.Exaposteilarion1.greekmelody	@ltx/en_uk_lash/he.a.m2:heAU.TonMathitonOrontonSe.greekname
ltx/en_uk_lash/me.m09.d14:meMA.Exaposteilarion1.incipit	The Cross is the guardian…
ltx/en_uk_lash/me.m09.d14:meMA.Exaposteilarion1.melody	@ltx/en_uk_lash/he.a.m2:heAU.TonMathitonOrontonSe.notmetered
ltx/en_uk_lash/me.m09.d14:meMA.Exaposteilarion1.mode	@ltx/en_uk_lash/miscellanea:misc.Mode2
ltx/en_uk_lash/me.m09.d14:meMA.Exaposteilarion1.text	The Cross is the guardian of the whole inhabited world; the Cross is the beauty of the Church; the Cross is the might of Kings; the Cross is the strength of believers, the glory of Angels and the wound of the demons.
ltx/en_uk_lash/me.m09.d14:meMA.Exaposteilarion2.greekmelody	@ltx/en_uk_lash/he.a.m2:heAU.GynaikesAkoutisthite.greekname
ltx/en_uk_lash/me.m09.d14:meMA.Exaposteilarion2.incipit	…
ltx/en_uk_lash/me.m09.d14:meMA.Exaposteilarion2.melody	@ltx/en_uk_lash/he.a.m2:heAU.GynaikesAkoutisthite.notmetered
ltx/en_uk_lash/me.m09.d14:meMA.Exaposteilarion2.mode	@ltx/en_uk_lash/miscellanea:misc.Mode2
ltx/en_uk_lash/me.m09.d14:meMA.Exaposteilarion2.text	
ltx/en_uk_lash/me.m09.d14:meMA.Kathisma11.greekmelody	@ltx/en_uk_lash/he.a.m1:heAU.TouLithouSfragisthentos.greekname
ltx/en_uk_lash/me.m09.d14:meMA.Kathisma11.incipit	…
ltx/en_uk_lash/me.m09.d14:meMA.Kathisma11.melody	@ltx/en_uk_lash/he.a.m1:heAU.TouLithouSfragisthentos.notmetered
ltx/en_uk_lash/me.m09.d14:meMA.Kathisma11.mode	@ltx/en_uk_lash/miscellanea:misc.Mode1
ltx/en_uk_lash/me.m09.d14:meMA.Kathisma11.text	
ltx/en_uk_lash/me.m09.d14:meMA.Kathisma21.incipit	@ltx/en_uk_lash/oc.m6.d4:ocMA.Kathisma11.incipit
ltx/en_uk_lash/me.m09.d14:meMA.Kathisma21.melody	
ltx/en_uk_lash/me.m09.d14:meMA.Kathisma21.mode	@ltx/en_uk_lash/miscellanea:misc.Mode6
ltx/en_uk_lash/me.m09.d14:meMA.Kathisma21.text	@ltx/en_uk_lash/oc.m6.d4:ocMA.Kathisma11.text
ltx/en_uk_lash/me.m09.d14:meMA.Kathisma31.greekmelody	@ltx/en_uk_lash/he.a.m8:heAU.ToProstachthen.greekname
ltx/en_uk_lash/me.m09.d14:meMA.Kathisma31.incipit	…
ltx/en_uk_lash/me.m09.d14:meMA.Kathisma31.melody	@ltx/en_uk_lash/he.a.m8:heAU.ToProstachthen.notmetered
ltx/en_uk_lash/me.m09.d14:meMA.Kathisma31.mode	@ltx/en_uk_lash/miscellanea:misc.Mode8
ltx/en_uk_lash/me.m09.d14:meMA.Kathisma31.text	
ltx/en_uk_lash/me.m09.d14:meMA.Kontakion1.greekmelody	@ltx/en_uk_lash/he.a.m4:heAU.OYpsotheisEnToStavro.greekname
ltx/en_uk_lash/me.m09.d14:meMA.Kontakion1.incipit	@ltx/en_uk_lash/he.a.m4:heAU.OYpsotheisEnToStavro.incipit
ltx/en_uk_lash/me.m09.d14:meMA.Kontakion1.melody	@ltx/en_uk_lash/he.a.m4:heAU.OYpsotheisEnToStavro.melody
ltx/en_uk_lash/me.m09.d14:meMA.Kontakion1.mode	@ltx/en_uk_lash/miscellanea:misc.Mode4
ltx/en_uk_lash/me.m09.d14:meMA.Kontakion1.text	@ltx/en_uk_lash/he.a.m4:heAU.OYpsotheisEnToStavro.text
ltx/en_uk_lash/me.m09.d14:meMA.Lauds1.greekmelody	@ltx/en_uk_lash/he.a.m8:heAU.OTouParadoxou.greekname
ltx/en_uk_lash/me.m09.d14:meMA.Lauds1.incipit	…
ltx/en_uk_lash/me.m09.d14:meMA.Lauds1.melody	@ltx/en_uk_lash/he.a.m8:heAU.OTouParadoxou.notmetered
ltx/en_uk_lash/me.m09.d14:meMA.Lauds1.mode	@ltx/en_uk_lash/miscellanea:misc.Mode8
ltx/en_uk_lash/me.m09.d14:meMA.Lauds1.text	
ltx/en_uk_lash/me.m09.d14:meMA.Lauds2.incipit	…
ltx/en_uk_lash/me.m09.d14:meMA.Lauds2.melody	@ltx/en_uk_lash/he.a.m8:heAU.OTouParadoxou.notmetered
ltx/en_uk_lash/me.m09.d14:meMA.Lauds2.mode	@ltx/en_uk_lash/miscellanea:misc.Mode8
ltx/en_uk_lash/me.m09.d14:meMA.Lauds2.text	
ltx/en_uk_lash/me.m09.d14:meMA.Lauds3.incipit	…
ltx/en_uk_lash/me.m09.d14:meMA.Lauds3.melody	@ltx/en_uk_lash/he.a.m8:heAU.OTouParadoxou.notmetered
ltx/en_uk_lash/me.m09.d14:meMA.Lauds3.mode	@ltx/en_uk_lash/miscellanea:misc.Mode8
ltx/en_uk_lash/me.m09.d14:meMA.Lauds3.text	
ltx/en_uk_lash/me.m09.d14:meMA.LaudsGlory.incipit	…
ltx/en_uk_lash/me.m09.d14:meMA.LaudsGlory.melody	
ltx/en_uk_lash/me.m09.d14:meMA.LaudsGlory.mode	@ltx/en_uk_lash/miscellanea:misc.Mode6
ltx/en_uk_lash/me.m09.d14:meMA.LaudsGlory.text	
ltx/en_uk_lash/me.m09.d14:meMA.MM.Lauds1123as5678.text	@ltx/en_uk_lash/properties:media.key
ltx/en_uk_lash/me.m09.d14:meMA.Ode1C11.greekmelody	@ltx/en_uk_lash/he.h.m8:heHE.StavronCharaxasMosis.greekname
ltx/en_uk_lash/me.m09.d14:meMA.Ode1C11.incipit	…
ltx/en_uk_lash/me.m09.d14:meMA.Ode1C11.melody	@ltx/en_uk_lash/he.h.m8:heHE.StavronCharaxasMosis.name
ltx/en_uk_lash/me.m09.d14:meMA.Ode1C11.mode	@ltx/en_uk_lash/miscellanea:misc.Mode8
ltx/en_uk_lash/me.m09.d14:meMA.Ode1C11.ode	@ltx/en_uk_lash/miscellanea:misc.Ode1
ltx/en_uk_lash/me.m09.d14:meMA.Ode1C11.text	
ltx/en_uk_lash/me.m09.d14:meMA.Ode1C12.incipit	…
ltx/en_uk_lash/me.m09.d14:meMA.Ode1C12.melody	@ltx/en_uk_lash/he.h.m8:heHE.StavronCharaxasMosis.name
ltx/en_uk_lash/me.m09.d14:meMA.Ode1C12.mode	@ltx/en_uk_lash/miscellanea:misc.Mode8
ltx/en_uk_lash/me.m09.d14:meMA.Ode1C12.ode	@ltx/en_uk_lash/miscellanea:misc.Ode1
ltx/en_uk_lash/me.m09.d14:meMA.Ode1C12.text	
ltx/en_uk_lash/me.m09.d14:meMA.Ode1C13.incipit	…
ltx/en_uk_lash/me.m09.d14:meMA.Ode1C13.melody	@ltx/en_uk_lash/he.h.m8:heHE.StavronCharaxasMosis.name
ltx/en_uk_lash/me.m09.d14:meMA.Ode1C13.mode	@ltx/en_uk_lash/miscellanea:misc.Mode8
ltx/en_uk_lash/me.m09.d14:meMA.Ode1C13.ode	@ltx/en_uk_lash/miscellanea:misc.Ode1
ltx/en_uk_lash/me.m09.d14:meMA.Ode1C13.text	
ltx/en_uk_lash/me.m09.d14:meMA.Ode1C1H.greekmelody	@ltx/en_uk_lash/he.h.m8:heHE.StavronCharaxasMosis.greekname
ltx/en_uk_lash/me.m09.d14:meMA.Ode1C1H.incipit	@ltx/en_uk_lash/he.h.m8:heHE.StavronCharaxasMosis.incipit
ltx/en_uk_lash/me.m09.d14:meMA.Ode1C1H.melody	@ltx/en_uk_lash/he.h.m8:heHE.StavronCharaxasMosis.melody
ltx/en_uk_lash/me.m09.d14:meMA.Ode1C1H.mode	@ltx/en_uk_lash/miscellanea:misc.Mode8
ltx/en_uk_lash/me.m09.d14:meMA.Ode1C1H.ode	@ltx/en_uk_lash/miscellanea:misc.Ode1
ltx/en_uk_lash/me.m09.d14:meMA.Ode1C1H.text	@ltx/en_uk_lash/he.h.m8:heHE.StavronCharaxasMosis.text
ltx/en_uk_lash/me.m09.d14:meMA.Ode3C11.greekmelody	@ltx/en_uk_lash/he.h.m8:heHE.RavdosEisTypon.greekname
ltx/en_uk_lash/me.m09.d14:meMA.Ode3C11.incipit	…
ltx/en_uk_lash/me.m09.d14:meMA.Ode3C11.melody	@ltx/en_uk_lash/he.h.m8:heHE.RavdosEisTypon.name
ltx/en_uk_lash/me.m09.d14:meMA.Ode3C11.mode	@ltx/en_uk_lash/miscellanea:misc.Mode8
ltx/en_uk_lash/me.m09.d14:meMA.Ode3C11.ode	@ltx/en_uk_lash/miscellanea:misc.Ode3
ltx/en_uk_lash/me.m09.d14:meMA.Ode3C11.text	
ltx/en_uk_lash/me.m09.d14:meMA.Ode3C12.incipit	…
ltx/en_uk_lash/me.m09.d14:meMA.Ode3C12.melody	@ltx/en_uk_lash/he.h.m8:heHE.RavdosEisTypon.name
ltx/en_uk_lash/me.m09.d14:meMA.Ode3C12.mode	@ltx/en_uk_lash/miscellanea:misc.Mode8
ltx/en_uk_lash/me.m09.d14:meMA.Ode3C12.ode	@ltx/en_uk_lash/miscellanea:misc.Ode3
ltx/en_uk_lash/me.m09.d14:meMA.Ode3C12.text	
ltx/en_uk_lash/me.m09.d14:meMA.Ode3C1H.greekmelody	@ltx/en_uk_lash/he.h.m8:heHE.RavdosEisTypon.greekname
ltx/en_uk_lash/me.m09.d14:meMA.Ode3C1H.incipit	@ltx/en_uk_lash/he.h.m8:heHE.RavdosEisTypon.incipit
ltx/en_uk_lash/me.m09.d14:meMA.Ode3C1H.melody	@ltx/en_uk_lash/he.h.m8:heHE.RavdosEisTypon.melody
ltx/en_uk_lash/me.m09.d14:meMA.Ode3C1H.mode	@ltx/en_uk_lash/miscellanea:misc.Mode8
ltx/en_uk_lash/me.m09.d14:meMA.Ode3C1H.ode	@ltx/en_uk_lash/miscellanea:misc.Ode3
ltx/en_uk_lash/me.m09.d14:meMA.Ode3C1H.text	@ltx/en_uk_lash/he.h.m8:heHE.RavdosEisTypon.text
ltx/en_uk_lash/me.m09.d14:meMA.Ode3Kathisma1.greekmelody	@ltx/en_uk_lash/he.a.m8:heAU.ToProstachthen.greekname
ltx/en_uk_lash/me.m09.d14:meMA.Ode3Kathisma1.incipit	@ltx/en_uk_lash/oc.m8.d4:ocMA.Kathisma22.incipit
ltx/en_uk_lash/me.m09.d14:meMA.Ode3Kathisma1.melody	@ltx/en_uk_lash/he.a.m8:heAU.ToProstachthen.notmetered
ltx/en_uk_lash/me.m09.d14:meMA.Ode3Kathisma1.mode	@ltx/en_uk_lash/miscellanea:misc.Mode8
ltx/en_uk_lash/me.m09.d14:meMA.Ode3Kathisma1.text	@ltx/en_uk_lash/oc.m8.d4:ocMA.Kathisma22.text
ltx/en_uk_lash/me.m09.d14:meMA.Ode4C11.greekmelody	@ltx/en_uk_lash/he.h.m8:heHE.EisakikoaKyrie.greekname
ltx/en_uk_lash/me.m09.d14:meMA.Ode4C11.incipit	…
ltx/en_uk_lash/me.m09.d14:meMA.Ode4C11.melody	@ltx/en_uk_lash/he.h.m8:heHE.EisakikoaKyrie.name
ltx/en_uk_lash/me.m09.d14:meMA.Ode4C11.mode	@ltx/en_uk_lash/miscellanea:misc.Mode8
ltx/en_uk_lash/me.m09.d14:meMA.Ode4C11.ode	@ltx/en_uk_lash/miscellanea:misc.Ode4
ltx/en_uk_lash/me.m09.d14:meMA.Ode4C11.text	
ltx/en_uk_lash/me.m09.d14:meMA.Ode4C12.incipit	…
ltx/en_uk_lash/me.m09.d14:meMA.Ode4C12.melody	@ltx/en_uk_lash/he.h.m8:heHE.EisakikoaKyrie.name
ltx/en_uk_lash/me.m09.d14:meMA.Ode4C12.mode	@ltx/en_uk_lash/miscellanea:misc.Mode8
ltx/en_uk_lash/me.m09.d14:meMA.Ode4C12.ode	@ltx/en_uk_lash/miscellanea:misc.Ode4
ltx/en_uk_lash/me.m09.d14:meMA.Ode4C12.text	
ltx/en_uk_lash/me.m09.d14:meMA.Ode4C13.incipit	…
ltx/en_uk_lash/me.m09.d14:meMA.Ode4C13.melody	@ltx/en_uk_lash/he.h.m8:heHE.EisakikoaKyrie.name
ltx/en_uk_lash/me.m09.d14:meMA.Ode4C13.mode	@ltx/en_uk_lash/miscellanea:misc.Mode8
ltx/en_uk_lash/me.m09.d14:meMA.Ode4C13.ode	@ltx/en_uk_lash/miscellanea:misc.Ode4
ltx/en_uk_lash/me.m09.d14:meMA.Ode4C13.text	
ltx/en_uk_lash/me.m09.d14:meMA.Ode4C14.incipit	…
ltx/en_uk_lash/me.m09.d14:meMA.Ode4C14.melody	@ltx/en_uk_lash/he.h.m8:heHE.EisakikoaKyrie.name
ltx/en_uk_lash/me.m09.d14:meMA.Ode4C14.mode	@ltx/en_uk_lash/miscellanea:misc.Mode8
ltx/en_uk_lash/me.m09.d14:meMA.Ode4C14.ode	@ltx/en_uk_lash/miscellanea:misc.Ode4
ltx/en_uk_lash/me.m09.d14:meMA.Ode4C14.text	
ltx/en_uk_lash/me.m09.d14:meMA.Ode4C1H.greekmelody	@ltx/en_uk_lash/he.h.m8:heHE.EisakikoaKyrie.greekname
ltx/en_uk_lash/me.m09.d14:meMA.Ode4C1H.incipit	@ltx/en_uk_lash/he.h.m8:heHE.EisakikoaKyrie.incipit
ltx/en_uk_lash/me.m09.d14:meMA.Ode4C1H.melody	@ltx/en_uk_lash/he.h.m8:heHE.EisakikoaKyrie.melody
ltx/en_uk_lash/me.m09.d14:meMA.Ode4C1H.mode	@ltx/en_uk_lash/miscellanea:misc.Mode8
ltx/en_uk_lash/me.m09.d14:meMA.Ode4C1H.ode	@ltx/en_uk_lash/miscellanea:misc.Ode4
ltx/en_uk_lash/me.m09.d14:meMA.Ode4C1H.text	@ltx/en_uk_lash/he.h.m8:heHE.EisakikoaKyrie.text
ltx/en_uk_lash/me.m09.d14:meMA.Ode5C11.greekmelody	@ltx/en_uk_lash/he.h.m8:heHE.OTrismakaristonXylon.greekname
ltx/en_uk_lash/me.m09.d14:meMA.Ode5C11.incipit	…
ltx/en_uk_lash/me.m09.d14:meMA.Ode5C11.melody	@ltx/en_uk_lash/he.h.m8:heHE.OTrismakaristonXylon.name
ltx/en_uk_lash/me.m09.d14:meMA.Ode5C11.mode	@ltx/en_uk_lash/miscellanea:misc.Mode8
ltx/en_uk_lash/me.m09.d14:meMA.Ode5C11.ode	@ltx/en_uk_lash/miscellanea:misc.Ode5
ltx/en_uk_lash/me.m09.d14:meMA.Ode5C11.text	
ltx/en_uk_lash/me.m09.d14:meMA.Ode5C12.incipit	…
ltx/en_uk_lash/me.m09.d14:meMA.Ode5C12.melody	@ltx/en_uk_lash/he.h.m8:heHE.OTrismakaristonXylon.name
ltx/en_uk_lash/me.m09.d14:meMA.Ode5C12.mode	@ltx/en_uk_lash/miscellanea:misc.Mode8
ltx/en_uk_lash/me.m09.d14:meMA.Ode5C12.ode	@ltx/en_uk_lash/miscellanea:misc.Ode5
ltx/en_uk_lash/me.m09.d14:meMA.Ode5C12.text	
ltx/en_uk_lash/me.m09.d14:meMA.Ode5C13.incipit	…
ltx/en_uk_lash/me.m09.d14:meMA.Ode5C13.melody	@ltx/en_uk_lash/he.h.m8:heHE.OTrismakaristonXylon.name
ltx/en_uk_lash/me.m09.d14:meMA.Ode5C13.mode	@ltx/en_uk_lash/miscellanea:misc.Mode8
ltx/en_uk_lash/me.m09.d14:meMA.Ode5C13.ode	@ltx/en_uk_lash/miscellanea:misc.Ode5
ltx/en_uk_lash/me.m09.d14:meMA.Ode5C13.text	
ltx/en_uk_lash/me.m09.d14:meMA.Ode5C1H.greekmelody	@ltx/en_uk_lash/he.h.m8:heHE.OTrismakaristonXylon.greekname
ltx/en_uk_lash/me.m09.d14:meMA.Ode5C1H.incipit	@ltx/en_uk_lash/he.h.m8:heHE.OTrismakaristonXylon.incipit
ltx/en_uk_lash/me.m09.d14:meMA.Ode5C1H.melody	@ltx/en_uk_lash/he.h.m8:heHE.OTrismakaristonXylon.melody
ltx/en_uk_lash/me.m09.d14:meMA.Ode5C1H.mode	@ltx/en_uk_lash/miscellanea:misc.Mode8
ltx/en_uk_lash/me.m09.d14:meMA.Ode5C1H.ode	@ltx/en_uk_lash/miscellanea:misc.Ode5
ltx/en_uk_lash/me.m09.d14:meMA.Ode5C1H.text	@ltx/en_uk_lash/he.h.m8:heHE.OTrismakaristonXylon.text
ltx/en_uk_lash/me.m09.d14:meMA.Ode6C11.greekmelody	@ltx/en_uk_lash/he.h.m8:heHE.NotiouThiros.greekname
ltx/en_uk_lash/me.m09.d14:meMA.Ode6C11.incipit	…
ltx/en_uk_lash/me.m09.d14:meMA.Ode6C11.melody	@ltx/en_uk_lash/he.h.m8:heHE.NotiouThiros.name
ltx/en_uk_lash/me.m09.d14:meMA.Ode6C11.mode	@ltx/en_uk_lash/miscellanea:misc.Mode8
ltx/en_uk_lash/me.m09.d14:meMA.Ode6C11.ode	@ltx/en_uk_lash/miscellanea:misc.Ode6
ltx/en_uk_lash/me.m09.d14:meMA.Ode6C11.text	
ltx/en_uk_lash/me.m09.d14:meMA.Ode6C12.incipit	…
ltx/en_uk_lash/me.m09.d14:meMA.Ode6C12.melody	@ltx/en_uk_lash/he.h.m8:heHE.NotiouThiros.name
ltx/en_uk_lash/me.m09.d14:meMA.Ode6C12.mode	@ltx/en_uk_lash/miscellanea:misc.Mode6
ltx/en_uk_lash/me.m09.d14:meMA.Ode6C12.ode	@ltx/en_uk_lash/miscellanea:misc.Ode8
ltx/en_uk_lash/me.m09.d14:meMA.Ode6C12.text	
ltx/en_uk_lash/me.m09.d14:meMA.Ode6C1H.greekmelody	@ltx/en_uk_lash/he.h.m8:heHE.NotiouThiros.greekname
ltx/en_uk_lash/me.m09.d14:meMA.Ode6C1H.incipit	@ltx/en_uk_lash/he.h.m8:heHE.NotiouThiros.incipit
ltx/en_uk_lash/me.m09.d14:meMA.Ode6C1H.melody	@ltx/en_uk_lash/he.h.m8:heHE.NotiouThiros.melody
ltx/en_uk_lash/me.m09.d14:meMA.Ode6C1H.mode	@ltx/en_uk_lash/miscellanea:misc.Mode8
ltx/en_uk_lash/me.m09.d14:meMA.Ode6C1H.ode	@ltx/en_uk_lash/miscellanea:misc.Ode6
ltx/en_uk_lash/me.m09.d14:meMA.Ode6C1H.text	@ltx/en_uk_lash/he.h.m8:heHE.NotiouThiros.text
ltx/en_uk_lash/me.m09.d14:meMA.Ode7C11.greekmelody	@ltx/en_uk_lash/he.h.m8:heHE.EknoonProstagma.greekname
ltx/en_uk_lash/me.m09.d14:meMA.Ode7C11.incipit	…
ltx/en_uk_lash/me.m09.d14:meMA.Ode7C11.melody	@ltx/en_uk_lash/he.h.m8:heHE.EknoonProstagma.name
ltx/en_uk_lash/me.m09.d14:meMA.Ode7C11.mode	@ltx/en_uk_lash/miscellanea:misc.Mode8
ltx/en_uk_lash/me.m09.d14:meMA.Ode7C11.ode	@ltx/en_uk_lash/miscellanea:misc.Ode7
ltx/en_uk_lash/me.m09.d14:meMA.Ode7C11.text	
ltx/en_uk_lash/me.m09.d14:meMA.Ode7C12.incipit	…
ltx/en_uk_lash/me.m09.d14:meMA.Ode7C12.melody	@ltx/en_uk_lash/he.h.m8:heHE.EknoonProstagma.name
ltx/en_uk_lash/me.m09.d14:meMA.Ode7C12.mode	@ltx/en_uk_lash/miscellanea:misc.Mode8
ltx/en_uk_lash/me.m09.d14:meMA.Ode7C12.ode	@ltx/en_uk_lash/miscellanea:misc.Ode7
ltx/en_uk_lash/me.m09.d14:meMA.Ode7C12.text	
ltx/en_uk_lash/me.m09.d14:meMA.Ode7C13.incipit	…
ltx/en_uk_lash/me.m09.d14:meMA.Ode7C13.melody	@ltx/en_uk_lash/he.h.m8:heHE.EknoonProstagma.name
ltx/en_uk_lash/me.m09.d14:meMA.Ode7C13.mode	@ltx/en_uk_lash/miscellanea:misc.Mode8
ltx/en_uk_lash/me.m09.d14:meMA.Ode7C13.ode	@ltx/en_uk_lash/miscellanea:misc.Ode7
ltx/en_uk_lash/me.m09.d14:meMA.Ode7C13.text	
ltx/en_uk_lash/me.m09.d14:meMA.Ode7C1H.greekmelody	@ltx/en_uk_lash/he.h.m8:heHE.EknoonProstagma.greekname
ltx/en_uk_lash/me.m09.d14:meMA.Ode7C1H.incipit	@ltx/en_uk_lash/he.h.m8:heHE.EknoonProstagma.incipit
ltx/en_uk_lash/me.m09.d14:meMA.Ode7C1H.melody	@ltx/en_uk_lash/he.h.m8:heHE.EknoonProstagma.melody
ltx/en_uk_lash/me.m09.d14:meMA.Ode7C1H.mode	@ltx/en_uk_lash/miscellanea:misc.Mode8
ltx/en_uk_lash/me.m09.d14:meMA.Ode7C1H.ode	@ltx/en_uk_lash/miscellanea:misc.Ode7
ltx/en_uk_lash/me.m09.d14:meMA.Ode7C1H.text	@ltx/en_uk_lash/he.h.m8:heHE.EknoonProstagma.text
ltx/en_uk_lash/me.m09.d14:meMA.Ode8C11.greekmelody	@ltx/en_uk_lash/he.h.m8:heHE.EvlogeitePaides.greekname
ltx/en_uk_lash/me.m09.d14:meMA.Ode8C11.incipit	…
ltx/en_uk_lash/me.m09.d14:meMA.Ode8C11.melody	@ltx/en_uk_lash/he.h.m8:heHE.EvlogeitePaides.name
ltx/en_uk_lash/me.m09.d14:meMA.Ode8C11.mode	@ltx/en_uk_lash/miscellanea:misc.Mode8
ltx/en_uk_lash/me.m09.d14:meMA.Ode8C11.ode	@ltx/en_uk_lash/miscellanea:misc.Ode8
ltx/en_uk_lash/me.m09.d14:meMA.Ode8C11.text	
ltx/en_uk_lash/me.m09.d14:meMA.Ode8C12.incipit	…
ltx/en_uk_lash/me.m09.d14:meMA.Ode8C12.melody	@ltx/en_uk_lash/he.h.m8:heHE.EvlogeitePaides.name
ltx/en_uk_lash/me.m09.d14:meMA.Ode8C12.mode	@ltx/en_uk_lash/miscellanea:misc.Mode8
ltx/en_uk_lash/me.m09.d14:meMA.Ode8C12.ode	@ltx/en_uk_lash/miscellanea:misc.Ode8
ltx/en_uk_lash/me.m09.d14:meMA.Ode8C12.text	
ltx/en_uk_lash/me.m09.d14:meMA.Ode8C13.incipit	…
ltx/en_uk_lash/me.m09.d14:meMA.Ode8C13.melody	@ltx/en_uk_lash/he.h.m8:heHE.EvlogeitePaides.name
ltx/en_uk_lash/me.m09.d14:meMA.Ode8C13.mode	@ltx/en_uk_lash/miscellanea:misc.Mode8
ltx/en_uk_lash/me.m09.d14:meMA.Ode8C13.ode	@ltx/en_uk_lash/miscellanea:misc.Ode8
ltx/en_uk_lash/me.m09.d14:meMA.Ode8C13.text	
ltx/en_uk_lash/me.m09.d14:meMA.Ode8C1H.greekmelody	@ltx/en_uk_lash/he.h.m8:heHE.EvlogeitePaides.greekname
ltx/en_uk_lash/me.m09.d14:meMA.Ode8C1H.incipit	@ltx/en_uk_lash/he.h.m8:heHE.EvlogeitePaides.incipit
ltx/en_uk_lash/me.m09.d14:meMA.Ode8C1H.melody	@ltx/en_uk_lash/he.h.m8:heHE.EvlogeitePaides.melody
ltx/en_uk_lash/me.m09.d14:meMA.Ode8C1H.mode	@ltx/en_uk_lash/miscellanea:misc.Mode8
ltx/en_uk_lash/me.m09.d14:meMA.Ode8C1H.ode	@ltx/en_uk_lash/miscellanea:misc.Ode8
ltx/en_uk_lash/me.m09.d14:meMA.Ode8C1H.text	@ltx/en_uk_lash/he.h.m8:heHE.EvlogeitePaides.text
ltx/en_uk_lash/me.m09.d14:meMA.Ode9C11.greekmelody	@ltx/en_uk_lash/he.h.m8:heHE.MystikosEiTheotoke.greekname
ltx/en_uk_lash/me.m09.d14:meMA.Ode9C11.incipit	…
ltx/en_uk_lash/me.m09.d14:meMA.Ode9C11.melody	@ltx/en_uk_lash/he.h.m8:heHE.MystikosEiTheotoke.name
ltx/en_uk_lash/me.m09.d14:meMA.Ode9C11.mode	@ltx/en_uk_lash/miscellanea:misc.Mode8
ltx/en_uk_lash/me.m09.d14:meMA.Ode9C11.ode	@ltx/en_uk_lash/miscellanea:misc.Ode9
ltx/en_uk_lash/me.m09.d14:meMA.Ode9C11.text	
ltx/en_uk_lash/me.m09.d14:meMA.Ode9C12.incipit	…
ltx/en_uk_lash/me.m09.d14:meMA.Ode9C12.melody	@ltx/en_uk_lash/he.h.m8:heHE.MystikosEiTheotoke.name
ltx/en_uk_lash/me.m09.d14:meMA.Ode9C12.mode	@ltx/en_uk_lash/miscellanea:misc.Mode8
ltx/en_uk_lash/me.m09.d14:meMA.Ode9C12.ode	@ltx/en_uk_lash/miscellanea:misc.Ode9
ltx/en_uk_lash/me.m09.d14:meMA.Ode9C12.text	
ltx/en_uk_lash/me.m09.d14:meMA.Ode9C1H.greekmelody	@ltx/en_uk_lash/he.h.m8:heHE.MystikosEiTheotoke.greekname
ltx/en_uk_lash/me.m09.d14:meMA.Ode9C1H.incipit	@ltx/en_uk_lash/he.h.m8:heHE.MystikosEiTheotoke.incipit
ltx/en_uk_lash/me.m09.d14:meMA.Ode9C1H.melody	@ltx/en_uk_lash/he.h.m8:heHE.MystikosEiTheotoke.melody
ltx/en_uk_lash/me.m09.d14:meMA.Ode9C1H.mode	@ltx/en_uk_lash/miscellanea:misc.Mode8
ltx/en_uk_lash/me.m09.d14:meMA.Ode9C1H.ode	@ltx/en_uk_lash/miscellanea:misc.Ode9
ltx/en_uk_lash/me.m09.d14:meMA.Ode9C1H.text	@ltx/en_uk_lash/he.h.m8:heHE.MystikosEiTheotoke.text
ltx/en_uk_lash/me.m09.d14:meMA.Ode9C21.greekmelody	@ltx/en_uk_lash/he.h.m8:heHE.ODiaVroseos.greekname
ltx/en_uk_lash/me.m09.d14:meMA.Ode9C21.incipit	…
ltx/en_uk_lash/me.m09.d14:meMA.Ode9C21.melody	@ltx/en_uk_lash/he.h.m8:heHE.ODiaVroseos.name
ltx/en_uk_lash/me.m09.d14:meMA.Ode9C21.mode	@ltx/en_uk_lash/miscellanea:misc.Mode8
ltx/en_uk_lash/me.m09.d14:meMA.Ode9C21.ode	@ltx/en_uk_lash/miscellanea:misc.Ode9
ltx/en_uk_lash/me.m09.d14:meMA.Ode9C21.text	
ltx/en_uk_lash/me.m09.d14:meMA.Ode9C22.incipit	…
ltx/en_uk_lash/me.m09.d14:meMA.Ode9C22.melody	@ltx/en_uk_lash/he.h.m8:heHE.ODiaVroseos.name
ltx/en_uk_lash/me.m09.d14:meMA.Ode9C22.mode	@ltx/en_uk_lash/miscellanea:misc.Mode8
ltx/en_uk_lash/me.m09.d14:meMA.Ode9C22.ode	@ltx/en_uk_lash/miscellanea:misc.Ode9
ltx/en_uk_lash/me.m09.d14:meMA.Ode9C22.text	
ltx/en_uk_lash/me.m09.d14:meMA.Ode9C23.incipit	…
ltx/en_uk_lash/me.m09.d14:meMA.Ode9C23.melody	@ltx/en_uk_lash/he.h.m8:heHE.ODiaVroseos.name
ltx/en_uk_lash/me.m09.d14:meMA.Ode9C23.mode	@ltx/en_uk_lash/miscellanea:misc.Mode8
ltx/en_uk_lash/me.m09.d14:meMA.Ode9C23.ode	@ltx/en_uk_lash/miscellanea:misc.Ode9
ltx/en_uk_lash/me.m09.d14:meMA.Ode9C23.text	
ltx/en_uk_lash/me.m09.d14:meMA.Ode9C2H.greekmelody	@ltx/en_uk_lash/he.h.m8:heHE.ODiaVroseos.greekname
ltx/en_uk_lash/me.m09.d14:meMA.Ode9C2H.incipit	@ltx/en_uk_lash/he.h.m8:heHE.ODiaVroseos.incipit
ltx/en_uk_lash/me.m09.d14:meMA.Ode9C2H.melody	@ltx/en_uk_lash/he.h.m8:heHE.ODiaVroseos.melody
ltx/en_uk_lash/me.m09.d14:meMA.Ode9C2H.mode	@ltx/en_uk_lash/miscellanea:misc.Mode8
ltx/en_uk_lash/me.m09.d14:meMA.Ode9C2H.ode	@ltx/en_uk_lash/miscellanea:misc.Ode9
ltx/en_uk_lash/me.m09.d14:meMA.Ode9C2H.text	@ltx/en_uk_lash/he.h.m8:heHE.ODiaVroseos.text
ltx/en_uk_lash/me.m09.d14:meMA.Oikos1.text	
ltx/en_uk_lash/me.m09.d14:meMA.PostGospelBoth.incipit	@ltx/en_uk_lash/me.m09.d14:meSV.SticGlory.incipit
ltx/en_uk_lash/me.m09.d14:meMA.PostGospelBoth.melody	
ltx/en_uk_lash/me.m09.d14:meMA.PostGospelBoth.mode	@ltx/en_uk_lash/miscellanea:misc.Mode2
ltx/en_uk_lash/me.m09.d14:meMA.PostGospelBoth.text	@ltx/en_uk_lash/me.m09.d14:meSV.SticGlory.text
ltx/en_uk_lash/me.m09.d14:meMA.PostGospelGlory.incipit	@ltx/en_uk_lash/me.m09.d14:meSV.SticGlory.incipit
ltx/en_uk_lash/me.m09.d14:meMA.PostGospelGlory.melody	
ltx/en_uk_lash/me.m09.d14:meMA.PostGospelGlory.mode	@ltx/en_uk_lash/miscellanea:misc.Mode2
ltx/en_uk_lash/me.m09.d14:meMA.PostGospelGlory.text	@ltx/en_uk_lash/me.m09.d14:meSV.SticGlory.text
ltx/en_uk_lash/me.m09.d14:meMA.PostGospelIdiomelon.incipit	…
ltx/en_uk_lash/me.m09.d14:meMA.PostGospelIdiomelon.melody	
ltx/en_uk_lash/me.m09.d14:meMA.PostGospelIdiomelon.mode	@ltx/en_uk_lash/miscellanea:misc.Mode6
ltx/en_uk_lash/me.m09.d14:meMA.PostGospelIdiomelon.text	
ltx/en_uk_lash/me.m09.d14:meSV.AposGlory.incipit	…
ltx/en_uk_lash/me.m09.d14:meSV.AposGlory.melody	@ltx/en_uk_lash/he.a.m2:heAU.OikosTouEfratha.notmetered
ltx/en_uk_lash/me.m09.d14:meSV.AposGlory.mode	@ltx/en_uk_lash/miscellanea:misc.Mode2
ltx/en_uk_lash/me.m09.d14:meSV.AposGlory.text	
ltx/en_uk_lash/me.m09.d14:meSV.Aposticha1.incipit	…
ltx/en_uk_lash/me.m09.d14:meSV.Aposticha1.melody	@ltx/en_uk_lash/he.a.m2:heAU.OikosTouEfratha.notmetered
ltx/en_uk_lash/me.m09.d14:meSV.Aposticha1.mode	@ltx/en_uk_lash/miscellanea:misc.Mode2
ltx/en_uk_lash/me.m09.d14:meSV.Aposticha1.text	
ltx/en_uk_lash/me.m09.d14:meSV.Aposticha2.incipit	…
ltx/en_uk_lash/me.m09.d14:meSV.Aposticha2.melody	@ltx/en_uk_lash/he.a.m2:heAU.OikosTouEfratha.notmetered
ltx/en_uk_lash/me.m09.d14:meSV.Aposticha2.mode	@ltx/en_uk_lash/miscellanea:misc.Mode2
ltx/en_uk_lash/me.m09.d14:meSV.Aposticha2.text	
ltx/en_uk_lash/me.m09.d14:meSV.Aposticha3.incipit	…
ltx/en_uk_lash/me.m09.d14:meSV.Aposticha3.melody	@ltx/en_uk_lash/he.a.m2:heAU.OikosTouEfratha.notmetered
ltx/en_uk_lash/me.m09.d14:meSV.Aposticha3.mode	@ltx/en_uk_lash/miscellanea:misc.Mode2
ltx/en_uk_lash/me.m09.d14:meSV.Aposticha3.text	
ltx/en_uk_lash/me.m09.d14:meSV.SticGlory.incipit	…
ltx/en_uk_lash/me.m09.d14:meSV.SticGlory.melody	
ltx/en_uk_lash/me.m09.d14:meSV.SticGlory.mode	@ltx/en_uk_lash/miscellanea:misc.Mode2
ltx/en_uk_lash/me.m09.d14:meSV.SticGlory.text	
ltx/en_uk_lash/me.m09.d14:meSV.Stichera1.incipit	…
ltx/en_uk_lash/me.m09.d14:meSV.Stichera1.melody	@ltx/en_uk_lash/he.a.m4:heAU.OsGennaionEnMartysi.notmetered
ltx/en_uk_lash/me.m09.d14:meSV.Stichera1.mode	@ltx/en_uk_lash/miscellanea:misc.Mode4
ltx/en_uk_lash/me.m09.d14:meSV.Stichera1.text	
ltx/en_uk_lash/me.m09.d14:meSV.Stichera2.incipit	…
ltx/en_uk_lash/me.m09.d14:meSV.Stichera2.melody	@ltx/en_uk_lash/he.a.m4:heAU.OsGennaionEnMartysi.notmetered
ltx/en_uk_lash/me.m09.d14:meSV.Stichera2.mode	@ltx/en_uk_lash/miscellanea:misc.Mode4
ltx/en_uk_lash/me.m09.d14:meSV.Stichera2.text	
ltx/en_uk_lash/me.m09.d14:meSV.Stichera3.incipit	…
ltx/en_uk_lash/me.m09.d14:meSV.Stichera3.melody	@ltx/en_uk_lash/he.a.m4:heAU.OsGennaionEnMartysi.notmetered
ltx/en_uk_lash/me.m09.d14:meSV.Stichera3.mode	@ltx/en_uk_lash/miscellanea:misc.Mode4
ltx/en_uk_lash/me.m09.d14:meSV.Stichera3.text	
ltx/en_uk_lash/me.m09.d14:meVE.Apolytikion1.incipit	Lord, save your people, and…
ltx/en_uk_lash/me.m09.d14:meVE.Apolytikion1.melody	
ltx/en_uk_lash/me.m09.d14:meVE.Apolytikion1.mode	@ltx/en_uk_lash/miscellanea:misc.Mode1
ltx/en_uk_lash/me.m09.d14:meVE.Apolytikion1.text	Lord, save your people, and bless your inheritance, granting to faithful Christians victories over their enemies, and protecting your commonwealth by your Cross.
ltx/en_uk_lash/me.m09.d14:meVE.AposGlory.incipit	Your precious Cross, O Christ…
ltx/en_uk_lash/me.m09.d14:meVE.AposGlory.melody	
ltx/en_uk_lash/me.m09.d14:meVE.AposGlory.mode	@ltx/en_uk_lash/miscellanea:misc.Mode8
ltx/en_uk_lash/me.m09.d14:meVE.AposGlory.poet	@ltx/en_uk_lash/poets:po.IoannouMonachou
ltx/en_uk_lash/me.m09.d14:meVE.AposGlory.text	Your precious Cross, O Christ, which Moses of old prefigured in himself when he overthrew and routed Amalek; and of which David in song cried out and decreed that your footstool was to be worshipped, today we sinners worship with unworthy lips, as we sing your praise who deigned to be nailed to it and we beg: O Lord, with the Thief count us worthy of your kingdom.
ltx/en_uk_lash/me.m09.d14:meVE.Aposticha1.greekmelody	@ltx/en_uk_lash/he.a.m5:heAU.ChairoisAskitikon.greekname
ltx/en_uk_lash/me.m09.d14:meVE.Aposticha1.incipit	@ltx/en_uk_lash/me.m09.d13:meVE.Aposticha1.incipit
ltx/en_uk_lash/me.m09.d14:meVE.Aposticha1.melody	@ltx/en_uk_lash/he.a.m5:heAU.ChairoisAskitikon.notmetered
ltx/en_uk_lash/me.m09.d14:meVE.Aposticha1.mode	@ltx/en_uk_lash/miscellanea:misc.Mode5
ltx/en_uk_lash/me.m09.d14:meVE.Aposticha1.text	@ltx/en_uk_lash/me.m09.d13:meVE.Aposticha1.text
ltx/en_uk_lash/me.m09.d14:meVE.Aposticha2.incipit	@ltx/en_uk_lash/me.m09.d13:meVE.Aposticha2.incipit
ltx/en_uk_lash/me.m09.d14:meVE.Aposticha2.melody	@ltx/en_uk_lash/he.a.m5:heAU.ChairoisAskitikon.notmetered
ltx/en_uk_lash/me.m09.d14:meVE.Aposticha2.mode	@ltx/en_uk_lash/miscellanea:misc.Mode5
ltx/en_uk_lash/me.m09.d14:meVE.Aposticha2.text	@ltx/en_uk_lash/me.m09.d13:meVE.Aposticha2.text
ltx/en_uk_lash/me.m09.d14:meVE.Aposticha3.incipit	@ltx/en_uk_lash/me.m09.d13:meVE.Aposticha3.incipit
ltx/en_uk_lash/me.m09.d14:meVE.Aposticha3.melody	@ltx/en_uk_lash/he.a.m5:heAU.ChairoisAskitikon.notmetered
ltx/en_uk_lash/me.m09.d14:meVE.Aposticha3.mode	@ltx/en_uk_lash/miscellanea:misc.Mode5
ltx/en_uk_lash/me.m09.d14:meVE.Aposticha3.text	@ltx/en_uk_lash/me.m09.d13:meVE.Aposticha3.text
ltx/en_uk_lash/me.m09.d14:meVE.Lity1.incipit	…
ltx/en_uk_lash/me.m09.d14:meVE.Lity1.melody	
ltx/en_uk_lash/me.m09.d14:meVE.Lity1.mode	@ltx/en_uk_lash/miscellanea:misc.Mode1
ltx/en_uk_lash/me.m09.d14:meVE.Lity1.poet	@ltx/en_uk_lash/poets:po.AndreouIerosolymitou
ltx/en_uk_lash/me.m09.d14:meVE.Lity1.text	
ltx/en_uk_lash/me.m09.d14:meVE.Lity2.incipit	…
ltx/en_uk_lash/me.m09.d14:meVE.Lity2.melody	
ltx/en_uk_lash/me.m09.d14:meVE.Lity2.mode	@ltx/en_uk_lash/miscellanea:misc.Mode1
ltx/en_uk_lash/me.m09.d14:meVE.Lity2.text	
ltx/en_uk_lash/me.m09.d14:meVE.Lity3.incipit	…
ltx/en_uk_lash/me.m09.d14:meVE.Lity3.melody	
ltx/en_uk_lash/me.m09.d14:meVE.Lity3.mode	@ltx/en_uk_lash/miscellanea:misc.Mode1
ltx/en_uk_lash/me.m09.d14:meVE.Lity3.text	
ltx/en_uk_lash/me.m09.d14:meVE.Lity4.incipit	@ltx/en_uk_lash/me.m09.d13:meVE.AposBoth.incipit
ltx/en_uk_lash/me.m09.d14:meVE.Lity4.melody	
ltx/en_uk_lash/me.m09.d14:meVE.Lity4.mode	@ltx/en_uk_lash/miscellanea:misc.Mode2
ltx/en_uk_lash/me.m09.d14:meVE.Lity4.poet	@ltx/en_uk_lash/poets:po.Theofanous
ltx/en_uk_lash/me.m09.d14:meVE.Lity4.text	@ltx/en_uk_lash/me.m09.d13:meVE.AposBoth.text
ltx/en_uk_lash/me.m09.d14:meVE.Lity5.incipit	…
ltx/en_uk_lash/me.m09.d14:meVE.Lity5.melody	
ltx/en_uk_lash/me.m09.d14:meVE.Lity5.mode	@ltx/en_uk_lash/miscellanea:misc.Mode2
ltx/en_uk_lash/me.m09.d14:meVE.Lity5.poet	@ltx/en_uk_lash/poets:po.Kyprianou
ltx/en_uk_lash/me.m09.d14:meVE.Lity5.text	
ltx/en_uk_lash/me.m09.d14:meVE.Lity6.incipit	@ltx/en_uk_lash/me.m09.d14:meSV.SticGlory.incipit
ltx/en_uk_lash/me.m09.d14:meVE.Lity6.melody	
ltx/en_uk_lash/me.m09.d14:meVE.Lity6.mode	@ltx/en_uk_lash/miscellanea:misc.Mode2
ltx/en_uk_lash/me.m09.d14:meVE.Lity6.poet	@ltx/en_uk_lash/poets:po.LeontosDespotou
ltx/en_uk_lash/me.m09.d14:meVE.Lity6.text	@ltx/en_uk_lash/me.m09.d14:meSV.SticGlory.text
ltx/en_uk_lash/me.m09.d14:meVE.Lity7.incipit	…
ltx/en_uk_lash/me.m09.d14:meVE.Lity7.melody	
ltx/en_uk_lash/me.m09.d14:meVE.Lity7.mode	@ltx/en_uk_lash/miscellanea:misc.Mode4
ltx/en_uk_lash/me.m09.d14:meVE.Lity7.text	
ltx/en_uk_lash/me.m09.d14:meVE.Lity8.incipit	…
ltx/en_uk_lash/me.m09.d14:meVE.Lity8.melody	
ltx/en_uk_lash/me.m09.d14:meVE.Lity8.mode	@ltx/en_uk_lash/miscellanea:misc.Mode4
ltx/en_uk_lash/me.m09.d14:meVE.Lity8.poet	@ltx/en_uk_lash/poets:po.Anatoliou
ltx/en_uk_lash/me.m09.d14:meVE.Lity8.text	
ltx/en_uk_lash/me.m09.d14:meVE.LityGlory.incipit	…
ltx/en_uk_lash/me.m09.d14:meVE.LityGlory.melody	
ltx/en_uk_lash/me.m09.d14:meVE.LityGlory.mode	@ltx/en_uk_lash/miscellanea:misc.Mode4
ltx/en_uk_lash/me.m09.d14:meVE.LityGlory.poet	@ltx/en_uk_lash/poets:po.Anatoliou
ltx/en_uk_lash/me.m09.d14:meVE.LityGlory.text	
ltx/en_uk_lash/me.m09.d14:meVE.MM.Stichera1123as78910.text	@ltx/en_uk_lash/properties:media.key
ltx/en_uk_lash/me.m09.d14:meVE.SticGlory.incipit	…
ltx/en_uk_lash/me.m09.d14:meVE.SticGlory.melody	
ltx/en_uk_lash/me.m09.d14:meVE.SticGlory.mode	@ltx/en_uk_lash/miscellanea:misc.Mode2
ltx/en_uk_lash/me.m09.d14:meVE.SticGlory.text	
ltx/en_uk_lash/me.m09.d14:meVE.Stichera01.incipit	…
ltx/en_uk_lash/me.m09.d14:meVE.Stichera01.melody	@ltx/en_uk_lash/he.a.m6:heAU.OlinApothemenoi.notmetered
ltx/en_uk_lash/me.m09.d14:meVE.Stichera01.mode	@ltx/en_uk_lash/miscellanea:misc.Mode6
ltx/en_uk_lash/me.m09.d14:meVE.Stichera01.text	
ltx/en_uk_lash/me.m09.d14:meVE.Stichera02.incipit	…
ltx/en_uk_lash/me.m09.d14:meVE.Stichera02.melody	@ltx/en_uk_lash/he.a.m6:heAU.OlinApothemenoi.notmetered
ltx/en_uk_lash/me.m09.d14:meVE.Stichera02.mode	@ltx/en_uk_lash/miscellanea:misc.Mode6
ltx/en_uk_lash/me.m09.d14:meVE.Stichera02.text	
ltx/en_uk_lash/me.m09.d14:meVE.Stichera03.incipit	…
ltx/en_uk_lash/me.m09.d14:meVE.Stichera03.melody	@ltx/en_uk_lash/he.a.m6:heAU.OlinApothemenoi.notmetered
ltx/en_uk_lash/me.m09.d14:meVE.Stichera03.mode	@ltx/en_uk_lash/miscellanea:misc.Mode6
ltx/en_uk_lash/me.m09.d14:meVE.Stichera03.text	
