ltx/en_uk_lash/liturgical.verses:psEU.baptism.hymn1.title	Psalm 31
ltx/en_uk_lash/liturgical.verses:psEU.baptism.prokeimenon.v1.text	The Lord is my enlightenment and my Saviour;* whom shall I fear?
ltx/en_uk_lash/liturgical.verses:psEU.baptism.prokeimenon.v2.text	The Lord is the defender of my life, of whom shall I be afraid?
ltx/en_uk_lash/liturgical.verses:psEU.funeral.stanza3.v1.text	And have mercy on me.
ltx/en_uk_lash/liturgical.verses:psEU.wedding.prokeimenon.v2.text	They have asked you for life, and you have given them length of days.
ltx/en_uk_lash/liturgical.verses:psHO.ecloge.pentecost.v01.info	@ltx/en_uk_lash/ps:psa18.v2.number
ltx/en_uk_lash/liturgical.verses:psHO.ecloge.pentecost.v02.info	@ltx/en_uk_lash/ps:psa32.v6.number
ltx/en_uk_lash/liturgical.verses:psHO.ecloge.pentecost.v03.info	@ltx/en_uk_lash/ps:psa32.v13.number
ltx/en_uk_lash/liturgical.verses:psHO.ecloge.pentecost.v04.info	@ltx/en_uk_lash/ps:psa49.v3.number
ltx/en_uk_lash/liturgical.verses:psHO.ecloge.pentecost.v05.info	(17:9)
ltx/en_uk_lash/liturgical.verses:psHO.ecloge.pentecost.v06.info	@ltx/en_uk_lash/ps:psa17.v8.number
ltx/en_uk_lash/liturgical.verses:psHO.ecloge.pentecost.v06.text	@ltx/en_uk_lash/ps:psa17.v8a.text
ltx/en_uk_lash/liturgical.verses:psHO.ecloge.pentecost.v07.info	@ltx/en_uk_lash/ps:psa17.v13.number
ltx/en_uk_lash/liturgical.verses:psHO.ecloge.pentecost.v07.text	@ltx/en_uk_lash/ps:psa17.v13a.text
ltx/en_uk_lash/liturgical.verses:psHO.ecloge.pentecost.v08.info	@ltx/en_uk_lash/ps:psa67.v14.number
ltx/en_uk_lash/liturgical.verses:psHO.ecloge.pentecost.v08.text	@ltx/en_uk_lash/ps:psa67.v14b.text
ltx/en_uk_lash/liturgical.verses:psHO.ecloge.pentecost.v09.info	@ltx/en_uk_lash/ps:psa18.v8.number
ltx/en_uk_lash/liturgical.verses:psHO.ecloge.pentecost.v09.text	@ltx/en_uk_lash/ps:psa18.v8b.text
ltx/en_uk_lash/liturgical.verses:psHO.ecloge.pentecost.v10.info	@ltx/en_uk_lash/ps:psa18.v9.number
ltx/en_uk_lash/liturgical.verses:psHO.ecloge.pentecost.v10.text	@ltx/en_uk_lash/ps:psa18.v9b.text
ltx/en_uk_lash/liturgical.verses:psHO.ecloge.pentecost.v11.info	@ltx/en_uk_lash/ps:psa28.v8.number
ltx/en_uk_lash/liturgical.verses:psHO.ecloge.pentecost.v11.text	@ltx/en_uk_lash/ps:psa28.v8.text
ltx/en_uk_lash/liturgical.verses:psHO.ecloge.pentecost.v12.info	@ltx/en_uk_lash/ps:psa67.v9.number
ltx/en_uk_lash/liturgical.verses:psHO.ecloge.pentecost.v12.text	@ltx/en_uk_lash/ps:psa67.v9.text
ltx/en_uk_lash/liturgical.verses:psLI.trisagionbaptized.text	As many of you as have been baptized into Christ have put on Christ. Alleluia.
ltx/en_uk_lash/liturgical.verses:psLI.trisagionbaptized.v3.text	Have put on Christ.
ltx/en_uk_lash/liturgical.verses:psLI.trisagionbaptized.v4.text	Alleluia.
ltx/en_uk_lash/liturgical.verses:psMA.beginning.v1.text	The Lord is God, and has appeared to us. Blessed is he who comes in the name of the Lord.
ltx/en_uk_lash/liturgical.verses:psMA.exapintro.v1.text	Holy is the Lord our God.
ltx/en_uk_lash/liturgical.verses:psMA.exapintro.v2.text	Exalt the Lord our God; and bow down before his footstool.
ltx/en_uk_lash/liturgical.verses:psMA.exapintro.v3.text	For he is holy.
ltx/en_uk_lash/liturgical.verses:psMA.ps50.end.v2.text	Then you will be well pleased with a sacrifice of righteousness, oblation and whole burnt offerings. Then they will offer calves upon your altar.
ltx/en_uk_lash/liturgical.verses:psMA.sixpsalms.ps142.end.v1.text	In your justice hear me, O Lord; and do not enter into judgement with your servant.
ltx/en_uk_lash/liturgical.verses:psVE.introductorypsalm.end.v1.text	The sun knew the hour of its setting. You appointed darkness, and it was night.
ltx/en_uk_lash/liturgical.verses:psVE.introductorypsalm.end.v2.text	How your works have been magnified, O Lord. With wisdom you have made them all.
