ltx/en_uk_lash/titles:ti.AdditionalForCanonOfSaint	
ltx/en_uk_lash/titles:ti.AdditionalForDead	
ltx/en_uk_lash/titles:ti.AdditionalForTheotokos	
ltx/en_uk_lash/titles:ti.AdditionalResurrectionalKathismata	
ltx/en_uk_lash/titles:ti.AdditionalStichera	
ltx/en_uk_lash/titles:ti.AdditionalSticheraByAnatolios	
ltx/en_uk_lash/titles:ti.AdditionalSticheraForMaster	
ltx/en_uk_lash/titles:ti.AfterChristmas	
ltx/en_uk_lash/titles:ti.AfterChristmas.uc	
ltx/en_uk_lash/titles:ti.AfterCross	
ltx/en_uk_lash/titles:ti.AfterCross.uc	
ltx/en_uk_lash/titles:ti.AfterEpiphany	
ltx/en_uk_lash/titles:ti.AfterEpiphany.uc	
ltx/en_uk_lash/titles:ti.AfterPolyeleos	
ltx/en_uk_lash/titles:ti.AfterPsalm118AndEvlogetaria	
ltx/en_uk_lash/titles:ti.AfterPsalter1	
ltx/en_uk_lash/titles:ti.AfterPsalter1Kathismata	
ltx/en_uk_lash/titles:ti.AfterPsalter2	
ltx/en_uk_lash/titles:ti.AfterPsalter2Kathismata	
ltx/en_uk_lash/titles:ti.AfterPsalter3Kathismata	
ltx/en_uk_lash/titles:ti.AfterTheFeast	
ltx/en_uk_lash/titles:ti.AfterTheFeast.uc	
ltx/en_uk_lash/titles:ti.Akathist	
ltx/en_uk_lash/titles:ti.Alleluia	
ltx/en_uk_lash/titles:ti.Alphabeticals	
ltx/en_uk_lash/titles:ti.Anavathmoi	
ltx/en_uk_lash/titles:ti.Anavathmoi41	
ltx/en_uk_lash/titles:ti.AncestorsOfGod	
ltx/en_uk_lash/titles:ti.AndAlsoTheotokion	
ltx/en_uk_lash/titles:ti.AnotherApolytikion	
ltx/en_uk_lash/titles:ti.AnotherCanon	
ltx/en_uk_lash/titles:ti.AnotherCanonForefeast	Another Canon of the Forefeast.
ltx/en_uk_lash/titles:ti.AnotherExtraHymn	
ltx/en_uk_lash/titles:ti.AnotherForFeast_1hymn	
ltx/en_uk_lash/titles:ti.AnotherForFeast_canon	
ltx/en_uk_lash/titles:ti.AnotherHeirmos	
ltx/en_uk_lash/titles:ti.AnotherKatavasia	
ltx/en_uk_lash/titles:ti.AnotherKontakion	
ltx/en_uk_lash/titles:ti.Another_1hymn	
ltx/en_uk_lash/titles:ti.Another_canon_heirmos	
ltx/en_uk_lash/titles:ti.Antiphon1	
ltx/en_uk_lash/titles:ti.Antiphon2	
ltx/en_uk_lash/titles:ti.Antiphon3	
ltx/en_uk_lash/titles:ti.Antiphon4	
ltx/en_uk_lash/titles:ti.Apolytikia	Apolytikia.
ltx/en_uk_lash/titles:ti.Apolytikion	
ltx/en_uk_lash/titles:ti.ApolytikionDay	
ltx/en_uk_lash/titles:ti.ApolytikionFeast	Apolytikion of the Feast.
ltx/en_uk_lash/titles:ti.ApolytikionResurrectional	
ltx/en_uk_lash/titles:ti.ApolytikionTriodion	
ltx/en_uk_lash/titles:ti.Aposticha	Aposticha.
ltx/en_uk_lash/titles:ti.ApostichaFeast	
ltx/en_uk_lash/titles:ti.ApostichaForefeast	
ltx/en_uk_lash/titles:ti.ApostichaLauds	
ltx/en_uk_lash/titles:ti.ApostichaOctoechos	
ltx/en_uk_lash/titles:ti.ApostichaResurrectional	
ltx/en_uk_lash/titles:ti.ApostichaStichera	
ltx/en_uk_lash/titles:ti.ApostichaTheotokos	
ltx/en_uk_lash/titles:ti.Apostle	
ltx/en_uk_lash/titles:ti.Apostles	
ltx/en_uk_lash/titles:ti.Archangel	
ltx/en_uk_lash/titles:ti.Asterisk	Asterisk.
ltx/en_uk_lash/titles:ti.AtAposticha	
ltx/en_uk_lash/titles:ti.AtApostichaOfLauds	
ltx/en_uk_lash/titles:ti.AtCompline.lc	
ltx/en_uk_lash/titles:ti.AtCompline.uc	
ltx/en_uk_lash/titles:ti.AtLauds	
ltx/en_uk_lash/titles:ti.AtLiturgy.lc	
ltx/en_uk_lash/titles:ti.AtLiturgy.uc	
ltx/en_uk_lash/titles:ti.AtLity	
ltx/en_uk_lash/titles:ti.AtLordIHaveCried	
ltx/en_uk_lash/titles:ti.AtMatins.lc	
ltx/en_uk_lash/titles:ti.AtMatins.uc	
ltx/en_uk_lash/titles:ti.AtTrithekti.lc	
ltx/en_uk_lash/titles:ti.AtTrithekti.uc	
ltx/en_uk_lash/titles:ti.AtVespers.lc	
ltx/en_uk_lash/titles:ti.AtVespers.uc	
ltx/en_uk_lash/titles:ti.Beatitudes	
ltx/en_uk_lash/titles:ti.BeforeChristmas	
ltx/en_uk_lash/titles:ti.BeforeChristmas.uc	
ltx/en_uk_lash/titles:ti.BeforeCross	
ltx/en_uk_lash/titles:ti.BeforeCross.uc	
ltx/en_uk_lash/titles:ti.BeforeEpiphany	
ltx/en_uk_lash/titles:ti.BeforeEpiphany.uc	
ltx/en_uk_lash/titles:ti.BlessingOfLoaves	Artoklasia.
ltx/en_uk_lash/titles:ti.Blindman	
ltx/en_uk_lash/titles:ti.Bodiless	
ltx/en_uk_lash/titles:ti.BothNow	Both now.
ltx/en_uk_lash/titles:ti.ByLash	By Archimandrite Ephrem Lash
ltx/en_uk_lash/titles:ti.Canon1	
ltx/en_uk_lash/titles:ti.Canon1Apostle	
ltx/en_uk_lash/titles:ti.Canon1Bodiless	
ltx/en_uk_lash/titles:ti.Canon1DevoutM	
ltx/en_uk_lash/titles:ti.Canon1DevoutW	
ltx/en_uk_lash/titles:ti.Canon1Fathers	
ltx/en_uk_lash/titles:ti.Canon1Feast	
ltx/en_uk_lash/titles:ti.Canon1Forerunner	
ltx/en_uk_lash/titles:ti.Canon1MidPentecost	
ltx/en_uk_lash/titles:ti.Canon1Prophet	
ltx/en_uk_lash/titles:ti.Canon1SaintM	
ltx/en_uk_lash/titles:ti.Canon1SaintW	
ltx/en_uk_lash/titles:ti.Canon1Saints	
ltx/en_uk_lash/titles:ti.Canon1Theotokos	
ltx/en_uk_lash/titles:ti.Canon1Triodion	
ltx/en_uk_lash/titles:ti.Canon2	
ltx/en_uk_lash/titles:ti.Canon2Apostle	
ltx/en_uk_lash/titles:ti.Canon2Bodiless	
ltx/en_uk_lash/titles:ti.Canon2DevoutM	
ltx/en_uk_lash/titles:ti.Canon2DevoutW	
ltx/en_uk_lash/titles:ti.Canon2Fathers	
ltx/en_uk_lash/titles:ti.Canon2Feast	
ltx/en_uk_lash/titles:ti.Canon2Forerunner	
ltx/en_uk_lash/titles:ti.Canon2MidPentecost	
ltx/en_uk_lash/titles:ti.Canon2Prophet	
ltx/en_uk_lash/titles:ti.Canon2SaintM	
ltx/en_uk_lash/titles:ti.Canon2SaintW	
ltx/en_uk_lash/titles:ti.Canon2Saints	
ltx/en_uk_lash/titles:ti.Canon2Theotokos	
ltx/en_uk_lash/titles:ti.Canon2Triodion	
ltx/en_uk_lash/titles:ti.Canon3	
ltx/en_uk_lash/titles:ti.Canon3Triodion	
ltx/en_uk_lash/titles:ti.CanonAllSaints	
ltx/en_uk_lash/titles:ti.CanonAncestorsOfGod	
ltx/en_uk_lash/titles:ti.CanonApostle	
ltx/en_uk_lash/titles:ti.CanonApostles	
ltx/en_uk_lash/titles:ti.CanonArchangel	
ltx/en_uk_lash/titles:ti.CanonBlindman	
ltx/en_uk_lash/titles:ti.CanonBodiless	
ltx/en_uk_lash/titles:ti.CanonCompline	
ltx/en_uk_lash/titles:ti.CanonCompunction	
ltx/en_uk_lash/titles:ti.CanonConsecration	
ltx/en_uk_lash/titles:ti.CanonCross	
ltx/en_uk_lash/titles:ti.CanonCrossResurrection	
ltx/en_uk_lash/titles:ti.CanonCrucifixion	
ltx/en_uk_lash/titles:ti.CanonDead	
ltx/en_uk_lash/titles:ti.CanonDeceased	
ltx/en_uk_lash/titles:ti.CanonDevoutM	
ltx/en_uk_lash/titles:ti.CanonDevoutMartyrM	
ltx/en_uk_lash/titles:ti.CanonDevoutSaints	
ltx/en_uk_lash/titles:ti.CanonDevoutW	
ltx/en_uk_lash/titles:ti.CanonEvangelist	
ltx/en_uk_lash/titles:ti.CanonFathers	
ltx/en_uk_lash/titles:ti.CanonFeast	
ltx/en_uk_lash/titles:ti.CanonForefathers	
ltx/en_uk_lash/titles:ti.CanonForefeast	
ltx/en_uk_lash/titles:ti.CanonForerunner	
ltx/en_uk_lash/titles:ti.CanonGreatMartyrM	
ltx/en_uk_lash/titles:ti.CanonHierarch	
ltx/en_uk_lash/titles:ti.CanonHieromartyr	
ltx/en_uk_lash/titles:ti.CanonHieromartyrs	
ltx/en_uk_lash/titles:ti.CanonHolyApostles	
ltx/en_uk_lash/titles:ti.CanonMartyrM	
ltx/en_uk_lash/titles:ti.CanonMartyrW	
ltx/en_uk_lash/titles:ti.CanonMartyrs	
ltx/en_uk_lash/titles:ti.CanonMyrrhbearerW	
ltx/en_uk_lash/titles:ti.CanonMyrrhbearers	
ltx/en_uk_lash/titles:ti.CanonParalytic	
ltx/en_uk_lash/titles:ti.CanonPascha	
ltx/en_uk_lash/titles:ti.CanonPentecostarion	
ltx/en_uk_lash/titles:ti.CanonProphet	
ltx/en_uk_lash/titles:ti.CanonProphetsMartyrs	
ltx/en_uk_lash/titles:ti.CanonProtomartyrM	
ltx/en_uk_lash/titles:ti.CanonResurrection	
ltx/en_uk_lash/titles:ti.CanonSaintM	
ltx/en_uk_lash/titles:ti.CanonSaintW	
ltx/en_uk_lash/titles:ti.CanonSaints	
ltx/en_uk_lash/titles:ti.CanonSamaritanWoman	
ltx/en_uk_lash/titles:ti.CanonStNicholas	
ltx/en_uk_lash/titles:ti.CanonTheotokos	
ltx/en_uk_lash/titles:ti.CanonTrinity	
ltx/en_uk_lash/titles:ti.CanonTriodion	
ltx/en_uk_lash/titles:ti.Chalice	Chalice
ltx/en_uk_lash/titles:ti.Commanders	
ltx/en_uk_lash/titles:ti.CommunionHymn	Communion Hymn.
ltx/en_uk_lash/titles:ti.Consecration	
ltx/en_uk_lash/titles:ti.ConsecrationOfAChurch	
ltx/en_uk_lash/titles:ti.Couplet	
ltx/en_uk_lash/titles:ti.Cross	
ltx/en_uk_lash/titles:ti.Cuffs	Cuffs.
ltx/en_uk_lash/titles:ti.Deceased	
ltx/en_uk_lash/titles:ti.DevoutMartyrM	
ltx/en_uk_lash/titles:ti.DevoutMartyrW	
ltx/en_uk_lash/titles:ti.DevoutSaintM	
ltx/en_uk_lash/titles:ti.DevoutSaints	
ltx/en_uk_lash/titles:ti.DevoutW	
ltx/en_uk_lash/titles:ti.Diskos	Diskos.
ltx/en_uk_lash/titles:ti.Dismissal.uc	
ltx/en_uk_lash/titles:ti.DistributionOfHolyCommunion	Distribution of Holy Communion
ltx/en_uk_lash/titles:ti.DogmaticTheotokion	
ltx/en_uk_lash/titles:ti.Doxasticon	Doxastikon.
ltx/en_uk_lash/titles:ti.Earthquake	
ltx/en_uk_lash/titles:ti.Elements	The Elements.
ltx/en_uk_lash/titles:ti.Entrance.uc	
ltx/en_uk_lash/titles:ti.EntranceHymn	
ltx/en_uk_lash/titles:ti.Eothinon	
ltx/en_uk_lash/titles:ti.EothinonDoxasticon	
ltx/en_uk_lash/titles:ti.EothinonGospel	
ltx/en_uk_lash/titles:ti.EothinonOfSunday	
ltx/en_uk_lash/titles:ti.Epigonation	Epigonation.
ltx/en_uk_lash/titles:ti.Epistle	
ltx/en_uk_lash/titles:ti.EqualsOfApostles	
ltx/en_uk_lash/titles:ti.Evangelist	
ltx/en_uk_lash/titles:ti.Evening	Evening
ltx/en_uk_lash/titles:ti.Evening.uc	
ltx/en_uk_lash/titles:ti.Evlogetaria	
ltx/en_uk_lash/titles:ti.Exaposteilaria	
ltx/en_uk_lash/titles:ti.Exaposteilarion	Exapostilarion.
ltx/en_uk_lash/titles:ti.ExaposteilarionOfDay	
ltx/en_uk_lash/titles:ti.Fathers	
ltx/en_uk_lash/titles:ti.Feast	
ltx/en_uk_lash/titles:ti.FifthSunday	
ltx/en_uk_lash/titles:ti.FifthSunday.uc	
ltx/en_uk_lash/titles:ti.FirstSunday	
ltx/en_uk_lash/titles:ti.FirstSunday.uc	
ltx/en_uk_lash/titles:ti.FirstTheotokion	
ltx/en_uk_lash/titles:ti.FirstTheotokionOfMode	
ltx/en_uk_lash/titles:ti.ForApostle	
ltx/en_uk_lash/titles:ti.ForApostles	
ltx/en_uk_lash/titles:ti.ForCompunction_1hymn	
ltx/en_uk_lash/titles:ti.ForCompunction_hymns	
ltx/en_uk_lash/titles:ti.ForCross_1hymn	
ltx/en_uk_lash/titles:ti.ForCross_hymns	
ltx/en_uk_lash/titles:ti.ForDead_1hymn	
ltx/en_uk_lash/titles:ti.ForDead_hymns	
ltx/en_uk_lash/titles:ti.ForFriday	
ltx/en_uk_lash/titles:ti.ForMartyrs_1hymn	
ltx/en_uk_lash/titles:ti.ForMartyrs_hymns	
ltx/en_uk_lash/titles:ti.ForMonday	
ltx/en_uk_lash/titles:ti.ForSaturday	
ltx/en_uk_lash/titles:ti.ForSunday	
ltx/en_uk_lash/titles:ti.ForTheDay	
ltx/en_uk_lash/titles:ti.ForThursday	
ltx/en_uk_lash/titles:ti.ForTuesday	
ltx/en_uk_lash/titles:ti.ForWednesday	
ltx/en_uk_lash/titles:ti.ForWeekday	ON ORDINARY DAYS
ltx/en_uk_lash/titles:ti.Forefathers	
ltx/en_uk_lash/titles:ti.Forefestal_1hymn	
ltx/en_uk_lash/titles:ti.Forefestal_Epistle	
ltx/en_uk_lash/titles:ti.Forefestal_Gospel	
ltx/en_uk_lash/titles:ti.Forefestal_hymns	
ltx/en_uk_lash/titles:ti.Forerunner	
ltx/en_uk_lash/titles:ti.FourthSunday	
ltx/en_uk_lash/titles:ti.FourthSunday.uc	
ltx/en_uk_lash/titles:ti.FromMenaion	
ltx/en_uk_lash/titles:ti.FromSmallVespers	
ltx/en_uk_lash/titles:ti.FromVespers	
ltx/en_uk_lash/titles:ti.Glory	Glory.
ltx/en_uk_lash/titles:ti.GloryBothNow	
ltx/en_uk_lash/titles:ti.Gospel	
ltx/en_uk_lash/titles:ti.GreatDoxologyAndDismissal	
ltx/en_uk_lash/titles:ti.GreatMartyr	
ltx/en_uk_lash/titles:ti.GreatVespers.uc	
ltx/en_uk_lash/titles:ti.HeadDress	Head-dress
ltx/en_uk_lash/titles:ti.Heirmos	
ltx/en_uk_lash/titles:ti.HeirmosAsKatavasia	
ltx/en_uk_lash/titles:ti.HeirmosUsingMelody	
ltx/en_uk_lash/titles:ti.Hierarch	
ltx/en_uk_lash/titles:ti.Hierarchs	
ltx/en_uk_lash/titles:ti.Hieromartyr	
ltx/en_uk_lash/titles:ti.Hieromartyrs	
ltx/en_uk_lash/titles:ti.HolyGospel	
ltx/en_uk_lash/titles:ti.HolyNapkin	
ltx/en_uk_lash/titles:ti.HolyWomen	
ltx/en_uk_lash/titles:ti.HymnToTheotokos	
ltx/en_uk_lash/titles:ti.HymnsAfterSmallEntrance	Hymns After the Small Entrance.
ltx/en_uk_lash/titles:ti.Hypakoe	
ltx/en_uk_lash/titles:ti.Iambic	
ltx/en_uk_lash/titles:ti.IambicCanon	
ltx/en_uk_lash/titles:ti.Idiomela	
ltx/en_uk_lash/titles:ti.IdiomelaMenaion	
ltx/en_uk_lash/titles:ti.IdiomelaOfAposticha	
ltx/en_uk_lash/titles:ti.IdiomelaOfFeast	
ltx/en_uk_lash/titles:ti.IdiomelaOfLity	
ltx/en_uk_lash/titles:ti.IdiomelaPentecostarion	
ltx/en_uk_lash/titles:ti.IdiomelaTriodion	
ltx/en_uk_lash/titles:ti.Idiomelon1	
ltx/en_uk_lash/titles:ti.Idiomelon10	
ltx/en_uk_lash/titles:ti.Idiomelon2	
ltx/en_uk_lash/titles:ti.Idiomelon3	
ltx/en_uk_lash/titles:ti.Idiomelon4	
ltx/en_uk_lash/titles:ti.Idiomelon5	
ltx/en_uk_lash/titles:ti.Idiomelon6	
ltx/en_uk_lash/titles:ti.Idiomelon7	
ltx/en_uk_lash/titles:ti.Idiomelon8	
ltx/en_uk_lash/titles:ti.Idiomelon9	
ltx/en_uk_lash/titles:ti.Indiction	
ltx/en_uk_lash/titles:ti.InsteadOfWeHaveSeen	
ltx/en_uk_lash/titles:ti.IntermediateVersesOde1	
ltx/en_uk_lash/titles:ti.IntermediateVersesOde3	
ltx/en_uk_lash/titles:ti.IntermediateVersesOde4	
ltx/en_uk_lash/titles:ti.IntermediateVersesOde5	
ltx/en_uk_lash/titles:ti.IntermediateVersesOde6	
ltx/en_uk_lash/titles:ti.IntermediateVersesOde7	
ltx/en_uk_lash/titles:ti.IntermediateVersesOde8	
ltx/en_uk_lash/titles:ti.Introduction	Introduction
ltx/en_uk_lash/titles:ti.IntroductoryNote	INTRODUCTORY NOTE
ltx/en_uk_lash/titles:ti.Joseph	
ltx/en_uk_lash/titles:ti.JosephTheBetrothed	
ltx/en_uk_lash/titles:ti.Kalymafchion	Kalymafchion
ltx/en_uk_lash/titles:ti.Katavasia	
ltx/en_uk_lash/titles:ti.Katavasias	
ltx/en_uk_lash/titles:ti.Kathisma	Kathisma.
ltx/en_uk_lash/titles:ti.Kathisma1	
ltx/en_uk_lash/titles:ti.Kathisma2	
ltx/en_uk_lash/titles:ti.Kathisma3	
ltx/en_uk_lash/titles:ti.KathismaMartyrs	
ltx/en_uk_lash/titles:ti.Kathismata	
ltx/en_uk_lash/titles:ti.KathismataMartyrs	
ltx/en_uk_lash/titles:ti.KathismataResurrectional	
ltx/en_uk_lash/titles:ti.Kontakia	
ltx/en_uk_lash/titles:ti.Kontakion	
ltx/en_uk_lash/titles:ti.KontakionDay	
ltx/en_uk_lash/titles:ti.KontakionFathers	
ltx/en_uk_lash/titles:ti.KontakionFeast	Kontakion of the Feast.
ltx/en_uk_lash/titles:ti.KontakionForefeast	
ltx/en_uk_lash/titles:ti.KontakionPascha	
ltx/en_uk_lash/titles:ti.KontakionResurrectional	
ltx/en_uk_lash/titles:ti.KontakionTheotokos	
ltx/en_uk_lash/titles:ti.KontakionTriodion	
ltx/en_uk_lash/titles:ti.Lance	Lance.
ltx/en_uk_lash/titles:ti.Lauds	Lauds.
ltx/en_uk_lash/titles:ti.Lazarus	
ltx/en_uk_lash/titles:ti.LeavetakingOfFeast	
ltx/en_uk_lash/titles:ti.LitChrysostom	The Divine Liturgy of Our Father Among the Saints John Chrysostom
ltx/en_uk_lash/titles:ti.Litanies.uc	
ltx/en_uk_lash/titles:ti.LitanyGreat.uc	Litany of Peace.
ltx/en_uk_lash/titles:ti.Liturgy.uc	
ltx/en_uk_lash/titles:ti.Lity	
ltx/en_uk_lash/titles:ti.LityAndLoaves	
ltx/en_uk_lash/titles:ti.LocalChurch	
ltx/en_uk_lash/titles:ti.LordsPrayer.uc	The Lord's Prayer
ltx/en_uk_lash/titles:ti.Magnificat	The Song of the Mother of God.
ltx/en_uk_lash/titles:ti.Martyr	
ltx/en_uk_lash/titles:ti.MartyrW	
ltx/en_uk_lash/titles:ti.MartyricOfMode	
ltx/en_uk_lash/titles:ti.Martyrs	
ltx/en_uk_lash/titles:ti.Matins.uc	
ltx/en_uk_lash/titles:ti.Megalynaria	
ltx/en_uk_lash/titles:ti.Megalynarion	
ltx/en_uk_lash/titles:ti.Menaion	
ltx/en_uk_lash/titles:ti.MidnightOffice.uc	
ltx/en_uk_lash/titles:ti.Midpentecost	
ltx/en_uk_lash/titles:ti.Mode	
ltx/en_uk_lash/titles:ti.ModeOfWeek	
ltx/en_uk_lash/titles:ti.Morning	Morning
ltx/en_uk_lash/titles:ti.Morning.uc	
ltx/en_uk_lash/titles:ti.MyrrhbearerW	
ltx/en_uk_lash/titles:ti.Myrrhbearers	
ltx/en_uk_lash/titles:ti.Neomartyr	
ltx/en_uk_lash/titles:ti.Octoechos	
ltx/en_uk_lash/titles:ti.Oikos	
ltx/en_uk_lash/titles:ti.OnFriday	
ltx/en_uk_lash/titles:ti.OnFriday.uc	On Friday.
ltx/en_uk_lash/titles:ti.OnMonday	
ltx/en_uk_lash/titles:ti.OnMonday.uc	
ltx/en_uk_lash/titles:ti.OnSaturday	
ltx/en_uk_lash/titles:ti.OnSaturday.uc	
ltx/en_uk_lash/titles:ti.OnSunday	On Sunday
ltx/en_uk_lash/titles:ti.OnSunday.uc	
ltx/en_uk_lash/titles:ti.OnThursday	
ltx/en_uk_lash/titles:ti.OnThursday.uc	
ltx/en_uk_lash/titles:ti.OnTuesday	
ltx/en_uk_lash/titles:ti.OnTuesday.uc	
ltx/en_uk_lash/titles:ti.OnWednesday	
ltx/en_uk_lash/titles:ti.OnWednesday.uc	
ltx/en_uk_lash/titles:ti.OrModeOfWeek	
ltx/en_uk_lash/titles:ti.OrStavrotheotokion	
ltx/en_uk_lash/titles:ti.OrderOfLiturgy	ORDER OF THE DIVINE AND SACRED LITURGY
ltx/en_uk_lash/titles:ti.Paralytic	
ltx/en_uk_lash/titles:ti.Pascha	
ltx/en_uk_lash/titles:ti.PectoralCross	Pectoral Cross
ltx/en_uk_lash/titles:ti.Pentecostarion	
ltx/en_uk_lash/titles:ti.PhotagogicHymns	
ltx/en_uk_lash/titles:ti.Polyeleos	
ltx/en_uk_lash/titles:ti.PostFestal_Epistle	
ltx/en_uk_lash/titles:ti.PostFestal_Gospel	
ltx/en_uk_lash/titles:ti.PrayerBlessingLoaves	
ltx/en_uk_lash/titles:ti.PrayerOfStEphraim	
ltx/en_uk_lash/titles:ti.PrayerOfTheOffering	PRAYER OF THE OFFERING
ltx/en_uk_lash/titles:ti.PremierApostles	
ltx/en_uk_lash/titles:ti.Preparation	THE OFFICE OF PREPARATION FOR THE DIVINE LITURGY
ltx/en_uk_lash/titles:ti.Presanctified	THE HOLY AND DIVINE LITURGY OF THE PRESANCTIFIED GIFTS
ltx/en_uk_lash/titles:ti.Prokeimenon	
ltx/en_uk_lash/titles:ti.ProkeimenonEpistle	
ltx/en_uk_lash/titles:ti.Prophet	
ltx/en_uk_lash/titles:ti.Prosomia	
ltx/en_uk_lash/titles:ti.Prothesis	[THE PREPARATION OF THE EUCHARISTIC GIFTS]
ltx/en_uk_lash/titles:ti.ProtomartyrM	
ltx/en_uk_lash/titles:ti.Psalm	Psalm
ltx/en_uk_lash/titles:ti.PsalmOfDavid	
ltx/en_uk_lash/titles:ti.Readings	
ltx/en_uk_lash/titles:ti.ReadingsCommemoration	
ltx/en_uk_lash/titles:ti.ReadingsLiturgy	
ltx/en_uk_lash/titles:ti.ReadingsRegularCycle	
ltx/en_uk_lash/titles:ti.ReadingsVespers	
ltx/en_uk_lash/titles:ti.ReadingsVespersPreviousEvening	
ltx/en_uk_lash/titles:ti.RegularCycle	
ltx/en_uk_lash/titles:ti.Repeat	
ltx/en_uk_lash/titles:ti.RepeatHymn	
ltx/en_uk_lash/titles:ti.Resurrectional_1hymn	
ltx/en_uk_lash/titles:ti.Resurrectional_hymns	
ltx/en_uk_lash/titles:ti.Righteous	
ltx/en_uk_lash/titles:ti.RighteousM	
ltx/en_uk_lash/titles:ti.SaintM	
ltx/en_uk_lash/titles:ti.SaintW	
ltx/en_uk_lash/titles:ti.Saints	
ltx/en_uk_lash/titles:ti.Salutations	
ltx/en_uk_lash/titles:ti.SamaritanWoman	
ltx/en_uk_lash/titles:ti.SameHeirmos	
ltx/en_uk_lash/titles:ti.SameMelody_1hymn	
ltx/en_uk_lash/titles:ti.SameMelody_hymns	
ltx/en_uk_lash/titles:ti.SameMode	
ltx/en_uk_lash/titles:ti.SecondSunday	
ltx/en_uk_lash/titles:ti.SecondSunday.uc	
ltx/en_uk_lash/titles:ti.SkippedEpistle	
ltx/en_uk_lash/titles:ti.SkippedEpistleP	
ltx/en_uk_lash/titles:ti.SkippedGospel	
ltx/en_uk_lash/titles:ti.SkippedGospelP	
ltx/en_uk_lash/titles:ti.SmallEntrance.uc	
ltx/en_uk_lash/titles:ti.SmallVespers.uc	
ltx/en_uk_lash/titles:ti.Spoon	'Spoon.'
ltx/en_uk_lash/titles:ti.StNicholas	
ltx/en_uk_lash/titles:ti.Stanza1	
ltx/en_uk_lash/titles:ti.Stanza2	
ltx/en_uk_lash/titles:ti.Stanza3	
ltx/en_uk_lash/titles:ti.Stanza4	
ltx/en_uk_lash/titles:ti.Stavrotheotokion	
ltx/en_uk_lash/titles:ti.Stichera	
ltx/en_uk_lash/titles:ti.SticheraApostles	
ltx/en_uk_lash/titles:ti.SticheraConsecration	
ltx/en_uk_lash/titles:ti.SticheraCross	
ltx/en_uk_lash/titles:ti.SticheraCrucifixion	
ltx/en_uk_lash/titles:ti.SticheraDeceased	
ltx/en_uk_lash/titles:ti.SticheraFathers	
ltx/en_uk_lash/titles:ti.SticheraFeast	
ltx/en_uk_lash/titles:ti.SticheraForerunner	
ltx/en_uk_lash/titles:ti.SticheraIdiomela	
ltx/en_uk_lash/titles:ti.SticheraIdiomelaFeast	
ltx/en_uk_lash/titles:ti.SticheraLauds	
ltx/en_uk_lash/titles:ti.SticheraMartyrs	
ltx/en_uk_lash/titles:ti.SticheraMaster	
ltx/en_uk_lash/titles:ti.SticheraMenaion	
ltx/en_uk_lash/titles:ti.SticheraPascha	
ltx/en_uk_lash/titles:ti.SticheraPentecostarion	
ltx/en_uk_lash/titles:ti.SticheraProsomia	
ltx/en_uk_lash/titles:ti.SticheraProsomiaDevoutM	
ltx/en_uk_lash/titles:ti.SticheraProsomiaSaintM	
ltx/en_uk_lash/titles:ti.SticheraResurrectional	
ltx/en_uk_lash/titles:ti.SticheraResurrectionalOctoechos	
ltx/en_uk_lash/titles:ti.SticheraStNicholas	
ltx/en_uk_lash/titles:ti.SticheraTheotokos	
ltx/en_uk_lash/titles:ti.SticheraTriodion	
ltx/en_uk_lash/titles:ti.Sticheron	Sticheron.
ltx/en_uk_lash/titles:ti.Sticheron1	1.
ltx/en_uk_lash/titles:ti.Sticheron10	10.
ltx/en_uk_lash/titles:ti.Sticheron2	2.
ltx/en_uk_lash/titles:ti.Sticheron3	3.
ltx/en_uk_lash/titles:ti.Sticheron4	4.
ltx/en_uk_lash/titles:ti.Sticheron5	5.
ltx/en_uk_lash/titles:ti.Sticheron6	6.
ltx/en_uk_lash/titles:ti.Sticheron7	7.
ltx/en_uk_lash/titles:ti.Sticheron8	8.
ltx/en_uk_lash/titles:ti.Sticheron9	9.
ltx/en_uk_lash/titles:ti.SticheronIdiomelon	
ltx/en_uk_lash/titles:ti.Stichologia	
ltx/en_uk_lash/titles:ti.SungInThisOde	
ltx/en_uk_lash/titles:ti.Synaxarion	
ltx/en_uk_lash/titles:ti.TheCanon	
ltx/en_uk_lash/titles:ti.TheCanonFeast	
ltx/en_uk_lash/titles:ti.TheCanonGeneralMenaion	
ltx/en_uk_lash/titles:ti.TheCanonMenaion	
ltx/en_uk_lash/titles:ti.TheProphecy.uc	
ltx/en_uk_lash/titles:ti.TheResurrectional_1hymn	
ltx/en_uk_lash/titles:ti.TheResurrectional_hymns	
ltx/en_uk_lash/titles:ti.TheSameMode	
ltx/en_uk_lash/titles:ti.TheTwelve	
ltx/en_uk_lash/titles:ti.Theotokia	
ltx/en_uk_lash/titles:ti.Theotokion	
ltx/en_uk_lash/titles:ti.Theotokos	
ltx/en_uk_lash/titles:ti.ThirdSunday	
ltx/en_uk_lash/titles:ti.ThirdSunday.uc	
ltx/en_uk_lash/titles:ti.Triadic	
ltx/en_uk_lash/titles:ti.TriadicHymns	
ltx/en_uk_lash/titles:ti.Triodion	From the Triodion
ltx/en_uk_lash/titles:ti.Trisagion	Trisagion
ltx/en_uk_lash/titles:ti.TrisagiosHymn.uc	
ltx/en_uk_lash/titles:ti.Troparia	
ltx/en_uk_lash/titles:ti.TropariaCompunction	
ltx/en_uk_lash/titles:ti.Troparion	Troparion.
ltx/en_uk_lash/titles:ti.TroparionOfProphecy	
ltx/en_uk_lash/titles:ti.TypikaAndBeatitudes	
ltx/en_uk_lash/titles:ti.Veils	Veils.
ltx/en_uk_lash/titles:ti.Verses	
ltx/en_uk_lash/titles:ti.Vessels	Vessels
ltx/en_uk_lash/titles:ti.Vesting	[THE VESTING OF THE CLERGY]
ltx/en_uk_lash/titles:ti.Vestments	Vestments
ltx/en_uk_lash/titles:ti.VirginMartyrW	
ltx/en_uk_lash/titles:ti.WithAcrostic	of which the Acrostic is:
ltx/en_uk_lash/titles:ti.WithTheGifts	with the Gifts of Bread and Wine
ltx/en_uk_lash/titles:ti.Zone	Zone
ltx/en_uk_lash/titles:ti.beforeMeatFareSunday	
ltx/en_uk_lash/titles:ti.dayFriday	
ltx/en_uk_lash/titles:ti.dayFriday.uc	
ltx/en_uk_lash/titles:ti.dayMonday	
ltx/en_uk_lash/titles:ti.dayMonday.uc	
ltx/en_uk_lash/titles:ti.daySaturday	
ltx/en_uk_lash/titles:ti.daySaturday.uc	
ltx/en_uk_lash/titles:ti.daySunday	
ltx/en_uk_lash/titles:ti.daySunday.uc	
ltx/en_uk_lash/titles:ti.dayThursday	
ltx/en_uk_lash/titles:ti.dayThursday.uc	
ltx/en_uk_lash/titles:ti.dayTuesday	
ltx/en_uk_lash/titles:ti.dayTuesday.uc	
ltx/en_uk_lash/titles:ti.dayWednesday	
ltx/en_uk_lash/titles:ti.dayWednesday.uc	
ltx/en_uk_lash/titles:ti.eclog.Angels.title	
ltx/en_uk_lash/titles:ti.eclog.Annunciation.title	
ltx/en_uk_lash/titles:ti.eclog.Apostles.title	
ltx/en_uk_lash/titles:ti.eclog.Ascension.title	
ltx/en_uk_lash/titles:ti.eclog.Christmas.title	
ltx/en_uk_lash/titles:ti.eclog.Cross.title	
ltx/en_uk_lash/titles:ti.eclog.Dormition.title	
ltx/en_uk_lash/titles:ti.eclog.Entry.title	
ltx/en_uk_lash/titles:ti.eclog.Epiphany.title	
ltx/en_uk_lash/titles:ti.eclog.Forerunner.title	
ltx/en_uk_lash/titles:ti.eclog.Hierarchs.title	
ltx/en_uk_lash/titles:ti.eclog.Martyrs.title	
ltx/en_uk_lash/titles:ti.eclog.Meatfare.title	
ltx/en_uk_lash/titles:ti.eclog.Meeting.title	
ltx/en_uk_lash/titles:ti.eclog.Monastics.title	
ltx/en_uk_lash/titles:ti.eclog.Palm.title	
ltx/en_uk_lash/titles:ti.eclog.Pentecost.title	
ltx/en_uk_lash/titles:ti.eclog.ProphetElias.title	
ltx/en_uk_lash/titles:ti.eclog.StAnne.title	
ltx/en_uk_lash/titles:ti.eclog.Theotokos.title	
ltx/en_uk_lash/titles:ti.eclog.TheotokosBirth.title	
ltx/en_uk_lash/titles:ti.eclog.Thomas.title	
ltx/en_uk_lash/titles:ti.eclog.Transfiguration.title	
ltx/en_uk_lash/titles:ti.eclog.rubric1	
ltx/en_uk_lash/titles:ti.eclog.title1	
ltx/en_uk_lash/titles:ti.eclog.title2	
ltx/en_uk_lash/titles:ti.eclog.title3	
ltx/en_uk_lash/titles:ti.forAnnunciation	
ltx/en_uk_lash/titles:ti.forChristmas	
ltx/en_uk_lash/titles:ti.forCross	
ltx/en_uk_lash/titles:ti.forDormition	
ltx/en_uk_lash/titles:ti.forEntry	
ltx/en_uk_lash/titles:ti.forMeeting	
ltx/en_uk_lash/titles:ti.forTheotokosBirth	
ltx/en_uk_lash/titles:ti.forTransfiguration	
ltx/en_uk_lash/titles:ti.intheEvening	
ltx/en_uk_lash/titles:ti.ofAscension	
ltx/en_uk_lash/titles:ti.ofBrightWeek	
ltx/en_uk_lash/titles:ti.ofCheeseWeek	
ltx/en_uk_lash/titles:ti.ofCheeseWeek.uc	
ltx/en_uk_lash/titles:ti.ofHolyWeek	
ltx/en_uk_lash/titles:ti.ofLent	
ltx/en_uk_lash/titles:ti.ofLent.uc	
ltx/en_uk_lash/titles:ti.ofPentecost	
ltx/en_uk_lash/titles:ti.ofWeek1	
ltx/en_uk_lash/titles:ti.ofWeek1.uc	
ltx/en_uk_lash/titles:ti.ofWeek2	
ltx/en_uk_lash/titles:ti.ofWeek2.uc	
ltx/en_uk_lash/titles:ti.ofWeek3	
ltx/en_uk_lash/titles:ti.ofWeek3.uc	
ltx/en_uk_lash/titles:ti.ofWeek4	
ltx/en_uk_lash/titles:ti.ofWeek4.uc	
ltx/en_uk_lash/titles:ti.ofWeek5	
ltx/en_uk_lash/titles:ti.ofWeek5.uc	
ltx/en_uk_lash/titles:ti.ofWeek6_pe	
ltx/en_uk_lash/titles:ti.ofWeek6_pe.uc	
ltx/en_uk_lash/titles:ti.ofWeek6_tr	
ltx/en_uk_lash/titles:ti.ofWeek6_tr.uc	
ltx/en_uk_lash/titles:ti.ofWeek7	
ltx/en_uk_lash/titles:ti.ofWeek7.uc	
ltx/en_uk_lash/titles:ti.ofWeek8_pe	
ltx/en_uk_lash/titles:ti.ofWeek8_pe.uc	
ltx/en_uk_lash/titles:ti.sourceEuchologion	
ltx/en_uk_lash/titles:ti.sourceHorologion	
ltx/en_uk_lash/titles:ti.sourceMeSupplement	
ltx/en_uk_lash/titles:ti.sourceMenaion	
ltx/en_uk_lash/titles:ti.sourceOctoechos	
ltx/en_uk_lash/titles:ti.sourcePeSupplement	
ltx/en_uk_lash/titles:ti.sourcePentecostarion	
ltx/en_uk_lash/titles:ti.sourceTriodion	
