ltx/en_uk_lash/me.m01.d06:meDA.commemoration.first	
ltx/en_uk_lash/me.m01.d06:meDA.commemoration.first_name	
ltx/en_uk_lash/me.m01.d06:meDA.commemoration.first_short	
ltx/en_uk_lash/me.m01.d06:meDA.commemoration.first_title	
ltx/en_uk_lash/me.m01.d06:meDA.commemoration.full	
ltx/en_uk_lash/me.m01.d06:meDA.commemoration.second_name	
ltx/en_uk_lash/me.m01.d06:meDA.commemoration.second_title	
ltx/en_uk_lash/me.m01.d06:meDA.date	
ltx/en_uk_lash/me.m01.d06:meDA.dismissal	@ltx/en_uk_lash/dismissals:dis00.epiphany
ltx/en_uk_lash/me.m01.d06:meDA.insert1	
ltx/en_uk_lash/me.m01.d06:meDA.insert2	
ltx/en_uk_lash/me.m01.d06:meDA.note	
ltx/en_uk_lash/me.m01.d06:meGW.Apolytikion.incipit	@ltx/en_uk_lash/me.m01.d06:meVE.Apolytikion1.incipit
ltx/en_uk_lash/me.m01.d06:meGW.Apolytikion.mode	@ltx/en_uk_lash/miscellanea:misc.Mode1
ltx/en_uk_lash/me.m01.d06:meGW.Apolytikion.text	@ltx/en_uk_lash/me.m01.d06:meVE.Apolytikion1.text
ltx/en_uk_lash/me.m01.d06:meGW.Idiomelon1.incipit	The voice of the Lord…
ltx/en_uk_lash/me.m01.d06:meGW.Idiomelon1.mode	@ltx/en_uk_lash/miscellanea:misc.Mode8
ltx/en_uk_lash/me.m01.d06:meGW.Idiomelon1.poet	@ltx/en_uk_lash/poets:po.SofroniouPatriarchouIerosolymon
ltx/en_uk_lash/me.m01.d06:meGW.Idiomelon1.text	The voice of the Lord upon the waters cries out, saying, ''Come all of you, receive the Spirit of wisdom, the Spirit of understanding, the Spirit of the fear of God, of Christ who has appeared''.
ltx/en_uk_lash/me.m01.d06:meGW.Idiomelon2.incipit	@ltx/en_uk_lash/me.m01.d05:meH1.Idiomelon1.incipit
ltx/en_uk_lash/me.m01.d06:meGW.Idiomelon2.mode	@ltx/en_uk_lash/miscellanea:misc.Mode8
ltx/en_uk_lash/me.m01.d06:meGW.Idiomelon2.poet	@ltx/en_uk_lash/poets:po.SofroniouPatriarchouIerosolymon
ltx/en_uk_lash/me.m01.d06:meGW.Idiomelon2.text	@ltx/en_uk_lash/me.m01.d05:meH1.Idiomelon1.text
ltx/en_uk_lash/me.m01.d06:meGW.Idiomelon3.incipit	@ltx/en_uk_lash/me.m01.d05:meH1.Idiomelon2.incipit
ltx/en_uk_lash/me.m01.d06:meGW.Idiomelon3.mode	@ltx/en_uk_lash/miscellanea:misc.Mode8
ltx/en_uk_lash/me.m01.d06:meGW.Idiomelon3.poet	@ltx/en_uk_lash/poets:po.SofroniouPatriarchouIerosolymon
ltx/en_uk_lash/me.m01.d06:meGW.Idiomelon3.text	@ltx/en_uk_lash/me.m01.d05:meH1.Idiomelon2.text
ltx/en_uk_lash/me.m01.d06:meGW.Idiomelon4.incipit	@ltx/en_uk_lash/me.m01.d12:meVE.AposGlory.incipit
ltx/en_uk_lash/me.m01.d06:meGW.Idiomelon4.mode	@ltx/en_uk_lash/miscellanea:misc.Mode6
ltx/en_uk_lash/me.m01.d06:meGW.Idiomelon4.text	@ltx/en_uk_lash/me.m01.d12:meVE.AposGlory.text
ltx/en_uk_lash/me.m01.d06:meGW.IdiomelonGlory.incipit	@ltx/en_uk_lash/me.m01.d05:meH1.Idiomelon3.incipit
ltx/en_uk_lash/me.m01.d06:meGW.IdiomelonGlory.mode	@ltx/en_uk_lash/miscellanea:misc.Mode8
ltx/en_uk_lash/me.m01.d06:meGW.IdiomelonGlory.poet	@ltx/en_uk_lash/poets:po.SofroniouPatriarchouIerosolymon
ltx/en_uk_lash/me.m01.d06:meGW.IdiomelonGlory.text	@ltx/en_uk_lash/me.m01.d05:meH1.Idiomelon3.text
ltx/en_uk_lash/me.m01.d06:meGW.Prayer1.text	Lord Jesus Christ, only-begotten Son, who are in the bosom of the Father, true God, source of life and immortality, Light from Light, who came into the world to enlighten it, flood our mind with light by your Holy Spirit and accept us as we bring you praise and thanksgiving for your wondrous mighty works from every age, and for your saving dispensation in these last times. By it you clothe yourself in our weak and beggared matter and coming down to the measure of our servitude, King of all, you accepted also to be baptised in the Jordan by the hand of a servant, so that, having sanctified the nature of the waters, you, the sinless one, might make a way for our rebirth through water and Spirit and re-establish us in our original freedom. As we celebrate the memory of this divine Mystery, we entreat you, Master, lover of mankind: Sprinkle on us, your unworthy servants, cleansing water, in accordance with your divine promise, the gift of your compassion, that the request of us sinners over this water may become acceptable by your goodness and that through it your blessing to be granted to us and to all your faithful people, to the glory of your holy, venerated Name. For to you belong all glory, honour and worship, with your Father who is without beginning, with you all-holy, good and life-giving Spirit, now and forever, and to the ages of ages. Amen.
ltx/en_uk_lash/me.m01.d06:meGW.Prayer2.poet	@ltx/en_uk_lash/poets:po.SofroniouPatriarchouIerosolymon
ltx/en_uk_lash/me.m01.d06:meGW.Prayer2.text	Trinity beyond all being, beyond all goodness, beyond all godhead, all-powerful, all-vigilant, invisible, incomprehensible; Creator of the spiritual beings and rational natures, innate goodness, unapproachable Light that enlightens everyone coming into the world, shine also in me your unworthy servant. Enlighten the eyes of my mind that I may dare to sing the praise of your measureless benevolence and power. May my supplication for the people here present be acceptable, so that my offences may not prevent the Holy Spirit from being present here; but permit me now without condemnation to cry out to you and say, Master, lover of mankind, beyond all goodness, Almighty, eternal King. We glorify you, the Creator and Fashioner of the universe. We glorify you, only-begotten Son of God, without father from your Mother, without mother from your Father. For in the preceding feast we saw you as a babe, but in the present one we see you full and perfect man, our God, made manifest as perfect God from perfect God. For today the moment of the feast is here for us and the choir of saints assembles here with us, and Angels keep festival with mortals. Today the grace of the Holy Spirit in the form of a dove dwelt upon the waters. Today the Sun that never sets has dawned and the world is made radiant with the light of the Lord. Today the Moon with its radiant beams sheds light on the world. Today the stars formed of light make the inhabited world lovely with the brightness of their splendour. Today the clouds rain down from heaven the shower of justice for mankind. Today the Uncreated by his own will accepts the laying on of hands by his own creature. Today the Prophet and Forerunner draws near, but stands by with fear seeing God''s condescension towards us. Today the streams of Jordan are changed into healing by the presence of the Lord. Today all creation is watered by mystical streams. Today the failings of mankind are being washed away by the waters of Jordan. Today Paradise is opened for mortals and the Sun of justice shines down on us. Today the bitter water as once for Moses'' people is changed to sweetness by the presence of the Lord. Today we have been delivered from the ancient grief, and saved as the new Israel. Today we have been redeemed from darkness and are filled with radiance by the light of the knowledge of God. Today the gloomy fog of the world is cleansed by the manifestation of our God. Today all creation shines with light from on high. Today error has been destroyed and the coming of the Master makes for us a way of salvation. Today things on high keep festival with those below, and those below commune with those on high. Today the sacred and triumphant festal assembly of the Orthodox exults. Today the Master hastens towards baptism, that he may lead humanity to the heights. Today the One who does not bow bows down to his own servant, that he may free us from servitude. Today we have purchased the Kingdom of heaven, for the Kingdom of the Lord will have no end. Today earth and sea share the joy of the world, and the world has been filled with gladness. The waters saw you, O God, the waters saw you and were afraid. The Jordan turned back when it saw the fire of the godhead descending in bodily form and entering it. The Jordan turned back as it contemplated the Holy Spirit in the form of a dove, descending and flying about you. The Jordan turned back as it saw the Invisible made visible, the Creator made flesh, the Master in the form of a servant. The Jordan turned back and the mountains leapt as they saw God in the flesh, and the clouds uttered their voice, marvelling at what had come to pass, seeing Light from Light, true God from true God, the Master''s festival today in Jordan; seeing him drowning the death from disobedience, the goad of error and the bond of Hell in Jordan and granting the Baptism of salvation to the world. Therefore I too, a sinner and your unworthy servant, recount the greatness of your wonders and, seized with fear, in compunction cry out to you:
ltx/en_uk_lash/me.m01.d06:meGW.Prayer31.text	Great are you, O Lord, and wonderful your works, and no word is adequate to sing the praise of your wonders.
ltx/en_uk_lash/me.m01.d06:meGW.Prayer32.text	For by your own will you brought the universe from non-existence into being, you hold creation together by your might, and by your providence you direct the world. You composed creation from four elements; with four seasons you crowned the circle of the year. All the spiritual Powers tremble before you. The sun sings your praise, the moon glorifies you, the stars entreat you, the light obeys you, the deeps tremble before you, the springs are your servants. You stretched out the heavens on the waters; you walled in the sea with sand; you poured out the air for breathing. Angelic Powers minister to you. The choirs of the Archangels worship you. The many-eyed Cherubim and the six-winged Seraphim as they stand and fly around you hide their faces in fear of your unapproachable glory. For you, being God uncircumscribed, without beginning and inexpressible, came upon earth, taking the form of a servant, being found in the likeness of mortals. For you could not bear, Master, in the compassion of your mercy to watch the human race being tyrannised by the devil, but you came and saved us. We acknowledge your grace, we proclaim your mercy, we do not conceal your benevolence. You freed the generations of our race. You sanctified a virgin womb by your birth. All creation sang your praise when you appeared. For you are our God who appeared on earth and lived among mortals. You sanctified the streams of Jordan by sending down from heaven your All-holy Spirit and you smashed the heads of the dragons that lurked there.
ltx/en_uk_lash/me.m01.d06:meGW.Prayer33.text	Therefore, O King, lover of mankind, be present now too through the visitation of your Holy Spirit, and sanctify this water.
ltx/en_uk_lash/me.m01.d06:meGW.Prayer34.text	And give to it the grace of redemption and the blessing of Jordan. Make it a source of incorruption, a gift of sanctification, a deliverance from sins, an averting of diseases, unapproachable by hostile powers, filled with angelic strength. That all who draw from it and partake of it may have it for cleansing of souls and bodies, for healing of passions, for sanctification of homes, for every suitable purpose. For you are our God, who through water and Spirit renewed our nature made old by sin. You are our God, who in the days of Noë drowned sin through the water of the flood. You are our God, who through Moses freed the Hebrew race from the slavery of Pharao through the sea. You are our God who split open the rock in the desert, and waters rushed out and torrents flooded down, and you satisfied your thirsty people. You are our God, who through Elias turned Israel from the error of Baal.
ltx/en_uk_lash/me.m01.d06:meGW.Prayer35.text	And now, Master, do you yourself sanctify this water by your Holy Spirit.
ltx/en_uk_lash/me.m01.d06:meGW.Prayer36.text	Give to all who partake of it sanctification, blessing, cleansing, health.
ltx/en_uk_lash/me.m01.d06:meGW.Prayer37.text	And save, Lord, our faithful Rulers.
ltx/en_uk_lash/me.m01.d06:meGW.Prayer38.text	And guard them under your protection in peace. Subdue beneath their feet every foe and enemy. Grant them all their requests that are for salvation and eternal life. Remember, Lord, our Archbishop N., the whole order of Presbyters, the Diaconate in Christ, every rank of the clergy, the people here present and our brethren who with good reason are absent, and have mercy on us in accordance with your great mercy. So that through elements and through Angels and through mortals and through things visible and through things unseen, your all-holy name may be glorified with the Father and the Holy Spirit, now and for ever, and to the ages of ages.
ltx/en_uk_lash/me.m01.d06:meGW.Prayer4.text	Incline your ear and hear us, Lord, who accepted to be baptised in Jordan and to sanctify the waters, and bless us all, who signify our calling as servants by the bending of our necks. And count us worthy to be filled with your sanctification through the partaking and sprinkling of this water. And let it be for us, Lord, for healing of soul and body.
ltx/en_uk_lash/me.m01.d06:meGW.Prayer5.text	For you are the sanctification of our souls and bodies, and to you we give glory, thanksgiving and worship, with your Father who is without beginning, and your All-holy, good and life-giving Spirit, now and for ever, and to the ages of ages.
ltx/en_uk_lash/me.m01.d06:meGW.R01	The Priest reads the following prayer in a low voice.
ltx/en_uk_lash/me.m01.d06:meGW.R02	And having said the Amen to himself, when the Deacon has finished the Litany, the Priest begins this Prayer in a loud voice:
ltx/en_uk_lash/me.m01.d06:meGW.R03	After completing this, he says in a more powerful voice,
ltx/en_uk_lash/me.m01.d06:meGW.R04	And the Priest says the Prayer in a low voice.
ltx/en_uk_lash/me.m01.d06:meGW.R05	Aloud
ltx/en_uk_lash/me.m01.d06:meGW.R06	And the Priest immediately, blessing the waters in the figure of the Cross, immerses the precious Cross, plunging it upright into the water and lifting it out again, chanting the following Troparion. The Priest once and the Choirs once each.
ltx/en_uk_lash/me.m01.d06:meGW.R071	And he sprinkles all the People with the water.
ltx/en_uk_lash/me.m01.d06:meGW.R072	On January 5.
ltx/en_uk_lash/me.m01.d06:meGW.R073	On January 6.
ltx/en_uk_lash/me.m01.d06:meGW.R08	As we enter the Church we chant the following Idiomelon.
ltx/en_uk_lash/me.m01.d06:meGW.R09	Then the dismissal and the distribution of the Antidoron.
ltx/en_uk_lash/me.m01.d06:meGW.title	The Great Blessing of the Waters
ltx/en_uk_lash/me.m01.d06:meGW.translator	Prayers translated by Archimandrite Ephrem Lash
ltx/en_uk_lash/me.m01.d06:meHO.commemorations	
ltx/en_uk_lash/me.m01.d06:meHO.note1	@ltx/en_uk_lash/rubrical:ru.HolidayAll
ltx/en_uk_lash/me.m01.d06:meHO.note2	
ltx/en_uk_lash/me.m01.d06:meHO.number	
ltx/en_uk_lash/me.m01.d06:meHO.rank	
ltx/en_uk_lash/me.m01.d06:meLE.commemoration1	
ltx/en_uk_lash/me.m01.d06:meLE.commemoration2	
ltx/en_uk_lash/me.m01.d06:meLI.Kontakion1.greekmelody	@ltx/en_uk_lash/me.m01.d06:meMA.Kontakion1.greekmelody
ltx/en_uk_lash/me.m01.d06:meLI.Kontakion1.incipit	@ltx/en_uk_lash/me.m01.d06:meMA.Kontakion1.incipit
ltx/en_uk_lash/me.m01.d06:meLI.Kontakion1.melody	@ltx/en_uk_lash/me.m01.d06:meMA.Kontakion1.melody
ltx/en_uk_lash/me.m01.d06:meLI.Kontakion1.mode	@ltx/en_uk_lash/me.m01.d06:meMA.Kontakion1.mode
ltx/en_uk_lash/me.m01.d06:meLI.Kontakion1.text	@ltx/en_uk_lash/me.m01.d06:meMA.Kontakion1.text
ltx/en_uk_lash/me.m01.d06:meLI.MM.CommunionHymn.text	
ltx/en_uk_lash/me.m01.d06:meLI.MM.EntranceHymn.text	
ltx/en_uk_lash/me.m01.d06:meLI.Megalynarion.text	
ltx/en_uk_lash/me.m01.d06:meLI.R01	
ltx/en_uk_lash/me.m01.d06:meLI.TheotokosHymn.incipit	@ltx/en_uk_lash/me.m01.d06:meMA.Ode9C1H.incipit
ltx/en_uk_lash/me.m01.d06:meLI.TheotokosHymn.mode	@ltx/en_uk_lash/miscellanea:misc.Mode2
ltx/en_uk_lash/me.m01.d06:meLI.TheotokosHymn.text	@ltx/en_uk_lash/me.m01.d06:meMA.Ode9C1H.text
ltx/en_uk_lash/me.m01.d06:meLI.TheotokosHymnVerse.incipit	@ltx/en_uk_lash/me.m01.d06:meMA.Ode9C1M01.incipit
ltx/en_uk_lash/me.m01.d06:meLI.TheotokosHymnVerse.text	@ltx/en_uk_lash/me.m01.d06:meMA.Ode9C1M01.text
ltx/en_uk_lash/me.m01.d06:meMA.C1.acrostic.notice1	
ltx/en_uk_lash/me.m01.d06:meMA.C1.acrostic.text	
ltx/en_uk_lash/me.m01.d06:meMA.C1.acrostic.title	
ltx/en_uk_lash/me.m01.d06:meMA.C1.poet	@ltx/en_uk_lash/poets:po.Kosma
ltx/en_uk_lash/me.m01.d06:meMA.C1.title	@ltx/en_uk_lash/titles:ti.Canon1Feast
ltx/en_uk_lash/me.m01.d06:meMA.C1.verse	@ltx/en_uk_lash/prayers:pr.verse_God.text
ltx/en_uk_lash/me.m01.d06:meMA.C2.acrostic.line1.text	
ltx/en_uk_lash/me.m01.d06:meMA.C2.acrostic.line2.text	
ltx/en_uk_lash/me.m01.d06:meMA.C2.acrostic.line3.text	
ltx/en_uk_lash/me.m01.d06:meMA.C2.acrostic.line4.text	
ltx/en_uk_lash/me.m01.d06:meMA.C2.acrostic.notice1	
ltx/en_uk_lash/me.m01.d06:meMA.C2.acrostic.text	
ltx/en_uk_lash/me.m01.d06:meMA.C2.acrostic.title	
ltx/en_uk_lash/me.m01.d06:meMA.C2.poet	@ltx/en_uk_lash/poets:po.IoannouTouDamaskinou
ltx/en_uk_lash/me.m01.d06:meMA.C2.title	@ltx/en_uk_lash/titles:ti.IambicCanon
ltx/en_uk_lash/me.m01.d06:meMA.C2.verse	@ltx/en_uk_lash/prayers:pr.verse_God.text
ltx/en_uk_lash/me.m01.d06:meMA.Exaposteilarion1.greekmelody	@ltx/en_uk_lash/he.a.m3:heAU.EpefaniOSotir.greekname
ltx/en_uk_lash/me.m01.d06:meMA.Exaposteilarion1.incipit	@ltx/en_uk_lash/he.a.m3:heAU.EpefaniOSotir.incipit
ltx/en_uk_lash/me.m01.d06:meMA.Exaposteilarion1.melody	@ltx/en_uk_lash/he.a.m3:heAU.EpefaniOSotir.melody
ltx/en_uk_lash/me.m01.d06:meMA.Exaposteilarion1.mode	@ltx/en_uk_lash/miscellanea:misc.Mode3
ltx/en_uk_lash/me.m01.d06:meMA.Exaposteilarion1.poet	
ltx/en_uk_lash/me.m01.d06:meMA.Exaposteilarion1.text	@ltx/en_uk_lash/he.a.m3:heAU.EpefaniOSotir.text
ltx/en_uk_lash/me.m01.d06:meMA.Hypakoe.incipit	…
ltx/en_uk_lash/me.m01.d06:meMA.Hypakoe.melody	
ltx/en_uk_lash/me.m01.d06:meMA.Hypakoe.mode	@ltx/en_uk_lash/miscellanea:misc.Mode5
ltx/en_uk_lash/me.m01.d06:meMA.Hypakoe.text	
ltx/en_uk_lash/me.m01.d06:meMA.Kathisma11.greekmelody	@ltx/en_uk_lash/he.a.m3:heAU.TinOraiotita.greekname
ltx/en_uk_lash/me.m01.d06:meMA.Kathisma11.incipit	…
ltx/en_uk_lash/me.m01.d06:meMA.Kathisma11.melody	@ltx/en_uk_lash/he.a.m3:heAU.TinOraiotita.notmetered
ltx/en_uk_lash/me.m01.d06:meMA.Kathisma11.mode	@ltx/en_uk_lash/miscellanea:misc.Mode3
ltx/en_uk_lash/me.m01.d06:meMA.Kathisma11.text	
ltx/en_uk_lash/me.m01.d06:meMA.Kathisma21.greekmelody	@ltx/en_uk_lash/he.a.m4:heAU.KateplagiIosif.greekname
ltx/en_uk_lash/me.m01.d06:meMA.Kathisma21.incipit	…
ltx/en_uk_lash/me.m01.d06:meMA.Kathisma21.melody	@ltx/en_uk_lash/he.a.m4:heAU.KateplagiIosif.notmetered
ltx/en_uk_lash/me.m01.d06:meMA.Kathisma21.mode	@ltx/en_uk_lash/miscellanea:misc.Mode4
ltx/en_uk_lash/me.m01.d06:meMA.Kathisma21.text	
ltx/en_uk_lash/me.m01.d06:meMA.Kathisma31.greekmelody	@ltx/en_uk_lash/he.a.m4:heAU.TachyProkatalave.greekname
ltx/en_uk_lash/me.m01.d06:meMA.Kathisma31.incipit	…
ltx/en_uk_lash/me.m01.d06:meMA.Kathisma31.melody	@ltx/en_uk_lash/he.a.m4:heAU.TachyProkatalave.notmetered
ltx/en_uk_lash/me.m01.d06:meMA.Kathisma31.mode	@ltx/en_uk_lash/miscellanea:misc.Mode4
ltx/en_uk_lash/me.m01.d06:meMA.Kathisma31.text	
ltx/en_uk_lash/me.m01.d06:meMA.Kontakion1.greekmelody	@ltx/en_uk_lash/he.a.m4:heAU.EpefanisSimeron.greekname
ltx/en_uk_lash/me.m01.d06:meMA.Kontakion1.incipit	@ltx/en_uk_lash/he.a.m4:heAU.EpefanisSimeron.incipit
ltx/en_uk_lash/me.m01.d06:meMA.Kontakion1.melody	@ltx/en_uk_lash/he.a.m4:heAU.EpefanisSimeron.melody
ltx/en_uk_lash/me.m01.d06:meMA.Kontakion1.mode	@ltx/en_uk_lash/miscellanea:misc.Mode4
ltx/en_uk_lash/me.m01.d06:meMA.Kontakion1.poet	@ltx/en_uk_lash/poets:po.RomanouTouMelodou
ltx/en_uk_lash/me.m01.d06:meMA.Kontakion1.text	@ltx/en_uk_lash/he.a.m4:heAU.EpefanisSimeron.text
ltx/en_uk_lash/me.m01.d06:meMA.Lauds1.incipit	…
ltx/en_uk_lash/me.m01.d06:meMA.Lauds1.melody	@ltx/en_uk_lash/miscellanea:misc.Idiomelon
ltx/en_uk_lash/me.m01.d06:meMA.Lauds1.mode	@ltx/en_uk_lash/miscellanea:misc.Mode1
ltx/en_uk_lash/me.m01.d06:meMA.Lauds1.poet	@ltx/en_uk_lash/poets:po.GermanouPatriarchou
ltx/en_uk_lash/me.m01.d06:meMA.Lauds1.text	
ltx/en_uk_lash/me.m01.d06:meMA.Lauds2.incipit	…
ltx/en_uk_lash/me.m01.d06:meMA.Lauds2.melody	@ltx/en_uk_lash/miscellanea:misc.Idiomelon
ltx/en_uk_lash/me.m01.d06:meMA.Lauds2.mode	@ltx/en_uk_lash/miscellanea:misc.Mode1
ltx/en_uk_lash/me.m01.d06:meMA.Lauds2.text	
ltx/en_uk_lash/me.m01.d06:meMA.Lauds3.incipit	…
ltx/en_uk_lash/me.m01.d06:meMA.Lauds3.melody	@ltx/en_uk_lash/miscellanea:misc.Idiomelon
ltx/en_uk_lash/me.m01.d06:meMA.Lauds3.mode	@ltx/en_uk_lash/miscellanea:misc.Mode1
ltx/en_uk_lash/me.m01.d06:meMA.Lauds3.text	
ltx/en_uk_lash/me.m01.d06:meMA.Lauds4.incipit	…
ltx/en_uk_lash/me.m01.d06:meMA.Lauds4.melody	@ltx/en_uk_lash/miscellanea:misc.Idiomelon
ltx/en_uk_lash/me.m01.d06:meMA.Lauds4.mode	@ltx/en_uk_lash/miscellanea:misc.Mode1
ltx/en_uk_lash/me.m01.d06:meMA.Lauds4.text	
ltx/en_uk_lash/me.m01.d06:meMA.Lauds5.incipit	…
ltx/en_uk_lash/me.m01.d06:meMA.Lauds5.melody	@ltx/en_uk_lash/miscellanea:misc.Idiomelon
ltx/en_uk_lash/me.m01.d06:meMA.Lauds5.mode	@ltx/en_uk_lash/miscellanea:misc.Mode1
ltx/en_uk_lash/me.m01.d06:meMA.Lauds5.poet	@ltx/en_uk_lash/poets:po.AndreouIerosolymitou
ltx/en_uk_lash/me.m01.d06:meMA.Lauds5.text	
ltx/en_uk_lash/me.m01.d06:meMA.LaudsBoth.incipit	…
ltx/en_uk_lash/me.m01.d06:meMA.LaudsBoth.melody	@ltx/en_uk_lash/miscellanea:misc.Idiomelon
ltx/en_uk_lash/me.m01.d06:meMA.LaudsBoth.mode	@ltx/en_uk_lash/miscellanea:misc.Mode2
ltx/en_uk_lash/me.m01.d06:meMA.LaudsBoth.poet	@ltx/en_uk_lash/poets:po.Anatoliou
ltx/en_uk_lash/me.m01.d06:meMA.LaudsBoth.text	
ltx/en_uk_lash/me.m01.d06:meMA.LaudsGlory.incipit	…
ltx/en_uk_lash/me.m01.d06:meMA.LaudsGlory.melody	@ltx/en_uk_lash/miscellanea:misc.Idiomelon
ltx/en_uk_lash/me.m01.d06:meMA.LaudsGlory.mode	@ltx/en_uk_lash/miscellanea:misc.Mode6
ltx/en_uk_lash/me.m01.d06:meMA.LaudsGlory.poet	@ltx/en_uk_lash/poets:po.Anatoliou
ltx/en_uk_lash/me.m01.d06:meMA.LaudsGlory.text	
ltx/en_uk_lash/me.m01.d06:meMA.MM.Lauds1234as5678.text	@ltx/en_uk_lash/properties:media.key
ltx/en_uk_lash/me.m01.d06:meMA.Ode1C11.greekmelody	@ltx/en_uk_lash/he.h.m2:heHE.VythouAnekalypse.greekname
ltx/en_uk_lash/me.m01.d06:meMA.Ode1C11.incipit	…
ltx/en_uk_lash/me.m01.d06:meMA.Ode1C11.melody	@ltx/en_uk_lash/he.h.m2:heHE.VythouAnekalypse.name
ltx/en_uk_lash/me.m01.d06:meMA.Ode1C11.mode	@ltx/en_uk_lash/miscellanea:misc.Mode2
ltx/en_uk_lash/me.m01.d06:meMA.Ode1C11.ode	@ltx/en_uk_lash/miscellanea:misc.Ode1
ltx/en_uk_lash/me.m01.d06:meMA.Ode1C11.text	
ltx/en_uk_lash/me.m01.d06:meMA.Ode1C12.incipit	…
ltx/en_uk_lash/me.m01.d06:meMA.Ode1C12.melody	@ltx/en_uk_lash/he.h.m2:heHE.VythouAnekalypse.name
ltx/en_uk_lash/me.m01.d06:meMA.Ode1C12.mode	@ltx/en_uk_lash/miscellanea:misc.Mode2
ltx/en_uk_lash/me.m01.d06:meMA.Ode1C12.ode	@ltx/en_uk_lash/miscellanea:misc.Ode1
ltx/en_uk_lash/me.m01.d06:meMA.Ode1C12.text	
ltx/en_uk_lash/me.m01.d06:meMA.Ode1C13.incipit	…
ltx/en_uk_lash/me.m01.d06:meMA.Ode1C13.melody	@ltx/en_uk_lash/he.h.m2:heHE.VythouAnekalypse.name
ltx/en_uk_lash/me.m01.d06:meMA.Ode1C13.mode	@ltx/en_uk_lash/miscellanea:misc.Mode2
ltx/en_uk_lash/me.m01.d06:meMA.Ode1C13.ode	@ltx/en_uk_lash/miscellanea:misc.Ode1
ltx/en_uk_lash/me.m01.d06:meMA.Ode1C13.text	
ltx/en_uk_lash/me.m01.d06:meMA.Ode1C1H.greekmelody	@ltx/en_uk_lash/he.h.m2:heHE.VythouAnekalypse.greekname
ltx/en_uk_lash/me.m01.d06:meMA.Ode1C1H.incipit	@ltx/en_uk_lash/he.h.m2:heHE.VythouAnekalypse.incipit
ltx/en_uk_lash/me.m01.d06:meMA.Ode1C1H.melody	@ltx/en_uk_lash/he.h.m2:heHE.VythouAnekalypse.melody
ltx/en_uk_lash/me.m01.d06:meMA.Ode1C1H.mode	@ltx/en_uk_lash/miscellanea:misc.Mode2
ltx/en_uk_lash/me.m01.d06:meMA.Ode1C1H.ode	@ltx/en_uk_lash/miscellanea:misc.Ode1
ltx/en_uk_lash/me.m01.d06:meMA.Ode1C1H.text	@ltx/en_uk_lash/he.h.m2:heHE.VythouAnekalypse.text
ltx/en_uk_lash/me.m01.d06:meMA.Ode1C21.greekmelody	@ltx/en_uk_lash/he.h.m2:heHE.SteiveiThalassis.greekname
ltx/en_uk_lash/me.m01.d06:meMA.Ode1C21.incipit	…
ltx/en_uk_lash/me.m01.d06:meMA.Ode1C21.melody	@ltx/en_uk_lash/he.h.m2:heHE.SteiveiThalassis.name
ltx/en_uk_lash/me.m01.d06:meMA.Ode1C21.mode	@ltx/en_uk_lash/miscellanea:misc.Mode2
ltx/en_uk_lash/me.m01.d06:meMA.Ode1C21.ode	@ltx/en_uk_lash/miscellanea:misc.Ode1
ltx/en_uk_lash/me.m01.d06:meMA.Ode1C21.text	
ltx/en_uk_lash/me.m01.d06:meMA.Ode1C211.text	
ltx/en_uk_lash/me.m01.d06:meMA.Ode1C212.text	
ltx/en_uk_lash/me.m01.d06:meMA.Ode1C213.text	
ltx/en_uk_lash/me.m01.d06:meMA.Ode1C214.text	
ltx/en_uk_lash/me.m01.d06:meMA.Ode1C215.text	
ltx/en_uk_lash/me.m01.d06:meMA.Ode1C22.incipit	…
ltx/en_uk_lash/me.m01.d06:meMA.Ode1C22.melody	@ltx/en_uk_lash/he.h.m2:heHE.SteiveiThalassis.name
ltx/en_uk_lash/me.m01.d06:meMA.Ode1C22.mode	@ltx/en_uk_lash/miscellanea:misc.Mode2
ltx/en_uk_lash/me.m01.d06:meMA.Ode1C22.ode	@ltx/en_uk_lash/miscellanea:misc.Ode1
ltx/en_uk_lash/me.m01.d06:meMA.Ode1C22.text	
ltx/en_uk_lash/me.m01.d06:meMA.Ode1C221.text	
ltx/en_uk_lash/me.m01.d06:meMA.Ode1C222.text	
ltx/en_uk_lash/me.m01.d06:meMA.Ode1C223.text	
ltx/en_uk_lash/me.m01.d06:meMA.Ode1C224.text	
ltx/en_uk_lash/me.m01.d06:meMA.Ode1C225.text	
ltx/en_uk_lash/me.m01.d06:meMA.Ode1C2H.greekmelody	@ltx/en_uk_lash/he.h.m2:heHE.SteiveiThalassis.greekname
ltx/en_uk_lash/me.m01.d06:meMA.Ode1C2H.incipit	@ltx/en_uk_lash/he.h.m2:heHE.SteiveiThalassis.incipit
ltx/en_uk_lash/me.m01.d06:meMA.Ode1C2H.melody	@ltx/en_uk_lash/he.h.m2:heHE.SteiveiThalassis.melody
ltx/en_uk_lash/me.m01.d06:meMA.Ode1C2H.mode	@ltx/en_uk_lash/miscellanea:misc.Mode2
ltx/en_uk_lash/me.m01.d06:meMA.Ode1C2H.ode	@ltx/en_uk_lash/miscellanea:misc.Ode1
ltx/en_uk_lash/me.m01.d06:meMA.Ode1C2H.text	@ltx/en_uk_lash/he.h.m2:heHE.SteiveiThalassis.text
ltx/en_uk_lash/me.m01.d06:meMA.Ode1C2H1.text	@ltx/en_uk_lash/he.h.m2:heHE.SteiveiThalassis1.text
ltx/en_uk_lash/me.m01.d06:meMA.Ode1C2H2.text	@ltx/en_uk_lash/he.h.m2:heHE.SteiveiThalassis2.text
ltx/en_uk_lash/me.m01.d06:meMA.Ode1C2H3.text	@ltx/en_uk_lash/he.h.m2:heHE.SteiveiThalassis3.text
ltx/en_uk_lash/me.m01.d06:meMA.Ode1C2H4.text	@ltx/en_uk_lash/he.h.m2:heHE.SteiveiThalassis4.text
ltx/en_uk_lash/me.m01.d06:meMA.Ode1C2H5.text	@ltx/en_uk_lash/he.h.m2:heHE.SteiveiThalassis5.text
ltx/en_uk_lash/me.m01.d06:meMA.Ode3C11.greekmelody	@ltx/en_uk_lash/he.h.m2:heHE.IschynODidous.greekname
ltx/en_uk_lash/me.m01.d06:meMA.Ode3C11.incipit	…
ltx/en_uk_lash/me.m01.d06:meMA.Ode3C11.melody	@ltx/en_uk_lash/he.h.m2:heHE.IschynODidous.name
ltx/en_uk_lash/me.m01.d06:meMA.Ode3C11.mode	@ltx/en_uk_lash/miscellanea:misc.Mode2
ltx/en_uk_lash/me.m01.d06:meMA.Ode3C11.ode	@ltx/en_uk_lash/miscellanea:misc.Ode3
ltx/en_uk_lash/me.m01.d06:meMA.Ode3C11.text	
ltx/en_uk_lash/me.m01.d06:meMA.Ode3C12.incipit	…
ltx/en_uk_lash/me.m01.d06:meMA.Ode3C12.melody	@ltx/en_uk_lash/he.h.m2:heHE.IschynODidous.name
ltx/en_uk_lash/me.m01.d06:meMA.Ode3C12.mode	@ltx/en_uk_lash/miscellanea:misc.Mode2
ltx/en_uk_lash/me.m01.d06:meMA.Ode3C12.ode	@ltx/en_uk_lash/miscellanea:misc.Ode3
ltx/en_uk_lash/me.m01.d06:meMA.Ode3C12.text	
ltx/en_uk_lash/me.m01.d06:meMA.Ode3C1H.greekmelody	@ltx/en_uk_lash/he.h.m2:heHE.IschynODidous.greekname
ltx/en_uk_lash/me.m01.d06:meMA.Ode3C1H.incipit	@ltx/en_uk_lash/he.h.m2:heHE.IschynODidous.incipit
ltx/en_uk_lash/me.m01.d06:meMA.Ode3C1H.melody	@ltx/en_uk_lash/he.h.m2:heHE.IschynODidous.melody
ltx/en_uk_lash/me.m01.d06:meMA.Ode3C1H.mode	@ltx/en_uk_lash/miscellanea:misc.Mode2
ltx/en_uk_lash/me.m01.d06:meMA.Ode3C1H.ode	@ltx/en_uk_lash/miscellanea:misc.Ode3
ltx/en_uk_lash/me.m01.d06:meMA.Ode3C1H.text	@ltx/en_uk_lash/he.h.m2:heHE.IschynODidous.text
ltx/en_uk_lash/me.m01.d06:meMA.Ode3C21.greekmelody	@ltx/en_uk_lash/he.h.m2:heHE.OsoiPalaion.greekname
ltx/en_uk_lash/me.m01.d06:meMA.Ode3C21.incipit	…
ltx/en_uk_lash/me.m01.d06:meMA.Ode3C21.melody	@ltx/en_uk_lash/he.h.m2:heHE.OsoiPalaion.name
ltx/en_uk_lash/me.m01.d06:meMA.Ode3C21.mode	@ltx/en_uk_lash/miscellanea:misc.Mode2
ltx/en_uk_lash/me.m01.d06:meMA.Ode3C21.ode	@ltx/en_uk_lash/miscellanea:misc.Ode3
ltx/en_uk_lash/me.m01.d06:meMA.Ode3C21.text	
ltx/en_uk_lash/me.m01.d06:meMA.Ode3C211.text	
ltx/en_uk_lash/me.m01.d06:meMA.Ode3C212.text	
ltx/en_uk_lash/me.m01.d06:meMA.Ode3C213.text	
ltx/en_uk_lash/me.m01.d06:meMA.Ode3C214.text	
ltx/en_uk_lash/me.m01.d06:meMA.Ode3C215.text	
ltx/en_uk_lash/me.m01.d06:meMA.Ode3C22.incipit	…
ltx/en_uk_lash/me.m01.d06:meMA.Ode3C22.melody	@ltx/en_uk_lash/he.h.m2:heHE.OsoiPalaion.name
ltx/en_uk_lash/me.m01.d06:meMA.Ode3C22.mode	@ltx/en_uk_lash/miscellanea:misc.Mode2
ltx/en_uk_lash/me.m01.d06:meMA.Ode3C22.ode	@ltx/en_uk_lash/miscellanea:misc.Ode3
ltx/en_uk_lash/me.m01.d06:meMA.Ode3C22.text	
ltx/en_uk_lash/me.m01.d06:meMA.Ode3C221.text	
ltx/en_uk_lash/me.m01.d06:meMA.Ode3C222.text	
ltx/en_uk_lash/me.m01.d06:meMA.Ode3C223.text	
ltx/en_uk_lash/me.m01.d06:meMA.Ode3C224.text	
ltx/en_uk_lash/me.m01.d06:meMA.Ode3C225.text	
ltx/en_uk_lash/me.m01.d06:meMA.Ode3C2H.greekmelody	@ltx/en_uk_lash/he.h.m2:heHE.OsoiPalaion.greekname
ltx/en_uk_lash/me.m01.d06:meMA.Ode3C2H.incipit	@ltx/en_uk_lash/he.h.m2:heHE.OsoiPalaion.incipit
ltx/en_uk_lash/me.m01.d06:meMA.Ode3C2H.melody	@ltx/en_uk_lash/he.h.m2:heHE.OsoiPalaion.melody
ltx/en_uk_lash/me.m01.d06:meMA.Ode3C2H.mode	@ltx/en_uk_lash/miscellanea:misc.Mode2
ltx/en_uk_lash/me.m01.d06:meMA.Ode3C2H.ode	@ltx/en_uk_lash/miscellanea:misc.Ode3
ltx/en_uk_lash/me.m01.d06:meMA.Ode3C2H.text	@ltx/en_uk_lash/he.h.m2:heHE.OsoiPalaion.text
ltx/en_uk_lash/me.m01.d06:meMA.Ode3C2H1.text	@ltx/en_uk_lash/he.h.m2:heHE.OsoiPalaion1.text
ltx/en_uk_lash/me.m01.d06:meMA.Ode3C2H2.text	@ltx/en_uk_lash/he.h.m2:heHE.OsoiPalaion2.text
ltx/en_uk_lash/me.m01.d06:meMA.Ode3C2H3.text	@ltx/en_uk_lash/he.h.m2:heHE.OsoiPalaion3.text
ltx/en_uk_lash/me.m01.d06:meMA.Ode3C2H4.text	@ltx/en_uk_lash/he.h.m2:heHE.OsoiPalaion4.text
ltx/en_uk_lash/me.m01.d06:meMA.Ode3C2H5.text	@ltx/en_uk_lash/he.h.m2:heHE.OsoiPalaion5.text
ltx/en_uk_lash/me.m01.d06:meMA.Ode4C11.greekmelody	@ltx/en_uk_lash/he.h.m2:heHE.AkikoeKyrieFonisSou.greekname
ltx/en_uk_lash/me.m01.d06:meMA.Ode4C11.incipit	…
ltx/en_uk_lash/me.m01.d06:meMA.Ode4C11.melody	@ltx/en_uk_lash/he.h.m2:heHE.AkikoeKyrieFonisSou.name
ltx/en_uk_lash/me.m01.d06:meMA.Ode4C11.mode	@ltx/en_uk_lash/miscellanea:misc.Mode2
ltx/en_uk_lash/me.m01.d06:meMA.Ode4C11.ode	@ltx/en_uk_lash/miscellanea:misc.Ode4
ltx/en_uk_lash/me.m01.d06:meMA.Ode4C11.text	
ltx/en_uk_lash/me.m01.d06:meMA.Ode4C12.incipit	…
ltx/en_uk_lash/me.m01.d06:meMA.Ode4C12.melody	@ltx/en_uk_lash/he.h.m2:heHE.AkikoeKyrieFonisSou.name
ltx/en_uk_lash/me.m01.d06:meMA.Ode4C12.mode	@ltx/en_uk_lash/miscellanea:misc.Mode2
ltx/en_uk_lash/me.m01.d06:meMA.Ode4C12.ode	@ltx/en_uk_lash/miscellanea:misc.Ode4
ltx/en_uk_lash/me.m01.d06:meMA.Ode4C12.text	
ltx/en_uk_lash/me.m01.d06:meMA.Ode4C13.incipit	…
ltx/en_uk_lash/me.m01.d06:meMA.Ode4C13.melody	@ltx/en_uk_lash/he.h.m2:heHE.AkikoeKyrieFonisSou.name
ltx/en_uk_lash/me.m01.d06:meMA.Ode4C13.mode	@ltx/en_uk_lash/miscellanea:misc.Mode2
ltx/en_uk_lash/me.m01.d06:meMA.Ode4C13.ode	@ltx/en_uk_lash/miscellanea:misc.Ode4
ltx/en_uk_lash/me.m01.d06:meMA.Ode4C13.text	
ltx/en_uk_lash/me.m01.d06:meMA.Ode4C1H.greekmelody	@ltx/en_uk_lash/he.h.m2:heHE.AkikoeKyrieFonisSou.greekname
ltx/en_uk_lash/me.m01.d06:meMA.Ode4C1H.incipit	@ltx/en_uk_lash/he.h.m2:heHE.AkikoeKyrieFonisSou.incipit
ltx/en_uk_lash/me.m01.d06:meMA.Ode4C1H.melody	@ltx/en_uk_lash/he.h.m2:heHE.AkikoeKyrieFonisSou.melody
ltx/en_uk_lash/me.m01.d06:meMA.Ode4C1H.mode	@ltx/en_uk_lash/miscellanea:misc.Mode2
ltx/en_uk_lash/me.m01.d06:meMA.Ode4C1H.ode	@ltx/en_uk_lash/miscellanea:misc.Ode4
ltx/en_uk_lash/me.m01.d06:meMA.Ode4C1H.text	@ltx/en_uk_lash/he.h.m2:heHE.AkikoeKyrieFonisSou.text
ltx/en_uk_lash/me.m01.d06:meMA.Ode4C21.greekmelody	@ltx/en_uk_lash/he.h.m2:heHE.PyrsoKathartheis.greekname
ltx/en_uk_lash/me.m01.d06:meMA.Ode4C21.incipit	…
ltx/en_uk_lash/me.m01.d06:meMA.Ode4C21.melody	@ltx/en_uk_lash/he.h.m2:heHE.PyrsoKathartheis.name
ltx/en_uk_lash/me.m01.d06:meMA.Ode4C21.mode	@ltx/en_uk_lash/miscellanea:misc.Mode2
ltx/en_uk_lash/me.m01.d06:meMA.Ode4C21.ode	@ltx/en_uk_lash/miscellanea:misc.Ode4
ltx/en_uk_lash/me.m01.d06:meMA.Ode4C21.text	
ltx/en_uk_lash/me.m01.d06:meMA.Ode4C211.text	
ltx/en_uk_lash/me.m01.d06:meMA.Ode4C212.text	
ltx/en_uk_lash/me.m01.d06:meMA.Ode4C213.text	
ltx/en_uk_lash/me.m01.d06:meMA.Ode4C214.text	
ltx/en_uk_lash/me.m01.d06:meMA.Ode4C215.text	
ltx/en_uk_lash/me.m01.d06:meMA.Ode4C22.incipit	…
ltx/en_uk_lash/me.m01.d06:meMA.Ode4C22.melody	@ltx/en_uk_lash/he.h.m2:heHE.PyrsoKathartheis.name
ltx/en_uk_lash/me.m01.d06:meMA.Ode4C22.mode	@ltx/en_uk_lash/miscellanea:misc.Mode2
ltx/en_uk_lash/me.m01.d06:meMA.Ode4C22.ode	@ltx/en_uk_lash/miscellanea:misc.Ode4
ltx/en_uk_lash/me.m01.d06:meMA.Ode4C22.text	
ltx/en_uk_lash/me.m01.d06:meMA.Ode4C221.text	
ltx/en_uk_lash/me.m01.d06:meMA.Ode4C222.text	
ltx/en_uk_lash/me.m01.d06:meMA.Ode4C223.text	
ltx/en_uk_lash/me.m01.d06:meMA.Ode4C224.text	
ltx/en_uk_lash/me.m01.d06:meMA.Ode4C225.text	
ltx/en_uk_lash/me.m01.d06:meMA.Ode4C23.incipit	…
ltx/en_uk_lash/me.m01.d06:meMA.Ode4C23.melody	@ltx/en_uk_lash/he.h.m2:heHE.PyrsoKathartheis.name
ltx/en_uk_lash/me.m01.d06:meMA.Ode4C23.mode	@ltx/en_uk_lash/miscellanea:misc.Mode2
ltx/en_uk_lash/me.m01.d06:meMA.Ode4C23.ode	@ltx/en_uk_lash/miscellanea:misc.Ode4
ltx/en_uk_lash/me.m01.d06:meMA.Ode4C23.text	
ltx/en_uk_lash/me.m01.d06:meMA.Ode4C231.text	
ltx/en_uk_lash/me.m01.d06:meMA.Ode4C232.text	
ltx/en_uk_lash/me.m01.d06:meMA.Ode4C233.text	
ltx/en_uk_lash/me.m01.d06:meMA.Ode4C234.text	
ltx/en_uk_lash/me.m01.d06:meMA.Ode4C235.text	
ltx/en_uk_lash/me.m01.d06:meMA.Ode4C2H.greekmelody	@ltx/en_uk_lash/he.h.m2:heHE.PyrsoKathartheis.greekname
ltx/en_uk_lash/me.m01.d06:meMA.Ode4C2H.incipit	@ltx/en_uk_lash/he.h.m2:heHE.PyrsoKathartheis.incipit
ltx/en_uk_lash/me.m01.d06:meMA.Ode4C2H.melody	@ltx/en_uk_lash/he.h.m2:heHE.PyrsoKathartheis.melody
ltx/en_uk_lash/me.m01.d06:meMA.Ode4C2H.mode	@ltx/en_uk_lash/miscellanea:misc.Mode2
ltx/en_uk_lash/me.m01.d06:meMA.Ode4C2H.ode	@ltx/en_uk_lash/miscellanea:misc.Ode4
ltx/en_uk_lash/me.m01.d06:meMA.Ode4C2H.text	@ltx/en_uk_lash/he.h.m2:heHE.PyrsoKathartheis.text
ltx/en_uk_lash/me.m01.d06:meMA.Ode4C2H1.text	@ltx/en_uk_lash/he.h.m2:heHE.PyrsoKathartheis1.text
ltx/en_uk_lash/me.m01.d06:meMA.Ode4C2H2.text	@ltx/en_uk_lash/he.h.m2:heHE.PyrsoKathartheis2.text
ltx/en_uk_lash/me.m01.d06:meMA.Ode4C2H3.text	@ltx/en_uk_lash/he.h.m2:heHE.PyrsoKathartheis3.text
ltx/en_uk_lash/me.m01.d06:meMA.Ode4C2H4.text	@ltx/en_uk_lash/he.h.m2:heHE.PyrsoKathartheis4.text
ltx/en_uk_lash/me.m01.d06:meMA.Ode4C2H5.text	@ltx/en_uk_lash/he.h.m2:heHE.PyrsoKathartheis5.text
ltx/en_uk_lash/me.m01.d06:meMA.Ode5C11.greekmelody	@ltx/en_uk_lash/he.h.m2:heHE.IisousOZoisArchigos.greekname
ltx/en_uk_lash/me.m01.d06:meMA.Ode5C11.incipit	…
ltx/en_uk_lash/me.m01.d06:meMA.Ode5C11.melody	@ltx/en_uk_lash/he.h.m2:heHE.IisousOZoisArchigos.name
ltx/en_uk_lash/me.m01.d06:meMA.Ode5C11.mode	@ltx/en_uk_lash/miscellanea:misc.Mode2
ltx/en_uk_lash/me.m01.d06:meMA.Ode5C11.ode	@ltx/en_uk_lash/miscellanea:misc.Ode5
ltx/en_uk_lash/me.m01.d06:meMA.Ode5C11.text	
ltx/en_uk_lash/me.m01.d06:meMA.Ode5C12.incipit	…
ltx/en_uk_lash/me.m01.d06:meMA.Ode5C12.melody	@ltx/en_uk_lash/he.h.m2:heHE.IisousOZoisArchigos.name
ltx/en_uk_lash/me.m01.d06:meMA.Ode5C12.mode	@ltx/en_uk_lash/miscellanea:misc.Mode2
ltx/en_uk_lash/me.m01.d06:meMA.Ode5C12.ode	@ltx/en_uk_lash/miscellanea:misc.Ode5
ltx/en_uk_lash/me.m01.d06:meMA.Ode5C12.text	
ltx/en_uk_lash/me.m01.d06:meMA.Ode5C1H.greekmelody	@ltx/en_uk_lash/he.h.m2:heHE.IisousOZoisArchigos.greekname
ltx/en_uk_lash/me.m01.d06:meMA.Ode5C1H.incipit	@ltx/en_uk_lash/he.h.m2:heHE.IisousOZoisArchigos.incipit
ltx/en_uk_lash/me.m01.d06:meMA.Ode5C1H.melody	@ltx/en_uk_lash/he.h.m2:heHE.IisousOZoisArchigos.melody
ltx/en_uk_lash/me.m01.d06:meMA.Ode5C1H.mode	@ltx/en_uk_lash/miscellanea:misc.Mode2
ltx/en_uk_lash/me.m01.d06:meMA.Ode5C1H.ode	@ltx/en_uk_lash/miscellanea:misc.Ode5
ltx/en_uk_lash/me.m01.d06:meMA.Ode5C1H.text	@ltx/en_uk_lash/he.h.m2:heHE.IisousOZoisArchigos.text
ltx/en_uk_lash/me.m01.d06:meMA.Ode5C21.greekmelody	@ltx/en_uk_lash/he.h.m2:heHE.EchthrouZofodous.greekname
ltx/en_uk_lash/me.m01.d06:meMA.Ode5C21.incipit	…
ltx/en_uk_lash/me.m01.d06:meMA.Ode5C21.melody	@ltx/en_uk_lash/he.h.m2:heHE.EchthrouZofodous.name
ltx/en_uk_lash/me.m01.d06:meMA.Ode5C21.mode	@ltx/en_uk_lash/miscellanea:misc.Mode2
ltx/en_uk_lash/me.m01.d06:meMA.Ode5C21.ode	@ltx/en_uk_lash/miscellanea:misc.Ode5
ltx/en_uk_lash/me.m01.d06:meMA.Ode5C21.text	
ltx/en_uk_lash/me.m01.d06:meMA.Ode5C211.text	
ltx/en_uk_lash/me.m01.d06:meMA.Ode5C212.text	
ltx/en_uk_lash/me.m01.d06:meMA.Ode5C213.text	
ltx/en_uk_lash/me.m01.d06:meMA.Ode5C214.text	
ltx/en_uk_lash/me.m01.d06:meMA.Ode5C215.text	
ltx/en_uk_lash/me.m01.d06:meMA.Ode5C22.incipit	…
ltx/en_uk_lash/me.m01.d06:meMA.Ode5C22.melody	@ltx/en_uk_lash/he.h.m2:heHE.EchthrouZofodous.name
ltx/en_uk_lash/me.m01.d06:meMA.Ode5C22.mode	@ltx/en_uk_lash/miscellanea:misc.Mode2
ltx/en_uk_lash/me.m01.d06:meMA.Ode5C22.ode	@ltx/en_uk_lash/miscellanea:misc.Ode5
ltx/en_uk_lash/me.m01.d06:meMA.Ode5C22.text	
ltx/en_uk_lash/me.m01.d06:meMA.Ode5C221.text	
ltx/en_uk_lash/me.m01.d06:meMA.Ode5C222.text	
ltx/en_uk_lash/me.m01.d06:meMA.Ode5C223.text	
ltx/en_uk_lash/me.m01.d06:meMA.Ode5C224.text	
ltx/en_uk_lash/me.m01.d06:meMA.Ode5C225.text	
ltx/en_uk_lash/me.m01.d06:meMA.Ode5C2H.greekmelody	@ltx/en_uk_lash/he.h.m2:heHE.EchthrouZofodous.greekname
ltx/en_uk_lash/me.m01.d06:meMA.Ode5C2H.incipit	@ltx/en_uk_lash/he.h.m2:heHE.EchthrouZofodous.incipit
ltx/en_uk_lash/me.m01.d06:meMA.Ode5C2H.melody	@ltx/en_uk_lash/he.h.m2:heHE.EchthrouZofodous.melody
ltx/en_uk_lash/me.m01.d06:meMA.Ode5C2H.mode	@ltx/en_uk_lash/miscellanea:misc.Mode2
ltx/en_uk_lash/me.m01.d06:meMA.Ode5C2H.ode	@ltx/en_uk_lash/miscellanea:misc.Ode5
ltx/en_uk_lash/me.m01.d06:meMA.Ode5C2H.text	@ltx/en_uk_lash/he.h.m2:heHE.EchthrouZofodous.text
ltx/en_uk_lash/me.m01.d06:meMA.Ode5C2H1.text	@ltx/en_uk_lash/he.h.m2:heHE.EchthrouZofodous1.text
ltx/en_uk_lash/me.m01.d06:meMA.Ode5C2H2.text	@ltx/en_uk_lash/he.h.m2:heHE.EchthrouZofodous2.text
ltx/en_uk_lash/me.m01.d06:meMA.Ode5C2H3.text	@ltx/en_uk_lash/he.h.m2:heHE.EchthrouZofodous3.text
ltx/en_uk_lash/me.m01.d06:meMA.Ode5C2H4.text	@ltx/en_uk_lash/he.h.m2:heHE.EchthrouZofodous4.text
ltx/en_uk_lash/me.m01.d06:meMA.Ode5C2H5.text	@ltx/en_uk_lash/he.h.m2:heHE.EchthrouZofodous5.text
ltx/en_uk_lash/me.m01.d06:meMA.Ode6C11.greekmelody	@ltx/en_uk_lash/he.h.m2:heHE.IFoniTouLogou.greekname
ltx/en_uk_lash/me.m01.d06:meMA.Ode6C11.incipit	…
ltx/en_uk_lash/me.m01.d06:meMA.Ode6C11.melody	@ltx/en_uk_lash/he.h.m2:heHE.IFoniTouLogou.name
ltx/en_uk_lash/me.m01.d06:meMA.Ode6C11.mode	@ltx/en_uk_lash/miscellanea:misc.Mode2
ltx/en_uk_lash/me.m01.d06:meMA.Ode6C11.ode	@ltx/en_uk_lash/miscellanea:misc.Ode6
ltx/en_uk_lash/me.m01.d06:meMA.Ode6C11.text	
ltx/en_uk_lash/me.m01.d06:meMA.Ode6C12.incipit	…
ltx/en_uk_lash/me.m01.d06:meMA.Ode6C12.melody	@ltx/en_uk_lash/he.h.m2:heHE.IFoniTouLogou.name
ltx/en_uk_lash/me.m01.d06:meMA.Ode6C12.mode	@ltx/en_uk_lash/miscellanea:misc.Mode2
ltx/en_uk_lash/me.m01.d06:meMA.Ode6C12.ode	@ltx/en_uk_lash/miscellanea:misc.Ode6
ltx/en_uk_lash/me.m01.d06:meMA.Ode6C12.text	
ltx/en_uk_lash/me.m01.d06:meMA.Ode6C1H.greekmelody	@ltx/en_uk_lash/he.h.m2:heHE.IFoniTouLogou.greekname
ltx/en_uk_lash/me.m01.d06:meMA.Ode6C1H.incipit	@ltx/en_uk_lash/he.h.m2:heHE.IFoniTouLogou.incipit
ltx/en_uk_lash/me.m01.d06:meMA.Ode6C1H.melody	@ltx/en_uk_lash/he.h.m2:heHE.IFoniTouLogou.melody
ltx/en_uk_lash/me.m01.d06:meMA.Ode6C1H.mode	@ltx/en_uk_lash/miscellanea:misc.Mode2
ltx/en_uk_lash/me.m01.d06:meMA.Ode6C1H.ode	@ltx/en_uk_lash/miscellanea:misc.Ode6
ltx/en_uk_lash/me.m01.d06:meMA.Ode6C1H.text	@ltx/en_uk_lash/he.h.m2:heHE.IFoniTouLogou.text
ltx/en_uk_lash/me.m01.d06:meMA.Ode6C21.incipit	…
ltx/en_uk_lash/me.m01.d06:meMA.Ode6C21.melody	
ltx/en_uk_lash/me.m01.d06:meMA.Ode6C21.mode	@ltx/en_uk_lash/miscellanea:misc.Mode2
ltx/en_uk_lash/me.m01.d06:meMA.Ode6C21.ode	@ltx/en_uk_lash/miscellanea:misc.Ode6
ltx/en_uk_lash/me.m01.d06:meMA.Ode6C21.text	
ltx/en_uk_lash/me.m01.d06:meMA.Ode6C211.text	
ltx/en_uk_lash/me.m01.d06:meMA.Ode6C212.text	
ltx/en_uk_lash/me.m01.d06:meMA.Ode6C213.text	
ltx/en_uk_lash/me.m01.d06:meMA.Ode6C214.text	
ltx/en_uk_lash/me.m01.d06:meMA.Ode6C215.text	
ltx/en_uk_lash/me.m01.d06:meMA.Ode6C22.incipit	…
ltx/en_uk_lash/me.m01.d06:meMA.Ode6C22.melody	
ltx/en_uk_lash/me.m01.d06:meMA.Ode6C22.mode	@ltx/en_uk_lash/miscellanea:misc.Mode2
ltx/en_uk_lash/me.m01.d06:meMA.Ode6C22.ode	@ltx/en_uk_lash/miscellanea:misc.Ode6
ltx/en_uk_lash/me.m01.d06:meMA.Ode6C22.text	
ltx/en_uk_lash/me.m01.d06:meMA.Ode6C221.text	
ltx/en_uk_lash/me.m01.d06:meMA.Ode6C222.text	
ltx/en_uk_lash/me.m01.d06:meMA.Ode6C223.text	
ltx/en_uk_lash/me.m01.d06:meMA.Ode6C224.text	
ltx/en_uk_lash/me.m01.d06:meMA.Ode6C225.text	
ltx/en_uk_lash/me.m01.d06:meMA.Ode6C2H.greekmelody	@ltx/en_uk_lash/he.h.m2:heHE.ImertonExefine.greekname
ltx/en_uk_lash/me.m01.d06:meMA.Ode6C2H.incipit	@ltx/en_uk_lash/he.h.m2:heHE.ImertonExefine.incipit
ltx/en_uk_lash/me.m01.d06:meMA.Ode6C2H.melody	@ltx/en_uk_lash/he.h.m2:heHE.ImertonExefine.melody
ltx/en_uk_lash/me.m01.d06:meMA.Ode6C2H.mode	@ltx/en_uk_lash/miscellanea:misc.Mode2
ltx/en_uk_lash/me.m01.d06:meMA.Ode6C2H.ode	@ltx/en_uk_lash/miscellanea:misc.Ode6
ltx/en_uk_lash/me.m01.d06:meMA.Ode6C2H.text	@ltx/en_uk_lash/he.h.m2:heHE.ImertonExefine.text
ltx/en_uk_lash/me.m01.d06:meMA.Ode6C2H1.text	@ltx/en_uk_lash/he.h.m2:heHE.ImertonExefine1.text
ltx/en_uk_lash/me.m01.d06:meMA.Ode6C2H2.text	@ltx/en_uk_lash/he.h.m2:heHE.ImertonExefine2.text
ltx/en_uk_lash/me.m01.d06:meMA.Ode6C2H3.text	@ltx/en_uk_lash/he.h.m2:heHE.ImertonExefine3.text
ltx/en_uk_lash/me.m01.d06:meMA.Ode6C2H4.text	@ltx/en_uk_lash/he.h.m2:heHE.ImertonExefine4.text
ltx/en_uk_lash/me.m01.d06:meMA.Ode6C2H5.text	@ltx/en_uk_lash/he.h.m2:heHE.ImertonExefine5.text
ltx/en_uk_lash/me.m01.d06:meMA.Ode7C11.greekmelody	@ltx/en_uk_lash/he.h.m2:heHE.NeousEfseveis.greekname
ltx/en_uk_lash/me.m01.d06:meMA.Ode7C11.incipit	…
ltx/en_uk_lash/me.m01.d06:meMA.Ode7C11.melody	@ltx/en_uk_lash/he.h.m2:heHE.NeousEfseveis.name
ltx/en_uk_lash/me.m01.d06:meMA.Ode7C11.mode	@ltx/en_uk_lash/miscellanea:misc.Mode2
ltx/en_uk_lash/me.m01.d06:meMA.Ode7C11.ode	@ltx/en_uk_lash/miscellanea:misc.Ode7
ltx/en_uk_lash/me.m01.d06:meMA.Ode7C11.text	
ltx/en_uk_lash/me.m01.d06:meMA.Ode7C12.incipit	…
ltx/en_uk_lash/me.m01.d06:meMA.Ode7C12.melody	@ltx/en_uk_lash/he.h.m2:heHE.NeousEfseveis.name
ltx/en_uk_lash/me.m01.d06:meMA.Ode7C12.mode	@ltx/en_uk_lash/miscellanea:misc.Mode2
ltx/en_uk_lash/me.m01.d06:meMA.Ode7C12.ode	@ltx/en_uk_lash/miscellanea:misc.Ode7
ltx/en_uk_lash/me.m01.d06:meMA.Ode7C12.text	
ltx/en_uk_lash/me.m01.d06:meMA.Ode7C13.incipit	…
ltx/en_uk_lash/me.m01.d06:meMA.Ode7C13.melody	@ltx/en_uk_lash/he.h.m2:heHE.NeousEfseveis.name
ltx/en_uk_lash/me.m01.d06:meMA.Ode7C13.mode	@ltx/en_uk_lash/miscellanea:misc.Mode2
ltx/en_uk_lash/me.m01.d06:meMA.Ode7C13.ode	@ltx/en_uk_lash/miscellanea:misc.Ode7
ltx/en_uk_lash/me.m01.d06:meMA.Ode7C13.text	
ltx/en_uk_lash/me.m01.d06:meMA.Ode7C1H.greekmelody	@ltx/en_uk_lash/he.h.m2:heHE.NeousEfseveis.greekname
ltx/en_uk_lash/me.m01.d06:meMA.Ode7C1H.incipit	@ltx/en_uk_lash/he.h.m2:heHE.NeousEfseveis.incipit
ltx/en_uk_lash/me.m01.d06:meMA.Ode7C1H.melody	@ltx/en_uk_lash/he.h.m2:heHE.NeousEfseveis.melody
ltx/en_uk_lash/me.m01.d06:meMA.Ode7C1H.mode	@ltx/en_uk_lash/miscellanea:misc.Mode2
ltx/en_uk_lash/me.m01.d06:meMA.Ode7C1H.ode	@ltx/en_uk_lash/miscellanea:misc.Ode7
ltx/en_uk_lash/me.m01.d06:meMA.Ode7C1H.text	@ltx/en_uk_lash/he.h.m2:heHE.NeousEfseveis.text
ltx/en_uk_lash/me.m01.d06:meMA.Ode7C21.greekmelody	@ltx/en_uk_lash/he.h.m2:heHE.EflexeReithro.greekname
ltx/en_uk_lash/me.m01.d06:meMA.Ode7C21.incipit	…
ltx/en_uk_lash/me.m01.d06:meMA.Ode7C21.melody	@ltx/en_uk_lash/he.h.m2:heHE.EflexeReithro.name
ltx/en_uk_lash/me.m01.d06:meMA.Ode7C21.mode	@ltx/en_uk_lash/miscellanea:misc.Mode2
ltx/en_uk_lash/me.m01.d06:meMA.Ode7C21.ode	@ltx/en_uk_lash/miscellanea:misc.Ode7
ltx/en_uk_lash/me.m01.d06:meMA.Ode7C21.text	
ltx/en_uk_lash/me.m01.d06:meMA.Ode7C211.text	
ltx/en_uk_lash/me.m01.d06:meMA.Ode7C212.text	
ltx/en_uk_lash/me.m01.d06:meMA.Ode7C213.text	
ltx/en_uk_lash/me.m01.d06:meMA.Ode7C214.text	
ltx/en_uk_lash/me.m01.d06:meMA.Ode7C215.text	
ltx/en_uk_lash/me.m01.d06:meMA.Ode7C22.incipit	…
ltx/en_uk_lash/me.m01.d06:meMA.Ode7C22.melody	@ltx/en_uk_lash/he.h.m2:heHE.EflexeReithro.name
ltx/en_uk_lash/me.m01.d06:meMA.Ode7C22.mode	@ltx/en_uk_lash/miscellanea:misc.Mode2
ltx/en_uk_lash/me.m01.d06:meMA.Ode7C22.ode	@ltx/en_uk_lash/miscellanea:misc.Ode7
ltx/en_uk_lash/me.m01.d06:meMA.Ode7C22.text	
ltx/en_uk_lash/me.m01.d06:meMA.Ode7C221.text	
ltx/en_uk_lash/me.m01.d06:meMA.Ode7C222.text	
ltx/en_uk_lash/me.m01.d06:meMA.Ode7C223.text	
ltx/en_uk_lash/me.m01.d06:meMA.Ode7C224.text	
ltx/en_uk_lash/me.m01.d06:meMA.Ode7C225.text	
ltx/en_uk_lash/me.m01.d06:meMA.Ode7C23.incipit	…
ltx/en_uk_lash/me.m01.d06:meMA.Ode7C23.melody	@ltx/en_uk_lash/he.h.m2:heHE.EflexeReithro.name
ltx/en_uk_lash/me.m01.d06:meMA.Ode7C23.mode	@ltx/en_uk_lash/miscellanea:misc.Mode2
ltx/en_uk_lash/me.m01.d06:meMA.Ode7C23.ode	@ltx/en_uk_lash/miscellanea:misc.Ode7
ltx/en_uk_lash/me.m01.d06:meMA.Ode7C23.text	
ltx/en_uk_lash/me.m01.d06:meMA.Ode7C231.text	
ltx/en_uk_lash/me.m01.d06:meMA.Ode7C232.text	
ltx/en_uk_lash/me.m01.d06:meMA.Ode7C233.text	
ltx/en_uk_lash/me.m01.d06:meMA.Ode7C234.text	
ltx/en_uk_lash/me.m01.d06:meMA.Ode7C235.text	
ltx/en_uk_lash/me.m01.d06:meMA.Ode7C2H.greekmelody	@ltx/en_uk_lash/he.h.m2:heHE.EflexeReithro.greekname
ltx/en_uk_lash/me.m01.d06:meMA.Ode7C2H.incipit	@ltx/en_uk_lash/he.h.m2:heHE.EflexeReithro.incipit
ltx/en_uk_lash/me.m01.d06:meMA.Ode7C2H.melody	@ltx/en_uk_lash/he.h.m2:heHE.EflexeReithro.melody
ltx/en_uk_lash/me.m01.d06:meMA.Ode7C2H.mode	@ltx/en_uk_lash/miscellanea:misc.Mode2
ltx/en_uk_lash/me.m01.d06:meMA.Ode7C2H.ode	@ltx/en_uk_lash/miscellanea:misc.Ode7
ltx/en_uk_lash/me.m01.d06:meMA.Ode7C2H.text	@ltx/en_uk_lash/he.h.m2:heHE.EflexeReithro.text
ltx/en_uk_lash/me.m01.d06:meMA.Ode7C2H1.text	@ltx/en_uk_lash/he.h.m2:heHE.EflexeReithro1.text
ltx/en_uk_lash/me.m01.d06:meMA.Ode7C2H2.text	@ltx/en_uk_lash/he.h.m2:heHE.EflexeReithro2.text
ltx/en_uk_lash/me.m01.d06:meMA.Ode7C2H3.text	@ltx/en_uk_lash/he.h.m2:heHE.EflexeReithro3.text
ltx/en_uk_lash/me.m01.d06:meMA.Ode7C2H4.text	@ltx/en_uk_lash/he.h.m2:heHE.EflexeReithro4.text
ltx/en_uk_lash/me.m01.d06:meMA.Ode7C2H5.text	@ltx/en_uk_lash/he.h.m2:heHE.EflexeReithro5.text
ltx/en_uk_lash/me.m01.d06:meMA.Ode8C11.greekmelody	@ltx/en_uk_lash/he.h.m2:heHE.MystirionParadoxon.greekname
ltx/en_uk_lash/me.m01.d06:meMA.Ode8C11.incipit	…
ltx/en_uk_lash/me.m01.d06:meMA.Ode8C11.melody	@ltx/en_uk_lash/he.h.m2:heHE.MystirionParadoxon.name
ltx/en_uk_lash/me.m01.d06:meMA.Ode8C11.mode	@ltx/en_uk_lash/miscellanea:misc.Mode2
ltx/en_uk_lash/me.m01.d06:meMA.Ode8C11.ode	@ltx/en_uk_lash/miscellanea:misc.Ode8
ltx/en_uk_lash/me.m01.d06:meMA.Ode8C11.text	
ltx/en_uk_lash/me.m01.d06:meMA.Ode8C12.incipit	…
ltx/en_uk_lash/me.m01.d06:meMA.Ode8C12.melody	@ltx/en_uk_lash/he.h.m2:heHE.MystirionParadoxon.name
ltx/en_uk_lash/me.m01.d06:meMA.Ode8C12.mode	@ltx/en_uk_lash/miscellanea:misc.Mode2
ltx/en_uk_lash/me.m01.d06:meMA.Ode8C12.ode	@ltx/en_uk_lash/miscellanea:misc.Ode8
ltx/en_uk_lash/me.m01.d06:meMA.Ode8C12.text	
ltx/en_uk_lash/me.m01.d06:meMA.Ode8C13.incipit	…
ltx/en_uk_lash/me.m01.d06:meMA.Ode8C13.melody	@ltx/en_uk_lash/he.h.m2:heHE.MystirionParadoxon.name
ltx/en_uk_lash/me.m01.d06:meMA.Ode8C13.mode	@ltx/en_uk_lash/miscellanea:misc.Mode2
ltx/en_uk_lash/me.m01.d06:meMA.Ode8C13.ode	@ltx/en_uk_lash/miscellanea:misc.Ode8
ltx/en_uk_lash/me.m01.d06:meMA.Ode8C13.text	
ltx/en_uk_lash/me.m01.d06:meMA.Ode8C1H.greekmelody	@ltx/en_uk_lash/he.h.m2:heHE.MystirionParadoxon.greekname
ltx/en_uk_lash/me.m01.d06:meMA.Ode8C1H.incipit	@ltx/en_uk_lash/he.h.m2:heHE.MystirionParadoxon.incipit
ltx/en_uk_lash/me.m01.d06:meMA.Ode8C1H.melody	@ltx/en_uk_lash/he.h.m2:heHE.MystirionParadoxon.melody
ltx/en_uk_lash/me.m01.d06:meMA.Ode8C1H.mode	@ltx/en_uk_lash/miscellanea:misc.Mode2
ltx/en_uk_lash/me.m01.d06:meMA.Ode8C1H.ode	@ltx/en_uk_lash/miscellanea:misc.Ode8
ltx/en_uk_lash/me.m01.d06:meMA.Ode8C1H.text	@ltx/en_uk_lash/he.h.m2:heHE.MystirionParadoxon.text
ltx/en_uk_lash/me.m01.d06:meMA.Ode8C21.greekmelody	@ltx/en_uk_lash/he.h.m2:heHE.EleftheraMenIKtisis.greekname
ltx/en_uk_lash/me.m01.d06:meMA.Ode8C21.incipit	…
ltx/en_uk_lash/me.m01.d06:meMA.Ode8C21.melody	@ltx/en_uk_lash/he.h.m2:heHE.EleftheraMenIKtisis.name
ltx/en_uk_lash/me.m01.d06:meMA.Ode8C21.mode	@ltx/en_uk_lash/miscellanea:misc.Mode2
ltx/en_uk_lash/me.m01.d06:meMA.Ode8C21.ode	@ltx/en_uk_lash/miscellanea:misc.Ode8
ltx/en_uk_lash/me.m01.d06:meMA.Ode8C21.text	
ltx/en_uk_lash/me.m01.d06:meMA.Ode8C211.text	
ltx/en_uk_lash/me.m01.d06:meMA.Ode8C212.text	
ltx/en_uk_lash/me.m01.d06:meMA.Ode8C213.text	
ltx/en_uk_lash/me.m01.d06:meMA.Ode8C214.text	
ltx/en_uk_lash/me.m01.d06:meMA.Ode8C215.text	
ltx/en_uk_lash/me.m01.d06:meMA.Ode8C22.incipit	…
ltx/en_uk_lash/me.m01.d06:meMA.Ode8C22.melody	@ltx/en_uk_lash/he.h.m2:heHE.EleftheraMenIKtisis.name
ltx/en_uk_lash/me.m01.d06:meMA.Ode8C22.mode	@ltx/en_uk_lash/miscellanea:misc.Mode2
ltx/en_uk_lash/me.m01.d06:meMA.Ode8C22.ode	@ltx/en_uk_lash/miscellanea:misc.Ode8
ltx/en_uk_lash/me.m01.d06:meMA.Ode8C22.text	
ltx/en_uk_lash/me.m01.d06:meMA.Ode8C221.text	
ltx/en_uk_lash/me.m01.d06:meMA.Ode8C222.text	
ltx/en_uk_lash/me.m01.d06:meMA.Ode8C223.text	
ltx/en_uk_lash/me.m01.d06:meMA.Ode8C224.text	
ltx/en_uk_lash/me.m01.d06:meMA.Ode8C225.text	
ltx/en_uk_lash/me.m01.d06:meMA.Ode8C2H.greekmelody	@ltx/en_uk_lash/he.h.m2:heHE.EleftheraMenIKtisis.greekname
ltx/en_uk_lash/me.m01.d06:meMA.Ode8C2H.incipit	@ltx/en_uk_lash/he.h.m2:heHE.EleftheraMenIKtisis.incipit
ltx/en_uk_lash/me.m01.d06:meMA.Ode8C2H.melody	@ltx/en_uk_lash/he.h.m2:heHE.EleftheraMenIKtisis.melody
ltx/en_uk_lash/me.m01.d06:meMA.Ode8C2H.mode	@ltx/en_uk_lash/miscellanea:misc.Mode2
ltx/en_uk_lash/me.m01.d06:meMA.Ode8C2H.ode	@ltx/en_uk_lash/miscellanea:misc.Ode8
ltx/en_uk_lash/me.m01.d06:meMA.Ode8C2H.text	@ltx/en_uk_lash/he.h.m2:heHE.EleftheraMenIKtisis.text
ltx/en_uk_lash/me.m01.d06:meMA.Ode8C2H1.text	@ltx/en_uk_lash/he.h.m2:heHE.EleftheraMenIKtisis1.text
ltx/en_uk_lash/me.m01.d06:meMA.Ode8C2H2.text	@ltx/en_uk_lash/he.h.m2:heHE.EleftheraMenIKtisis2.text
ltx/en_uk_lash/me.m01.d06:meMA.Ode8C2H3.text	@ltx/en_uk_lash/he.h.m2:heHE.EleftheraMenIKtisis3.text
ltx/en_uk_lash/me.m01.d06:meMA.Ode8C2H4.text	@ltx/en_uk_lash/he.h.m2:heHE.EleftheraMenIKtisis4.text
ltx/en_uk_lash/me.m01.d06:meMA.Ode8C2H5.text	@ltx/en_uk_lash/he.h.m2:heHE.EleftheraMenIKtisis5.text
ltx/en_uk_lash/me.m01.d06:meMA.Ode9C11.greekmelody	@ltx/en_uk_lash/he.h.m2:heHE.AporeiPasaGlossa.greekname
ltx/en_uk_lash/me.m01.d06:meMA.Ode9C11.incipit	…
ltx/en_uk_lash/me.m01.d06:meMA.Ode9C11.melody	@ltx/en_uk_lash/he.h.m2:heHE.AporeiPasaGlossa.name
ltx/en_uk_lash/me.m01.d06:meMA.Ode9C11.mode	@ltx/en_uk_lash/miscellanea:misc.Mode2
ltx/en_uk_lash/me.m01.d06:meMA.Ode9C11.ode	@ltx/en_uk_lash/miscellanea:misc.Ode9
ltx/en_uk_lash/me.m01.d06:meMA.Ode9C11.text	
ltx/en_uk_lash/me.m01.d06:meMA.Ode9C12.incipit	…
ltx/en_uk_lash/me.m01.d06:meMA.Ode9C12.melody	@ltx/en_uk_lash/he.h.m2:heHE.AporeiPasaGlossa.name
ltx/en_uk_lash/me.m01.d06:meMA.Ode9C12.mode	@ltx/en_uk_lash/miscellanea:misc.Mode2
ltx/en_uk_lash/me.m01.d06:meMA.Ode9C12.ode	@ltx/en_uk_lash/miscellanea:misc.Ode9
ltx/en_uk_lash/me.m01.d06:meMA.Ode9C12.text	
ltx/en_uk_lash/me.m01.d06:meMA.Ode9C13.incipit	…
ltx/en_uk_lash/me.m01.d06:meMA.Ode9C13.melody	@ltx/en_uk_lash/he.h.m2:heHE.AporeiPasaGlossa.name
ltx/en_uk_lash/me.m01.d06:meMA.Ode9C13.mode	@ltx/en_uk_lash/miscellanea:misc.Mode2
ltx/en_uk_lash/me.m01.d06:meMA.Ode9C13.ode	@ltx/en_uk_lash/miscellanea:misc.Ode9
ltx/en_uk_lash/me.m01.d06:meMA.Ode9C13.text	
ltx/en_uk_lash/me.m01.d06:meMA.Ode9C1H.greekmelody	@ltx/en_uk_lash/he.h.m2:heHE.AporeiPasaGlossa.greekname
ltx/en_uk_lash/me.m01.d06:meMA.Ode9C1H.incipit	@ltx/en_uk_lash/he.h.m2:heHE.AporeiPasaGlossa.incipit
ltx/en_uk_lash/me.m01.d06:meMA.Ode9C1H.melody	@ltx/en_uk_lash/he.h.m2:heHE.AporeiPasaGlossa.melody
ltx/en_uk_lash/me.m01.d06:meMA.Ode9C1H.mode	@ltx/en_uk_lash/miscellanea:misc.Mode2
ltx/en_uk_lash/me.m01.d06:meMA.Ode9C1H.ode	@ltx/en_uk_lash/miscellanea:misc.Ode9
ltx/en_uk_lash/me.m01.d06:meMA.Ode9C1H.text	@ltx/en_uk_lash/he.h.m2:heHE.AporeiPasaGlossa.text
ltx/en_uk_lash/me.m01.d06:meMA.Ode9C1M01.incipit	…
ltx/en_uk_lash/me.m01.d06:meMA.Ode9C1M01.text	
ltx/en_uk_lash/me.m01.d06:meMA.Ode9C1M02.incipit	…
ltx/en_uk_lash/me.m01.d06:meMA.Ode9C1M02.text	
ltx/en_uk_lash/me.m01.d06:meMA.Ode9C1M03.incipit	…
ltx/en_uk_lash/me.m01.d06:meMA.Ode9C1M03.text	
ltx/en_uk_lash/me.m01.d06:meMA.Ode9C1M04.incipit	…
ltx/en_uk_lash/me.m01.d06:meMA.Ode9C1M04.text	
ltx/en_uk_lash/me.m01.d06:meMA.Ode9C1M05.incipit	…
ltx/en_uk_lash/me.m01.d06:meMA.Ode9C1M05.text	
ltx/en_uk_lash/me.m01.d06:meMA.Ode9C1M06.incipit	…
ltx/en_uk_lash/me.m01.d06:meMA.Ode9C1M06.text	
ltx/en_uk_lash/me.m01.d06:meMA.Ode9C1M07.incipit	…
ltx/en_uk_lash/me.m01.d06:meMA.Ode9C1M07.text	
ltx/en_uk_lash/me.m01.d06:meMA.Ode9C21.greekmelody	@ltx/en_uk_lash/he.h.m2:heHE.OTonYperNoun.greekname
ltx/en_uk_lash/me.m01.d06:meMA.Ode9C21.incipit	…
ltx/en_uk_lash/me.m01.d06:meMA.Ode9C21.melody	@ltx/en_uk_lash/he.h.m2:heHE.OTonYperNoun.name
ltx/en_uk_lash/me.m01.d06:meMA.Ode9C21.mode	@ltx/en_uk_lash/miscellanea:misc.Mode2
ltx/en_uk_lash/me.m01.d06:meMA.Ode9C21.ode	@ltx/en_uk_lash/miscellanea:misc.Ode9
ltx/en_uk_lash/me.m01.d06:meMA.Ode9C21.text	
ltx/en_uk_lash/me.m01.d06:meMA.Ode9C211.text	
ltx/en_uk_lash/me.m01.d06:meMA.Ode9C212.text	
ltx/en_uk_lash/me.m01.d06:meMA.Ode9C213.text	
ltx/en_uk_lash/me.m01.d06:meMA.Ode9C214.text	
ltx/en_uk_lash/me.m01.d06:meMA.Ode9C215.text	
ltx/en_uk_lash/me.m01.d06:meMA.Ode9C22.incipit	…
ltx/en_uk_lash/me.m01.d06:meMA.Ode9C22.melody	@ltx/en_uk_lash/he.h.m2:heHE.OTonYperNoun.name
ltx/en_uk_lash/me.m01.d06:meMA.Ode9C22.mode	@ltx/en_uk_lash/miscellanea:misc.Mode2
ltx/en_uk_lash/me.m01.d06:meMA.Ode9C22.ode	@ltx/en_uk_lash/miscellanea:misc.Ode9
ltx/en_uk_lash/me.m01.d06:meMA.Ode9C22.text	
ltx/en_uk_lash/me.m01.d06:meMA.Ode9C221.text	
ltx/en_uk_lash/me.m01.d06:meMA.Ode9C222.text	
ltx/en_uk_lash/me.m01.d06:meMA.Ode9C223.text	
ltx/en_uk_lash/me.m01.d06:meMA.Ode9C224.text	
ltx/en_uk_lash/me.m01.d06:meMA.Ode9C225.text	
ltx/en_uk_lash/me.m01.d06:meMA.Ode9C2H.greekmelody	@ltx/en_uk_lash/he.h.m2:heHE.OTonYperNoun.greekname
ltx/en_uk_lash/me.m01.d06:meMA.Ode9C2H.incipit	@ltx/en_uk_lash/he.h.m2:heHE.OTonYperNoun.incipit
ltx/en_uk_lash/me.m01.d06:meMA.Ode9C2H.melody	@ltx/en_uk_lash/he.h.m2:heHE.OTonYperNoun.melody
ltx/en_uk_lash/me.m01.d06:meMA.Ode9C2H.mode	@ltx/en_uk_lash/miscellanea:misc.Mode2
ltx/en_uk_lash/me.m01.d06:meMA.Ode9C2H.ode	@ltx/en_uk_lash/miscellanea:misc.Ode9
ltx/en_uk_lash/me.m01.d06:meMA.Ode9C2H.text	@ltx/en_uk_lash/he.h.m2:heHE.OTonYperNoun.text
ltx/en_uk_lash/me.m01.d06:meMA.Ode9C2H1.text	@ltx/en_uk_lash/he.h.m2:heHE.OTonYperNoun1.text
ltx/en_uk_lash/me.m01.d06:meMA.Ode9C2H2.text	@ltx/en_uk_lash/he.h.m2:heHE.OTonYperNoun2.text
ltx/en_uk_lash/me.m01.d06:meMA.Ode9C2H3.text	@ltx/en_uk_lash/he.h.m2:heHE.OTonYperNoun3.text
ltx/en_uk_lash/me.m01.d06:meMA.Ode9C2H4.text	@ltx/en_uk_lash/he.h.m2:heHE.OTonYperNoun4.text
ltx/en_uk_lash/me.m01.d06:meMA.Ode9C2H5.text	@ltx/en_uk_lash/he.h.m2:heHE.OTonYperNoun5.text
ltx/en_uk_lash/me.m01.d06:meMA.Ode9C2M01.incipit	…
ltx/en_uk_lash/me.m01.d06:meMA.Ode9C2M01.text	
ltx/en_uk_lash/me.m01.d06:meMA.Ode9C2M02.incipit	…
ltx/en_uk_lash/me.m01.d06:meMA.Ode9C2M02.text	
ltx/en_uk_lash/me.m01.d06:meMA.Ode9C2M03.incipit	…
ltx/en_uk_lash/me.m01.d06:meMA.Ode9C2M03.text	
ltx/en_uk_lash/me.m01.d06:meMA.Ode9C2M04.incipit	…
ltx/en_uk_lash/me.m01.d06:meMA.Ode9C2M04.text	
ltx/en_uk_lash/me.m01.d06:meMA.Ode9C2M05.incipit	…
ltx/en_uk_lash/me.m01.d06:meMA.Ode9C2M05.text	
ltx/en_uk_lash/me.m01.d06:meMA.Ode9C2M06.incipit	…
ltx/en_uk_lash/me.m01.d06:meMA.Ode9C2M06.text	
ltx/en_uk_lash/me.m01.d06:meMA.Ode9C2MTh.incipit	…
ltx/en_uk_lash/me.m01.d06:meMA.Ode9C2MTh.text	
ltx/en_uk_lash/me.m01.d06:meMA.Ode9C2MTr.incipit	…
ltx/en_uk_lash/me.m01.d06:meMA.Ode9C2MTr.text	
ltx/en_uk_lash/me.m01.d06:meMA.Oikos1.text	
ltx/en_uk_lash/me.m01.d06:meMA.PostGospelBoth.incipit	@ltx/en_uk_lash/me.m01.d06:meMA.PostGospelGlory.incipit
ltx/en_uk_lash/me.m01.d06:meMA.PostGospelBoth.melody	
ltx/en_uk_lash/me.m01.d06:meMA.PostGospelBoth.mode	@ltx/en_uk_lash/miscellanea:misc.Mode2
ltx/en_uk_lash/me.m01.d06:meMA.PostGospelBoth.text	@ltx/en_uk_lash/me.m01.d06:meMA.PostGospelGlory.text
ltx/en_uk_lash/me.m01.d06:meMA.PostGospelGlory.incipit	…
ltx/en_uk_lash/me.m01.d06:meMA.PostGospelGlory.melody	
ltx/en_uk_lash/me.m01.d06:meMA.PostGospelGlory.mode	@ltx/en_uk_lash/miscellanea:misc.Mode2
ltx/en_uk_lash/me.m01.d06:meMA.PostGospelGlory.text	
ltx/en_uk_lash/me.m01.d06:meMA.PostGospelIdiomelon.incipit	…
ltx/en_uk_lash/me.m01.d06:meMA.PostGospelIdiomelon.melody	
ltx/en_uk_lash/me.m01.d06:meMA.PostGospelIdiomelon.mode	@ltx/en_uk_lash/miscellanea:misc.Mode6
ltx/en_uk_lash/me.m01.d06:meMA.PostGospelIdiomelon.text	
ltx/en_uk_lash/me.m01.d06:meVE.Apolytikion1.incipit	…
ltx/en_uk_lash/me.m01.d06:meVE.Apolytikion1.melody	
ltx/en_uk_lash/me.m01.d06:meVE.Apolytikion1.mode	@ltx/en_uk_lash/miscellanea:misc.Mode1
ltx/en_uk_lash/me.m01.d06:meVE.Apolytikion1.text	
ltx/en_uk_lash/me.m01.d06:meVE.AposGlory.incipit	…
ltx/en_uk_lash/me.m01.d06:meVE.AposGlory.melody	
ltx/en_uk_lash/me.m01.d06:meVE.AposGlory.mode	@ltx/en_uk_lash/miscellanea:misc.Mode6
ltx/en_uk_lash/me.m01.d06:meVE.AposGlory.poet	@ltx/en_uk_lash/poets:po.Theofanous
ltx/en_uk_lash/me.m01.d06:meVE.AposGlory.text	
ltx/en_uk_lash/me.m01.d06:meVE.Aposticha1.incipit	…
ltx/en_uk_lash/me.m01.d06:meVE.Aposticha1.melody	
ltx/en_uk_lash/me.m01.d06:meVE.Aposticha1.mode	@ltx/en_uk_lash/miscellanea:misc.Mode2
ltx/en_uk_lash/me.m01.d06:meVE.Aposticha1.poet	@ltx/en_uk_lash/poets:po.Anatoliou
ltx/en_uk_lash/me.m01.d06:meVE.Aposticha1.text	
ltx/en_uk_lash/me.m01.d06:meVE.Aposticha2.incipit	…
ltx/en_uk_lash/me.m01.d06:meVE.Aposticha2.melody	
ltx/en_uk_lash/me.m01.d06:meVE.Aposticha2.mode	@ltx/en_uk_lash/miscellanea:misc.Mode2
ltx/en_uk_lash/me.m01.d06:meVE.Aposticha2.text	
ltx/en_uk_lash/me.m01.d06:meVE.Aposticha3.incipit	…
ltx/en_uk_lash/me.m01.d06:meVE.Aposticha3.melody	
ltx/en_uk_lash/me.m01.d06:meVE.Aposticha3.mode	@ltx/en_uk_lash/miscellanea:misc.Mode2
ltx/en_uk_lash/me.m01.d06:meVE.Aposticha3.text	
ltx/en_uk_lash/me.m01.d06:meVE.Lity1.incipit	…
ltx/en_uk_lash/me.m01.d06:meVE.Lity1.melody	
ltx/en_uk_lash/me.m01.d06:meVE.Lity1.mode	@ltx/en_uk_lash/miscellanea:misc.Mode4
ltx/en_uk_lash/me.m01.d06:meVE.Lity1.poet	@ltx/en_uk_lash/poets:po.KosmaMonachou
ltx/en_uk_lash/me.m01.d06:meVE.Lity1.text	
ltx/en_uk_lash/me.m01.d06:meVE.Lity2.incipit	When the Baptist saw you…
ltx/en_uk_lash/me.m01.d06:meVE.Lity2.melody	
ltx/en_uk_lash/me.m01.d06:meVE.Lity2.mode	@ltx/en_uk_lash/miscellanea:misc.Mode4
ltx/en_uk_lash/me.m01.d06:meVE.Lity2.text	When the Baptist saw you, who take away the sin of the world by spirit and fire, coming to him, quailing and trembling he cried, ''I do not dare to grasp your immaculate head. But sanctify me, Master, by your Epiphany, only lover of humankind''.
ltx/en_uk_lash/me.m01.d06:meVE.Lity3.incipit	…
ltx/en_uk_lash/me.m01.d06:meVE.Lity3.melody	
ltx/en_uk_lash/me.m01.d06:meVE.Lity3.mode	@ltx/en_uk_lash/miscellanea:misc.Mode4
ltx/en_uk_lash/me.m01.d06:meVE.Lity3.text	
ltx/en_uk_lash/me.m01.d06:meVE.Lity4.incipit	…
ltx/en_uk_lash/me.m01.d06:meVE.Lity4.melody	
ltx/en_uk_lash/me.m01.d06:meVE.Lity4.mode	@ltx/en_uk_lash/miscellanea:misc.Mode4
ltx/en_uk_lash/me.m01.d06:meVE.Lity4.text	
ltx/en_uk_lash/me.m01.d06:meVE.Lity5.incipit	The hand of the Baptist…
ltx/en_uk_lash/me.m01.d06:meVE.Lity5.melody	
ltx/en_uk_lash/me.m01.d06:meVE.Lity5.mode	@ltx/en_uk_lash/miscellanea:misc.Mode4
ltx/en_uk_lash/me.m01.d06:meVE.Lity5.text	The hand of the Baptist trembled when it touched your immaculate head; the river Jordan was turned back, not daring to minister to you; for how could the river that had stood in awe of Jesus son of Navi not be seized with alarm at its Maker? But you, our Saviour, fulfilled the whole dispensation, that you might save the world by your Epiphany, only lover of humankind.
ltx/en_uk_lash/me.m01.d06:meVE.LityBoth.incipit	…
ltx/en_uk_lash/me.m01.d06:meVE.LityBoth.melody	
ltx/en_uk_lash/me.m01.d06:meVE.LityBoth.mode	@ltx/en_uk_lash/miscellanea:misc.Mode8
ltx/en_uk_lash/me.m01.d06:meVE.LityBoth.poet	@ltx/en_uk_lash/poets:po.Anatoliou
ltx/en_uk_lash/me.m01.d06:meVE.LityBoth.text	
ltx/en_uk_lash/me.m01.d06:meVE.LityGlory.incipit	…
ltx/en_uk_lash/me.m01.d06:meVE.LityGlory.melody	
ltx/en_uk_lash/me.m01.d06:meVE.LityGlory.mode	@ltx/en_uk_lash/miscellanea:misc.Mode8
ltx/en_uk_lash/me.m01.d06:meVE.LityGlory.poet	@ltx/en_uk_lash/poets:po.IoannouMonachou
ltx/en_uk_lash/me.m01.d06:meVE.LityGlory.text	
ltx/en_uk_lash/me.m01.d06:meVE.MM.LityBothasGloryBoth.text	@ltx/en_uk_lash/properties:media.key
ltx/en_uk_lash/me.m01.d06:meVE.MM.Stichera1234as78910.text	@ltx/en_uk_lash/properties:media.key
ltx/en_uk_lash/me.m01.d06:meVE.MM.Stichera123as567.text	@ltx/en_uk_lash/properties:media.key
ltx/en_uk_lash/me.m01.d06:meVE.ProphecyTroparion1.incipit	…
ltx/en_uk_lash/me.m01.d06:meVE.ProphecyTroparion1.mode	@ltx/en_uk_lash/miscellanea:misc.Mode5
ltx/en_uk_lash/me.m01.d06:meVE.ProphecyTroparion1.text	
ltx/en_uk_lash/me.m01.d06:meVE.ProphecyTroparion1Refrain.incipit	…
ltx/en_uk_lash/me.m01.d06:meVE.ProphecyTroparion1Refrain.text	
ltx/en_uk_lash/me.m01.d06:meVE.ProphecyTroparion2.incipit	…
ltx/en_uk_lash/me.m01.d06:meVE.ProphecyTroparion2.mode	@ltx/en_uk_lash/miscellanea:misc.Mode6
ltx/en_uk_lash/me.m01.d06:meVE.ProphecyTroparion2.text	
ltx/en_uk_lash/me.m01.d06:meVE.ProphecyTroparion2Refrain.incipit	…
ltx/en_uk_lash/me.m01.d06:meVE.ProphecyTroparion2Refrain.text	
ltx/en_uk_lash/me.m01.d06:meVE.SticGlory.incipit	…
ltx/en_uk_lash/me.m01.d06:meVE.SticGlory.melody	
ltx/en_uk_lash/me.m01.d06:meVE.SticGlory.mode	@ltx/en_uk_lash/miscellanea:misc.Mode2
ltx/en_uk_lash/me.m01.d06:meVE.SticGlory.poet	@ltx/en_uk_lash/poets:po.Vyzantos
ltx/en_uk_lash/me.m01.d06:meVE.SticGlory.text	
ltx/en_uk_lash/me.m01.d06:meVE.Stichera01.incipit	…
ltx/en_uk_lash/me.m01.d06:meVE.Stichera01.melody	
ltx/en_uk_lash/me.m01.d06:meVE.Stichera01.mode	@ltx/en_uk_lash/miscellanea:misc.Mode2
ltx/en_uk_lash/me.m01.d06:meVE.Stichera01.poet	@ltx/en_uk_lash/poets:po.IoannouMonachou
ltx/en_uk_lash/me.m01.d06:meVE.Stichera01.text	
ltx/en_uk_lash/me.m01.d06:meVE.Stichera02.incipit	…
ltx/en_uk_lash/me.m01.d06:meVE.Stichera02.melody	
ltx/en_uk_lash/me.m01.d06:meVE.Stichera02.mode	@ltx/en_uk_lash/miscellanea:misc.Mode2
ltx/en_uk_lash/me.m01.d06:meVE.Stichera02.text	
ltx/en_uk_lash/me.m01.d06:meVE.Stichera03.incipit	…
ltx/en_uk_lash/me.m01.d06:meVE.Stichera03.melody	
ltx/en_uk_lash/me.m01.d06:meVE.Stichera03.mode	@ltx/en_uk_lash/miscellanea:misc.Mode2
ltx/en_uk_lash/me.m01.d06:meVE.Stichera03.text	
ltx/en_uk_lash/me.m01.d06:meVE.Stichera04.incipit	…
ltx/en_uk_lash/me.m01.d06:meVE.Stichera04.melody	
ltx/en_uk_lash/me.m01.d06:meVE.Stichera04.mode	@ltx/en_uk_lash/miscellanea:misc.Mode2
ltx/en_uk_lash/me.m01.d06:meVE.Stichera04.text	
