ltx/en_uk_lash/pe.d111:peDA.commemoration.full	
ltx/en_uk_lash/pe.d111:peDA.commemoration.short	
ltx/en_uk_lash/pe.d111:peDA.dismissal	@ltx/en_uk_lash/dismissals:dis00.ascension
ltx/en_uk_lash/pe.d111:peDA.insert1	
ltx/en_uk_lash/pe.d111:peDA.insert2	
ltx/en_uk_lash/pe.d111:peDA.note	
ltx/en_uk_lash/pe.d111:peHO.commemorations	
ltx/en_uk_lash/pe.d111:peHO.daytitle	
ltx/en_uk_lash/pe.d111:peHO.description1	
ltx/en_uk_lash/pe.d111:peHO.description2	
ltx/en_uk_lash/pe.d111:peHO.note1	
ltx/en_uk_lash/pe.d111:peHO.note2	
ltx/en_uk_lash/pe.d111:peMA.AposGlory.incipit	…
ltx/en_uk_lash/pe.d111:peMA.AposGlory.melody	@ltx/en_uk_lash/miscellanea:misc.Idiomelon
ltx/en_uk_lash/pe.d111:peMA.AposGlory.mode	@ltx/en_uk_lash/miscellanea:misc.Mode5
ltx/en_uk_lash/pe.d111:peMA.AposGlory.text	
ltx/en_uk_lash/pe.d111:peMA.Aposticha1.greekmelody	@ltx/en_uk_lash/he.a.m2:heAU.OikosTouEfratha.greekname
ltx/en_uk_lash/pe.d111:peMA.Aposticha1.incipit	…
ltx/en_uk_lash/pe.d111:peMA.Aposticha1.melody	@ltx/en_uk_lash/he.a.m2:heAU.OikosTouEfratha.name
ltx/en_uk_lash/pe.d111:peMA.Aposticha1.mode	@ltx/en_uk_lash/miscellanea:misc.Mode2
ltx/en_uk_lash/pe.d111:peMA.Aposticha1.text	
ltx/en_uk_lash/pe.d111:peMA.Aposticha2.incipit	…
ltx/en_uk_lash/pe.d111:peMA.Aposticha2.melody	@ltx/en_uk_lash/he.a.m2:heAU.OikosTouEfratha.name
ltx/en_uk_lash/pe.d111:peMA.Aposticha2.mode	@ltx/en_uk_lash/miscellanea:misc.Mode2
ltx/en_uk_lash/pe.d111:peMA.Aposticha2.text	
ltx/en_uk_lash/pe.d111:peMA.Aposticha3.incipit	…
ltx/en_uk_lash/pe.d111:peMA.Aposticha3.melody	@ltx/en_uk_lash/he.a.m2:heAU.OikosTouEfratha.name
ltx/en_uk_lash/pe.d111:peMA.Aposticha3.mode	@ltx/en_uk_lash/miscellanea:misc.Mode2
ltx/en_uk_lash/pe.d111:peMA.Aposticha3.text	
ltx/en_uk_lash/pe.d111:peMA.Kathisma11.greekmelody	@ltx/en_uk_lash/he.a.m8:heAU.ToProstachthen.greekname
ltx/en_uk_lash/pe.d111:peMA.Kathisma11.incipit	…
ltx/en_uk_lash/pe.d111:peMA.Kathisma11.melody	@ltx/en_uk_lash/he.a.m8:heAU.ToProstachthen.name
ltx/en_uk_lash/pe.d111:peMA.Kathisma11.mode	@ltx/en_uk_lash/miscellanea:misc.Mode8
ltx/en_uk_lash/pe.d111:peMA.Kathisma11.text	
ltx/en_uk_lash/pe.d111:peMA.Kathisma21.greekmelody	@ltx/en_uk_lash/pe.d110:peMA.Ode3Kathisma1.greekmelody
ltx/en_uk_lash/pe.d111:peMA.Kathisma21.incipit	@ltx/en_uk_lash/pe.d110:peMA.Ode3Kathisma1.incipit
ltx/en_uk_lash/pe.d111:peMA.Kathisma21.melody	@ltx/en_uk_lash/pe.d110:peMA.Ode3Kathisma1.melody
ltx/en_uk_lash/pe.d111:peMA.Kathisma21.mode	@ltx/en_uk_lash/pe.d110:peMA.Ode3Kathisma1.mode
ltx/en_uk_lash/pe.d111:peMA.Kathisma21.text	@ltx/en_uk_lash/pe.d110:peMA.Ode3Kathisma1.text
ltx/en_uk_lash/pe.d111:peVE.AposGlory.incipit	@ltx/en_uk_lash/pe.d110:peVE.Stichera03.incipit
ltx/en_uk_lash/pe.d111:peVE.AposGlory.melody	@ltx/en_uk_lash/pe.d110:peVE.Stichera03.melody
ltx/en_uk_lash/pe.d111:peVE.AposGlory.mode	@ltx/en_uk_lash/pe.d110:peVE.Stichera03.mode
ltx/en_uk_lash/pe.d111:peVE.AposGlory.text	@ltx/en_uk_lash/pe.d110:peVE.Stichera03.text
ltx/en_uk_lash/pe.d111:peVE.Aposticha1.greekmelody	@ltx/en_uk_lash/he.a.m2:heAU.OteEkTouXylou.greekname
ltx/en_uk_lash/pe.d111:peVE.Aposticha1.incipit	…
ltx/en_uk_lash/pe.d111:peVE.Aposticha1.melody	@ltx/en_uk_lash/he.a.m2:heAU.OteEkTouXylou.name
ltx/en_uk_lash/pe.d111:peVE.Aposticha1.mode	@ltx/en_uk_lash/miscellanea:misc.Mode2
ltx/en_uk_lash/pe.d111:peVE.Aposticha1.text	
ltx/en_uk_lash/pe.d111:peVE.Aposticha2.incipit	…
ltx/en_uk_lash/pe.d111:peVE.Aposticha2.melody	@ltx/en_uk_lash/he.a.m2:heAU.OteEkTouXylou.name
ltx/en_uk_lash/pe.d111:peVE.Aposticha2.mode	@ltx/en_uk_lash/miscellanea:misc.Mode2
ltx/en_uk_lash/pe.d111:peVE.Aposticha2.text	
ltx/en_uk_lash/pe.d111:peVE.Aposticha3.incipit	…
ltx/en_uk_lash/pe.d111:peVE.Aposticha3.melody	@ltx/en_uk_lash/he.a.m2:heAU.OteEkTouXylou.name
ltx/en_uk_lash/pe.d111:peVE.Aposticha3.mode	@ltx/en_uk_lash/miscellanea:misc.Mode2
ltx/en_uk_lash/pe.d111:peVE.Aposticha3.text	
ltx/en_uk_lash/pe.d111:peVE.SticGlory.incipit	@ltx/en_uk_lash/pe.d110:peVE.Aposticha1.incipit
ltx/en_uk_lash/pe.d111:peVE.SticGlory.melody	@ltx/en_uk_lash/pe.d110:peVE.Aposticha1.melody
ltx/en_uk_lash/pe.d111:peVE.SticGlory.mode	@ltx/en_uk_lash/pe.d110:peVE.Aposticha1.mode
ltx/en_uk_lash/pe.d111:peVE.SticGlory.text	@ltx/en_uk_lash/pe.d110:peVE.Aposticha1.text
ltx/en_uk_lash/pe.d111:peVE.Stichera01.incipit	@ltx/en_uk_lash/pe.d110:peVE.Lity1.incipit
ltx/en_uk_lash/pe.d111:peVE.Stichera01.melody	@ltx/en_uk_lash/pe.d110:peVE.Lity1.melody
ltx/en_uk_lash/pe.d111:peVE.Stichera01.mode	@ltx/en_uk_lash/pe.d110:peVE.Lity1.mode
ltx/en_uk_lash/pe.d111:peVE.Stichera01.text	@ltx/en_uk_lash/pe.d110:peVE.Lity1.text
ltx/en_uk_lash/pe.d111:peVE.Stichera02.incipit	@ltx/en_uk_lash/pe.d110:peVE.Lity2.incipit
ltx/en_uk_lash/pe.d111:peVE.Stichera02.melody	@ltx/en_uk_lash/pe.d110:peVE.Lity2.melody
ltx/en_uk_lash/pe.d111:peVE.Stichera02.mode	@ltx/en_uk_lash/pe.d110:peVE.Lity2.mode
ltx/en_uk_lash/pe.d111:peVE.Stichera02.text	@ltx/en_uk_lash/pe.d110:peVE.Lity2.text
ltx/en_uk_lash/pe.d111:peVE.Stichera03.incipit	@ltx/en_uk_lash/pe.d110:peVE.Lity3.incipit
ltx/en_uk_lash/pe.d111:peVE.Stichera03.melody	@ltx/en_uk_lash/pe.d110:peVE.Lity3.melody
ltx/en_uk_lash/pe.d111:peVE.Stichera03.mode	@ltx/en_uk_lash/pe.d110:peVE.Lity3.mode
ltx/en_uk_lash/pe.d111:peVE.Stichera03.text	@ltx/en_uk_lash/pe.d110:peVE.Lity3.text
