ltx/en_redirects_oak/menaion.verses:psLI.m09.d14.alleluia.title	@ltx/en_ke_oak/menaion.verses:psLI.m09.d14.alleluia.title
ltx/en_redirects_oak/menaion.verses:psLI.m09.d14.alleluia.v1.text	@ltx/en_uk_lash/menaion.verses:psLI.m09.d14.alleluia.v1.text
ltx/en_redirects_oak/menaion.verses:psLI.m09.d14.alleluia.v2.text	@ltx/en_uk_lash/menaion.verses:psLI.m09.d14.alleluia.v2.text
ltx/en_redirects_oak/menaion.verses:psLI.m09.d14.antiphon1.title	@ltx/en_ke_oak/menaion.verses:psLI.m09.d14.antiphon1.title
ltx/en_redirects_oak/menaion.verses:psLI.m09.d14.antiphon1.v1.text	@ltx/en_uk_lash/menaion.verses:psLI.m09.d14.antiphon1.v1.text
ltx/en_redirects_oak/menaion.verses:psLI.m09.d14.antiphon1.v2.text	@ltx/en_uk_lash/menaion.verses:psLI.m09.d14.antiphon1.v2.text
ltx/en_redirects_oak/menaion.verses:psLI.m09.d14.antiphon1.v3.text	@ltx/en_uk_lash/menaion.verses:psLI.m09.d14.antiphon1.v3.text
ltx/en_redirects_oak/menaion.verses:psLI.m09.d14.antiphon1.v4.text	@ltx/en_uk_lash/menaion.verses:psLI.m09.d14.antiphon1.v4.text
ltx/en_redirects_oak/menaion.verses:psLI.m09.d14.antiphon2.title	@ltx/en_ke_oak/menaion.verses:psLI.m09.d14.antiphon2.title
ltx/en_redirects_oak/menaion.verses:psLI.m09.d14.antiphon2.v1.text	@ltx/en_uk_lash/menaion.verses:psLI.m09.d14.antiphon2.v1.text
ltx/en_redirects_oak/menaion.verses:psLI.m09.d14.antiphon2.v2.text	@ltx/en_uk_lash/menaion.verses:psLI.m09.d14.antiphon2.v2.text
ltx/en_redirects_oak/menaion.verses:psLI.m09.d14.antiphon2.v3.text	@ltx/en_uk_lash/menaion.verses:psLI.m09.d14.antiphon2.v3.text
ltx/en_redirects_oak/menaion.verses:psLI.m09.d14.antiphon2.v4.text	@ltx/en_uk_lash/menaion.verses:psLI.m09.d14.antiphon2.v4.text
ltx/en_redirects_oak/menaion.verses:psLI.m09.d14.antiphon3.title	@ltx/en_ke_oak/menaion.verses:psLI.m09.d14.antiphon3.title
ltx/en_redirects_oak/menaion.verses:psLI.m09.d14.antiphon3.v1.text	@ltx/en_uk_lash/menaion.verses:psLI.m09.d14.antiphon3.v1.text
ltx/en_redirects_oak/menaion.verses:psLI.m09.d14.antiphon3.v2.text	@ltx/en_uk_lash/menaion.verses:psLI.m09.d14.antiphon3.v2.text
ltx/en_redirects_oak/menaion.verses:psLI.m09.d14.antiphon3.v3.text	@ltx/en_uk_lash/menaion.verses:psLI.m09.d14.antiphon3.v3.text
ltx/en_redirects_oak/menaion.verses:psLI.m09.d14.entrance.v1.text	@ltx/en_uk_lash/menaion.verses:psLI.m09.d14.entrance.v1.text
ltx/en_redirects_oak/menaion.verses:psLI.m09.d14.prokeimenon.title	@ltx/en_uk_thyateira/menaion.verses:psLI.m09.d14.prokeimenon.title
ltx/en_redirects_oak/menaion.verses:psLI.m09.d14.prokeimenon.v1.text	@ltx/en_uk_lash/menaion.verses:psLI.m09.d14.prokeimenon.v1.text
ltx/en_redirects_oak/menaion.verses:psLI.m09.d14.prokeimenon.v2.text	@ltx/en_uk_lash/menaion.verses:psLI.m09.d14.prokeimenon.v2.text
