ltx/en_ke_oak/titles:ti.Alleluia	Alleluia.
ltx/en_ke_oak/titles:ti.Antiphon1	Antiphon I
ltx/en_ke_oak/titles:ti.Antiphon2	Antiphon II
ltx/en_ke_oak/titles:ti.Antiphon3	Antiphon III
ltx/en_ke_oak/titles:ti.Apolytikion	Apolytikion.
ltx/en_ke_oak/titles:ti.Cross	For the Cross.
ltx/en_ke_oak/titles:ti.EntranceHymn	Entrance Hymn
ltx/en_ke_oak/titles:ti.Epistle	The Epistle
ltx/en_ke_oak/titles:ti.HymnToTheotokos	Hymn to the Theotokos.
ltx/en_ke_oak/titles:ti.Kontakion	Kontakion.
ltx/en_ke_oak/titles:ti.OrModeOfWeek	(Or Mode of the week)
ltx/en_ke_oak/titles:ti.Prokeimenon	Prokeimenon.
ltx/en_ke_oak/titles:ti.Readings	The Readings from the New Testament
ltx/en_ke_oak/titles:ti.eclog.Pentecost.title	for Pentecost
ltx/en_ke_oak/titles:ti.eclog.title1	Selected Psalm Verses
ltx/en_ke_oak/titles:ti.sourcePentecostarion	From the Pentecostarion.
