<svg width="80" height="80" viewBox="0 0 80 80" fill="none" xmlns="http://www.w3.org/2000/svg">
<g clip-path="url(#clip0)">
<path d="M40.1214 34.1823C39.2016 34.3327 38.4257 35.0342 38.2283 35.9993L37.8775 37.7152C37.5797 37.8378 38.1446 37.5413 29.2087 42.4196C28.1577 42.9934 27.4138 43.9948 27.1682 45.1676L26.9507 46.2058C26.2752 46.2477 25.6886 46.7326 25.5442 47.4218L25.1093 49.4978C24.9358 50.3266 25.4682 51.141 26.2966 51.3144L27.345 51.534C27.3805 51.6054 27.419 51.6754 27.463 51.7434C27.7544 52.189 28.2004 52.494 28.7191 52.6026L34.4929 53.8121C34.9364 53.9048 35.3709 53.6207 35.464 53.1772C35.5567 52.7337 35.2726 52.2992 34.8291 52.2061L29.0553 50.997C28.8631 50.9568 28.7481 50.7628 28.7857 50.5843L29.3476 47.902C29.3839 47.729 29.5633 47.591 29.7598 47.632L45.776 50.9867C45.9674 51.0269 46.0824 51.2247 46.046 51.399L45.4842 54.0817C45.4838 54.0826 45.4834 54.083 45.4834 54.0838C45.4462 54.2556 45.268 54.3923 45.0715 54.3513L38.5761 52.9909C38.1326 52.8982 37.6981 53.1823 37.6049 53.6258C37.5122 54.0693 37.7963 54.5038 38.2398 54.597L44.7353 55.9573C45.3244 56.0804 45.9362 55.9368 46.4225 55.5296L47.4709 55.7492C48.2972 55.9218 49.1137 55.3929 49.2876 54.5619L49.7225 52.4859C49.828 51.9805 49.6768 51.4511 49.2888 51.0717L49.5358 49.8913C49.7879 48.6894 49.4909 47.4508 48.721 46.4938C42.1273 38.2958 42.5905 38.8598 42.4008 38.6628L42.7563 36.9252C42.9536 35.96 42.5149 35.0098 41.7283 34.5108L43.9824 23.487C46.4468 11.4335 37.3067 0.115357 24.9939 0.00256348C24.9772 0.00170899 24.9606 0 24.9439 0C24.9217 0 24.8999 0.000854493 24.8777 0.000854493C24.8555 0.000854493 24.8337 0 24.8115 0C24.7948 0 24.7782 0.00170899 24.7615 0.00256348C12.4589 0.115357 3.30646 11.4237 5.77295 23.487L8.02668 34.5104C7.24054 35.0098 6.80176 35.9596 6.99915 36.9252L7.35462 38.6628C7.16449 38.8602 7.62592 38.2984 1.03436 46.4938C0.264464 47.4508 -0.0324724 48.689 0.219176 49.8913L0.466551 51.0717C0.386656 51.1499 0.313597 51.2362 0.251219 51.3319C0.0264876 51.6759 -0.050844 52.0856 0.0328962 52.4859L0.467833 54.5619C0.641295 55.3904 1.45605 55.9231 2.28448 55.7497L3.33295 55.5301C3.81873 55.9372 4.43268 56.0804 5.02014 55.9573L11.1122 54.6815C11.5557 54.5884 11.8399 54.1539 11.7471 53.7104C11.654 53.2669 11.2186 52.9837 10.776 53.0755L4.6839 54.3517C4.48737 54.3923 4.30835 54.2556 4.27161 54.083C4.27161 54.0826 4.27118 54.0821 4.27118 54.0821L3.70935 51.3994C3.67346 51.2273 3.78583 51.0273 3.97894 50.9871L19.9956 47.6324C20.187 47.5927 20.3715 47.7277 20.4078 47.902L20.9697 50.5847C20.9701 50.5851 20.9701 50.586 20.9701 50.5864C21.0073 50.765 20.8906 50.9572 20.7001 50.9974L14.523 52.2907C14.0795 52.3838 13.7954 52.8183 13.8881 53.2618C13.9812 53.7053 14.4161 53.9894 14.8592 53.8967L21.0363 52.603C21.5554 52.4945 22.0015 52.189 22.2924 51.7434C22.3364 51.6759 22.3749 51.6058 22.4104 51.5345L23.4588 51.3148C24.2872 51.1414 24.82 50.3271 24.6461 49.4982L24.2112 47.4222C24.0676 46.7365 23.4845 46.2481 22.8047 46.2063L22.5872 45.1676C22.342 43.9953 21.5977 42.9938 20.5467 42.42C11.613 37.543 12.1752 37.8382 11.8779 37.7152L11.5271 35.9998C11.3297 35.0351 10.5534 34.3335 9.63398 34.1827L7.38025 23.1589C5.11157 12.0624 13.5689 1.6825 24.8777 1.64148C36.2002 1.6825 44.6408 12.0753 42.3751 23.1585L40.1214 34.1823ZM40.4923 35.7921C40.9178 35.7921 41.2335 36.1835 41.1489 36.5962C40.7315 38.6372 40.6222 39.1721 40.5166 39.6886C40.453 39.9997 40.1774 40.2252 39.8617 40.2252C39.4336 40.2252 39.1191 39.8322 39.2033 39.4203L39.8356 36.3279C39.9005 36.0109 40.1808 35.7921 40.4923 35.7921ZM27.128 47.8618L27.6565 47.9725C27.4916 48.7595 27.5728 48.3711 27.2652 49.8413L26.7367 49.7306L27.128 47.8618ZM47.7033 54.1219L47.1753 54.0112C47.2616 53.5989 47.4799 52.5551 47.5666 52.1424L48.0947 52.2531L47.7033 54.1219ZM47.4427 47.5222C47.9033 48.0947 48.081 48.8355 47.9302 49.555L47.7324 50.5009L47.4867 50.4497C47.2253 49.9203 46.7339 49.511 46.1127 49.3811L30.0965 46.0264C29.5791 45.9183 29.0502 46.0178 28.6054 46.3067L28.7738 45.5039C28.9207 44.8023 29.3659 44.2029 29.9948 43.8594L37.5567 39.7313C37.6477 40.9114 38.6316 41.8654 39.8617 41.8654C40.7302 41.8654 41.5087 41.3728 41.9013 40.632L47.4427 47.5222ZM2.05206 54.1219L1.66028 52.2531L2.18878 52.1424L2.4964 53.6113L2.58014 54.0112L2.05206 54.1219ZM22.4902 49.8413C22.1771 48.3468 22.2091 48.4984 22.0989 47.9725L22.327 47.9246C22.327 47.9246 22.627 47.8618 22.6274 47.8618L23.0188 49.7306L22.4902 49.8413ZM19.7606 43.8594C20.3895 44.2029 20.8347 44.8023 20.9816 45.5039L21.1495 46.3067C20.724 46.0302 20.1938 45.9149 19.6589 46.0264L3.6427 49.3811C3.02148 49.511 2.53015 49.9203 2.26868 50.4497L2.02301 50.5009L1.82519 49.555C1.67438 48.8355 1.85211 48.0947 2.31268 47.5222L7.85364 40.6324C8.94013 42.6811 12.0219 42.0269 12.1987 39.7313L19.7606 43.8594ZM10.5521 39.4203C10.626 39.7826 10.3919 40.1372 10.0305 40.2111C9.66559 40.2859 9.31141 40.0441 9.23877 39.689C8.98371 38.4406 9.3238 40.1035 8.60645 36.5966C8.52228 36.1843 8.83674 35.7921 9.2627 35.7921C9.57459 35.7921 9.85486 36.0113 9.9198 36.3279L10.5521 39.4203Z" fill="#EA442E" stroke="#EA442E" stroke-width="0.2"/>
</g>
<defs>
<clipPath id="clip0">
<rect width="56" height="56" fill="white"/>
</clipPath>
</defs>
</svg>
