<svg width="80" height="80" viewBox="0 0 80 80" fill="none" xmlns="http://www.w3.org/2000/svg">
<path d="M38.6482 10.7624V8.2527H39.4145C40.9354 8.2527 42.1725 7.01521 42.1725 5.4943V2.75802C42.1725 1.23749 40.9354 0 39.4145 0H13.8439C12.323 0 11.0859 1.23749 11.0859 2.75802V5.4943C11.0859 7.01521 12.323 8.2527 13.8439 8.2527H14.6099V10.7624C11.4235 11.2362 8.97101 13.9892 8.97101 17.3053V20.2404H2.61039C1.17111 20.2404 0 21.4115 0 22.8508V25.2384C0 26.4938 0.89073 27.5447 2.07328 27.7931V46.7612C2.07328 48.5469 3.5263 49.9999 5.31234 49.9999H37.6716C41.3196 49.9999 44.287 47.0325 44.287 43.3848V17.305C44.287 13.9892 41.8346 11.2358 38.6482 10.7624ZM13.039 5.4943V2.75802C13.039 2.31437 13.3999 1.95312 13.8439 1.95312H39.4145C39.8586 1.95312 40.2194 2.31437 40.2194 2.75802V5.4943C40.2194 5.93833 39.8586 6.29958 39.4145 6.29958H13.8439C13.3999 6.29958 13.039 5.93833 13.039 5.4943ZM36.695 8.2527V10.6899H16.563V8.2527H36.695ZM1.95312 22.8504C1.95312 22.4945 2.2541 22.1935 2.61039 22.1935H18.2884C18.6443 22.1935 18.9453 22.4945 18.9453 22.8504V25.2384C18.9453 25.5947 18.6443 25.8956 18.2884 25.8956H2.61039C2.248 25.8956 1.95312 25.6008 1.95312 25.2384V22.8504ZM16.872 40.3175H9.01945C8.73106 40.3175 8.48769 40.0741 8.48769 39.7857V34.3192C8.48769 34.0308 8.73144 33.7875 9.01945 33.7875H16.872V40.3175ZM4.02641 46.7612V27.8488H16.872V31.8343H9.01945C7.64922 31.8343 6.53456 32.949 6.53456 34.3189V39.7857C6.53456 41.1559 7.64922 42.2706 9.01945 42.2706H16.872V46.7612C16.872 47.47 16.2952 48.0468 15.5864 48.0468H5.31234C4.60319 48.0468 4.02641 47.47 4.02641 46.7612ZM37.6716 48.0468H18.5585C18.7297 47.6523 18.8251 47.2178 18.8251 46.7612V27.7931C20.0077 27.5447 20.8984 26.4938 20.8984 25.2384V22.8504C20.8984 21.4111 19.7277 20.2404 18.2884 20.2404H10.9245V17.305C10.9245 14.7342 13.0157 12.643 15.5868 12.643H37.672C40.2305 12.643 42.3133 14.7148 42.3331 17.2691H30.6831C28.0609 17.2691 25.9281 19.4023 25.9281 22.0241V26.4385C25.9281 26.9779 26.3652 27.415 26.9046 27.415C27.4436 27.415 27.8812 26.9779 27.8812 26.4385V22.0241C27.8812 20.4792 29.1381 19.2222 30.6831 19.2222H42.3339V41.4676H30.6831C29.1381 41.4676 27.8812 40.2106 27.8812 38.6657V34.251C27.8812 33.7119 27.4436 33.2744 26.9046 33.2744C26.3652 33.2744 25.9281 33.7119 25.9281 34.251V38.6657C25.9281 41.2875 28.0612 43.4207 30.6831 43.4207H42.3331C42.3133 45.9746 40.2305 48.0468 37.6716 48.0468Z" fill="#EA442E"/>
<path fill-rule="evenodd" clip-rule="evenodd" d="M29.7363 31.3213C30.2746 31.3213 30.7133 30.8826 30.7133 30.3447C30.7133 29.8069 30.2746 29.3682 29.7363 29.3682C29.1985 29.3682 28.7598 29.8069 28.7598 30.3447C28.7598 30.8826 29.1988 31.3213 29.7363 31.3213Z" fill="#EA442E"/>
</svg>
