%YAML 1.1
%TAG !u! tag:unity3d.com,2011:
--- !u!74 &7400000
AnimationClip:
  m_ObjectHideFlags: 0
  m_CorrespondingSourceObject: {fileID: 0}
  m_PrefabInstance: {fileID: 0}
  m_PrefabAsset: {fileID: 0}
  m_Name: Snake_Idle
  serializedVersion: 6
  m_Legacy: 0
  m_Compressed: 0
  m_UseHighQualityCurve: 1
  m_RotationCurves: []
  m_CompressedRotationCurves: []
  m_EulerCurves: []
  m_PositionCurves: []
  m_ScaleCurves: []
  m_FloatCurves: []
  m_PPtrCurves:
  - curve:
    - time: 0
      value: {fileID: 21300000, guid: 6da52c6bf09956147922e65b54e91073, type: 3}
    - time: 0.083333336
      value: {fileID: 21300000, guid: 291bc8b41b226a141b0213eae261dc8f, type: 3}
    - time: 0.16666667
      value: {fileID: 21300000, guid: d3111f949f1aef24d848ce410ccf273a, type: 3}
    - time: 0.25
      value: {fileID: 21300000, guid: 100db2a392386ad4398674b769665ac6, type: 3}
    - time: 0.33333334
      value: {fileID: 21300000, guid: 3c8e600b7b34d9448ba8b5d66434c575, type: 3}
    - time: 0.41666666
      value: {fileID: 21300000, guid: 181d52be063d9b64993a74755ea125e5, type: 3}
    - time: 0.5
      value: {fileID: 21300000, guid: f2d5c671e8069b24493e2a023cc54518, type: 3}
    - time: 0.5833333
      value: {fileID: 21300000, guid: 8a126878e3d3b9a448255420fb89c266, type: 3}
    - time: 0.6666667
      value: {fileID: 21300000, guid: 330e883d68bfa134c883e21960e1028e, type: 3}
    - time: 0.75
      value: {fileID: 21300000, guid: eda9fe4701a71c84a9ab51539b608b61, type: 3}
    - time: 0.8333333
      value: {fileID: 21300000, guid: b2c23cac8b8fe8a439e349ee91d8b862, type: 3}
    - time: 0.9166667
      value: {fileID: 21300000, guid: 1c6e4dd04fc751547a16954097e76be3, type: 3}
    - time: 1
      value: {fileID: 21300000, guid: a427d5a9ab99aad479046fb13d38eb26, type: 3}
    - time: 1.0833334
      value: {fileID: 21300000, guid: c761e1e9d738d174585c0fec26c30c6a, type: 3}
    - time: 1.1666666
      value: {fileID: 21300000, guid: 667ffe8ea92ca354990bee1d1c8b869f, type: 3}
    - time: 1.25
      value: {fileID: 21300000, guid: 91748b20ca7cb2343b7b48cc32af0ed9, type: 3}
    - time: 1.3333334
      value: {fileID: 21300000, guid: f274e3543b1baf849a69d0687e6a4e1a, type: 3}
    - time: 1.4166666
      value: {fileID: 21300000, guid: dbde9de6589cbd448a1fa75314dfcb25, type: 3}
    - time: 1.5
      value: {fileID: 21300000, guid: 6fd8ee2b35fd54f45873c6a5d56b8b21, type: 3}
    - time: 1.5833334
      value: {fileID: 21300000, guid: e70eabbe4ca3cc94cb7f3651f1f44885, type: 3}
    - time: 1.6666666
      value: {fileID: 21300000, guid: f53432f1bb69d914ebd9340d6cbefeb6, type: 3}
    - time: 1.75
      value: {fileID: 21300000, guid: 9efca9748ac08f846876b6c40628378e, type: 3}
    - time: 1.8333334
      value: {fileID: 21300000, guid: 3911950b8b0456b428c98eb37c9cc6db, type: 3}
    - time: 1.9166666
      value: {fileID: 21300000, guid: 256e42c4f493e244a80f72d2631c5e8a, type: 3}
    - time: 2
      value: {fileID: 21300000, guid: da56e49e3e784a94993a8ebb44b51c5f, type: 3}
    attribute: m_Sprite
    path: 
    classID: 212
    script: {fileID: 0}
  m_SampleRate: 12
  m_WrapMode: 0
  m_Bounds:
    m_Center: {x: 0, y: 0, z: 0}
    m_Extent: {x: 0, y: 0, z: 0}
  m_ClipBindingConstant:
    genericBindings:
    - serializedVersion: 2
      path: 0
      attribute: 0
      script: {fileID: 0}
      typeID: 212
      customType: 23
      isPPtrCurve: 1
    pptrCurveMapping:
    - {fileID: 21300000, guid: 6da52c6bf09956147922e65b54e91073, type: 3}
    - {fileID: 21300000, guid: 291bc8b41b226a141b0213eae261dc8f, type: 3}
    - {fileID: 21300000, guid: d3111f949f1aef24d848ce410ccf273a, type: 3}
    - {fileID: 21300000, guid: 100db2a392386ad4398674b769665ac6, type: 3}
    - {fileID: 21300000, guid: 3c8e600b7b34d9448ba8b5d66434c575, type: 3}
    - {fileID: 21300000, guid: 181d52be063d9b64993a74755ea125e5, type: 3}
    - {fileID: 21300000, guid: f2d5c671e8069b24493e2a023cc54518, type: 3}
    - {fileID: 21300000, guid: 8a126878e3d3b9a448255420fb89c266, type: 3}
    - {fileID: 21300000, guid: 330e883d68bfa134c883e21960e1028e, type: 3}
    - {fileID: 21300000, guid: eda9fe4701a71c84a9ab51539b608b61, type: 3}
    - {fileID: 21300000, guid: b2c23cac8b8fe8a439e349ee91d8b862, type: 3}
    - {fileID: 21300000, guid: 1c6e4dd04fc751547a16954097e76be3, type: 3}
    - {fileID: 21300000, guid: a427d5a9ab99aad479046fb13d38eb26, type: 3}
    - {fileID: 21300000, guid: c761e1e9d738d174585c0fec26c30c6a, type: 3}
    - {fileID: 21300000, guid: 667ffe8ea92ca354990bee1d1c8b869f, type: 3}
    - {fileID: 21300000, guid: 91748b20ca7cb2343b7b48cc32af0ed9, type: 3}
    - {fileID: 21300000, guid: f274e3543b1baf849a69d0687e6a4e1a, type: 3}
    - {fileID: 21300000, guid: dbde9de6589cbd448a1fa75314dfcb25, type: 3}
    - {fileID: 21300000, guid: 6fd8ee2b35fd54f45873c6a5d56b8b21, type: 3}
    - {fileID: 21300000, guid: e70eabbe4ca3cc94cb7f3651f1f44885, type: 3}
    - {fileID: 21300000, guid: f53432f1bb69d914ebd9340d6cbefeb6, type: 3}
    - {fileID: 21300000, guid: 9efca9748ac08f846876b6c40628378e, type: 3}
    - {fileID: 21300000, guid: 3911950b8b0456b428c98eb37c9cc6db, type: 3}
    - {fileID: 21300000, guid: 256e42c4f493e244a80f72d2631c5e8a, type: 3}
    - {fileID: 21300000, guid: da56e49e3e784a94993a8ebb44b51c5f, type: 3}
  m_AnimationClipSettings:
    serializedVersion: 2
    m_AdditiveReferencePoseClip: {fileID: 0}
    m_AdditiveReferencePoseTime: 0
    m_StartTime: 0
    m_StopTime: 2.0833333
    m_OrientationOffsetY: 0
    m_Level: 0
    m_CycleOffset: 0
    m_HasAdditiveReferencePose: 0
    m_LoopTime: 1
    m_LoopBlend: 0
    m_LoopBlendOrientation: 0
    m_LoopBlendPositionY: 0
    m_LoopBlendPositionXZ: 0
    m_KeepOriginalOrientation: 0
    m_KeepOriginalPositionY: 1
    m_KeepOriginalPositionXZ: 0
    m_HeightFromFeet: 0
    m_Mirror: 0
  m_EditorCurves: []
  m_EulerEditorCurves: []
  m_HasGenericRootTransform: 0
  m_HasMotionFloatCurves: 0
  m_Events: []
