{
    "MonoBehaviour": {
        "m_Enabled": true,
        "m_EditorHideFlags": 0,
        "m_Name": "",
        "m_EditorClassIdentifier": "",
        "Verbose": false,
        "autoUpdaterEnabled": true,
        "launchAfterInstallation": true,
        "HideSendToUnityMenu": true,
        "BakeAnimation": true,
        "IntegrationSavePath": "D:\\Utenti\\arong\\Documents\\GitHub\\unity-zombie-defence-fps-example",
        "selectedDCCApp": 0,
        "prefabSavePaths": [
            "."
        ],
        "fbxSavePaths": [
            "."
        ],
        "selectedFbxPath": 0,
        "selectedPrefabPath": 0,
        "dccOptionNames": [],
        "dccOptionPaths": [],
        "exportModelSettingsSerialize": {
            "exportFormat": 0,
            "rootMotionTransfer": "",
            "animatedSkinnedMesh": false,
            "mayaCompatibleNaming": true,
            "include": 2,
            "lodLevel": 0,
            "objectPosition": 0,
            "exportUnrendered": true
        },
        "convertToPrefabSettingsSerialize": {
            "exportFormat": 0,
            "rootMotionTransfer": "",
            "animatedSkinnedMesh": false,
            "mayaCompatibleNaming": true
        }
    }
}