{
    "$schema": "http://json-schema.org/draft-07/schema",
    "type": "object",
    "title": "User",
    "description": "Usuario",
    "required": [
        "username",
        "email",
        "password"
    ],
    "additionalProperties": false,
    "properties": {
        "id": {
            "$id": "#/properties/id",
            "type": "integer",
            "title": "ID do Usuario na Database"
        },
        "email": {
            "$id": "#/properties/email",
            "type": "string",
            "title": "Email do usuario, precisa ser unico",
            "examples": [
                "douglas.souzag@hotmail.com"
            ]
        },
        "username": {
            "$id": "#/properties/username",
            "type": "string",
            "title": "Nome do usuario",
            "examples": [
                "Douglas"
            ]
        },
        "password": {
          "$id": "#/properties/password",
          "type": "string",
          "title": "Hash da senha do usuario"
        },
        "created_at": {
            "$id": "#/properties/created_at",
            "type": "string",
            "title": "Data de criação do usuario"
        },
        "updated_at": {
            "$id": "#/properties/updated_at",
            "type": "string",
            "title": "Data de atualização do usuario"
        }
    }
  }