
   Tea Version    1.000
       MPI Version
    OpenMP Version
   Task Count    512
 Thread Count:     1


   Tea Version    1.000
       MPI Version
    OpenMP Version
   Task Count    512
 Thread Count:     1

 Output file tea.out opened. All output will go there.
 Step       1 time   0.0000000 timestep   4.00E-03
Conduction error  0.1427587E-19
Iteration count     1339
      Solve Time    3.9876639843    Its   1339     Time Per It    0.0029780911
 Wall clock    3.9891979694366455     
 Average time per cell    2.4932487308979037E-007
 Step time per cell       2.4932281672954557E-007
 Step       2 time   0.0040000 timestep   4.00E-03
Conduction error  0.4949727E-16
Iteration count     1303
      Solve Time    3.1097171307    Its   1303     Time Per It    0.0023865826
 Wall clock    7.0996398925781250     
 Average time per cell    2.2186374664306639E-007
 Step time per cell       1.9437624514102935E-007
 Step       3 time   0.0080000 timestep   4.00E-03
Conduction error  0.1764605E-15
Iteration count     1281
      Solve Time    3.0649969578    Its   1281     Time Per It    0.0023926596
 Wall clock    10.164909839630127     
 Average time per cell    2.1176895499229432E-007
 Step time per cell       1.9157786667346953E-007
 Step       4 time   0.0120000 timestep   4.00E-03
Conduction error  0.3080600E-15
Iteration count     1270
      Solve Time    2.8950939178    Its   1270     Time Per It    0.0022796015
 Wall clock    13.061043977737427     
 Average time per cell    2.0407881215214730E-007
 Step time per cell       1.8098132312297820E-007
 Step       5 time   0.0160000 timestep   4.00E-03
Conduction error  0.4176984E-15
Iteration count     1261
      Solve Time    3.0425219536    Its   1261     Time Per It    0.0024127851
 Wall clock    16.104460954666138     
 Average time per cell    2.0130576193332673E-007
 Step time per cell       1.9018663465976715E-007
 Step       6 time   0.0200000 timestep   4.00E-03
Conduction error  0.5438417E-15
Iteration count     1249
      Solve Time    2.8195419312    Its   1249     Time Per It    0.0022574395
 Wall clock    18.924873828887939     
 Average time per cell    1.9713410238424937E-007
 Step time per cell       1.7624899744987489E-007
 Step       7 time   0.0240000 timestep   4.00E-03
Conduction error  0.6257000E-15
Iteration count     1247
      Solve Time    3.0018911362    Its   1247     Time Per It    0.0024072904
 Wall clock    21.927497863769531     
 Average time per cell    1.9578123092651366E-007
 Step time per cell       1.8763718008995055E-007
 Step       8 time   0.0280000 timestep   4.00E-03
Conduction error  0.7317226E-15
Iteration count     1247
      Solve Time    3.0036430359    Its   1247     Time Per It    0.0024086953
 Wall clock    24.931392908096313     
 Average time per cell    1.9477650709450244E-007
 Step time per cell       1.8774168193340301E-007
 Step       9 time   0.0320000 timestep   4.00E-03
Conduction error  0.8378877E-15
Iteration count     1247
      Solve Time    2.8117971420    Its   1247     Time Per It    0.0022548494
 Wall clock    27.744059801101685     
 Average time per cell    1.9266708195209504E-007
 Step time per cell       1.7576499283313751E-007
 Step      10 time   0.0360000 timestep   4.00E-03
Conduction error  0.9227803E-15
Iteration count     1247
      Solve Time    2.9712181091    Its   1247     Time Per It    0.0023826930
 Wall clock    30.716508865356445     
 Average time per cell    1.9197818040847779E-007
 Step time per cell       1.8574973940849303E-007
Test problem   5 is within   0.1060101E-08% of the expected solution
 This test is considered PASSED
 First step overhead  0.87914514541625977     
 Wall clock    30.717552900314331     

Profiler Output                 Time            Percentage
Timestep              :          0.0100          0.0325
Halo Exchange         :          0.0021          0.0070
Summary               :          0.0018          0.0059
Visit                 :          0.0000          0.0000
Tea Init              :          0.0164          0.0534
Dot Product           :          0.0025          0.0082
Tea Solve             :         30.6865         99.8989
Tea Reset             :          0.0014          0.0046
Set Field             :          0.0000          0.0001
Total                 :         30.7208        100.0106
The Rest              :         -0.0033         -0.0106
************************************************************************************************************************
***             WIDEN YOUR WINDOW TO 120 CHARACTERS.  Use 'enscript -r -fCourier9' to print this document            ***
************************************************************************************************************************

---------------------------------------------- PETSc Performance Summary: ----------------------------------------------

./tea_leaf_gnu on a  named cn09 with 512 processors, by jdshanks Wed Apr 29 15:05:11 2020
Using Petsc Release Version 3.13.0, Mar 29, 2020 

                         Max       Max/Min     Avg       Total 
Time (sec):           3.077e+01     1.000   3.077e+01
Objects:              3.600e+01     1.000   3.600e+01
Flop:                 1.189e+10     1.001   1.189e+10  6.089e+12
Flop/sec:             3.866e+08     1.001   3.866e+08  1.979e+11
MPI Messages:         5.082e+04     2.000   4.844e+04  2.480e+07
MPI Message Lengths:  7.621e+07     2.000   1.508e+03  3.739e+10
MPI Reductions:       3.816e+04     1.000

Flop counting convention: 1 flop = 1 real number operation of type (multiply/divide/add/subtract)
                            e.g., VecAXPY() for real vectors of length N --> 2N flop
                            and VecAXPY() for complex vectors of length N --> 8N flop

Summary of Stages:   ----- Time ------  ----- Flop ------  --- Messages ---  -- Message Lengths --  -- Reductions --
                        Avg     %Total     Avg     %Total    Count   %Total     Avg         %Total    Count   %Total 
 0:      Main Stage: 3.0767e+01 100.0%  6.0895e+12 100.0%  2.480e+07 100.0%  1.508e+03      100.0%  3.815e+04 100.0% 

------------------------------------------------------------------------------------------------------------------------
See the 'Profiling' chapter of the users' manual for details on interpreting output.
Phase summary info:
   Count: number of times phase was executed
   Time and Flop: Max - maximum over all processors
                  Ratio - ratio of maximum to minimum over all processors
   Mess: number of messages sent
   AvgLen: average message length (bytes)
   Reduct: number of global reductions
   Global: entire computation
   Stage: stages of a computation. Set stages with PetscLogStagePush() and PetscLogStagePop().
      %T - percent time in this phase         %F - percent flop in this phase
      %M - percent messages in this phase     %L - percent message lengths in this phase
      %R - percent reductions in this phase
   Total Mflop/s: 10e-6 * (sum of flop over all processors)/(max time over all processors)
------------------------------------------------------------------------------------------------------------------------
Event                Count      Time (sec)     Flop                              --- Global ---  --- Stage ----  Total
                   Max Ratio  Max     Ratio   Max  Ratio  Mess   AvgLen  Reduct  %T %F %M %L %R  %T %F %M %L %R Mflop/s
------------------------------------------------------------------------------------------------------------------------

--- Event Stage 0: Main Stage

BuildTwoSided         13 1.0 7.5907e-03 1.9 0.00e+00 0.0 3.9e+03 4.0e+00 1.3e+01  0  0  0  0  0   0  0  0  0  0     0
BuildTwoSidedF        11 1.0 6.6232e-03 2.2 0.00e+00 0.0 0.0e+00 0.0e+00 1.1e+01  0  0  0  0  0   0  0  0  0  0     0
DMCreateMat            1 1.0 2.3458e-02 1.0 0.00e+00 0.0 3.9e+03 3.8e+02 8.0e+00  0  0  0  0  0   0  0  0  0  0     0
SFSetGraph             2 1.0 8.7070e-05 1.3 0.00e+00 0.0 0.0e+00 0.0e+00 0.0e+00  0  0  0  0  0   0  0  0  0  0     0
SFSetUp                2 1.0 2.1382e-03 1.3 0.00e+00 0.0 7.8e+03 3.8e+02 2.0e+00  0  0  0  0  0   0  0  0  0  0     0
SFBcastOpBegin     12701 1.0 3.3657e-01 1.7 0.00e+00 0.0 2.5e+07 1.5e+03 0.0e+00  1  0100100  0   1  0100100  0     0
SFBcastOpEnd       12701 1.0 2.2441e-01 2.4 0.00e+00 0.0 0.0e+00 0.0e+00 0.0e+00  0  0  0  0  0   0  0  0  0  0     0
SFPack             12701 1.0 5.8061e-02 1.7 0.00e+00 0.0 0.0e+00 0.0e+00 0.0e+00  0  0  0  0  0   0  0  0  0  0     0
SFUnpack           12701 1.0 7.4604e-03 3.6 0.00e+00 0.0 0.0e+00 0.0e+00 0.0e+00  0  0  0  0  0   0  0  0  0  0     0
VecTDot            25402 1.0 4.4063e+00 1.1 1.59e+09 1.0 0.0e+00 0.0e+00 2.5e+04 13 13  0  0 67  13 13  0  0 67 184475
VecNorm            12711 1.0 3.9265e+00 1.3 7.94e+08 1.0 0.0e+00 0.0e+00 1.3e+04 12  7  0  0 33  12  7  0  0 33 103593
VecCopy               20 1.0 1.8428e-03 1.1 0.00e+00 0.0 0.0e+00 0.0e+00 0.0e+00  0  0  0  0  0   0  0  0  0  0     0
VecSet             12742 1.0 3.5834e-01 1.1 0.00e+00 0.0 0.0e+00 0.0e+00 0.0e+00  1  0  0  0  0   1  0  0  0  0     0
VecAXPY            25402 1.0 2.4088e+00 1.3 1.59e+09 1.0 0.0e+00 0.0e+00 0.0e+00  6 13  0  0  0   6 13  0  0  0 337451
VecAYPX            12691 1.0 9.0593e-01 1.1 7.93e+08 1.0 0.0e+00 0.0e+00 0.0e+00  3  7  0  0  0   3  7  0  0  0 448283
VecScatterBegin    12701 1.0 3.6870e-01 1.6 0.00e+00 0.0 2.5e+07 1.5e+03 0.0e+00  1  0100100  0   1  0100100  0     0
VecScatterEnd      12701 1.0 2.4686e-01 2.2 0.00e+00 0.0 0.0e+00 0.0e+00 0.0e+00  1  0  0  0  0   1  0  0  0  0     0
MatMult            12701 1.0 8.3460e+00 1.1 3.57e+09 1.0 2.5e+07 1.5e+03 0.0e+00 26 30100100  0  26 30100100  0 219092
MatSolve           12711 1.0 1.1522e+01 1.0 3.56e+09 1.0 0.0e+00 0.0e+00 0.0e+00 37 30  0  0  0  37 30  0  0  0 158008
MatLUFactorNum        10 1.0 2.7704e-02 1.0 3.41e+06 1.0 0.0e+00 0.0e+00 0.0e+00  0  0  0  0  0   0  0  0  0  0 63044
MatILUFactorSym        1 1.0 3.0208e-03 1.1 0.00e+00 0.0 0.0e+00 0.0e+00 0.0e+00  0  0  0  0  0   0  0  0  0  0     0
MatAssemblyBegin      11 1.0 7.0773e-03 2.2 0.00e+00 0.0 0.0e+00 0.0e+00 1.1e+01  0  0  0  0  0   0  0  0  0  0     0
MatAssemblyEnd        11 1.0 4.4015e-03 1.0 0.00e+00 0.0 3.9e+03 3.8e+02 5.0e+00  0  0  0  0  0   0  0  0  0  0     0
MatGetRowIJ            1 1.0 1.1385e-0573.5 0.00e+00 0.0 0.0e+00 0.0e+00 0.0e+00  0  0  0  0  0   0  0  0  0  0     0
MatGetOrdering         1 1.0 2.4654e-04 1.3 0.00e+00 0.0 0.0e+00 0.0e+00 0.0e+00  0  0  0  0  0   0  0  0  0  0     0
MatZeroEntries        10 1.0 3.1433e-03 1.1 0.00e+00 0.0 0.0e+00 0.0e+00 0.0e+00  0  0  0  0  0   0  0  0  0  0     0
KSPSetUp              20 1.0 1.1115e-03 1.1 0.00e+00 0.0 0.0e+00 0.0e+00 6.0e+00  0  0  0  0  0   0  0  0  0  0     0
KSPSolve              10 1.0 3.0587e+01 1.0 1.19e+10 1.0 2.5e+07 1.5e+03 3.8e+04 99100100100100  99100100100100 199088
PCSetUp               20 1.0 3.1512e-02 1.0 3.41e+06 1.0 0.0e+00 0.0e+00 0.0e+00  0  0  0  0  0   0  0  0  0  0 55426
PCSetUpOnBlocks       10 1.0 3.1012e-02 1.0 3.41e+06 1.0 0.0e+00 0.0e+00 0.0e+00  0  0  0  0  0   0  0  0  0  0 56319
PCApply            12711 1.0 1.2022e+01 1.0 3.56e+09 1.0 0.0e+00 0.0e+00 0.0e+00 38 30  0  0  0  38 30  0  0  0 151446
------------------------------------------------------------------------------------------------------------------------

Memory usage is given in bytes:

Object Type          Creations   Destructions     Memory  Descendants' Mem.
Reports information only for process 0.

--- Event Stage 0: Main Stage

    Distributed Mesh     1              1         5552     0.
           Index Set     7              7       509320     0.
   IS L to G Mapping     1              1       127184     0.
   Star Forest Graph     4              4         4544     0.
     Discrete System     1              1          936     0.
         Vec Scatter     2              2         1632     0.
              Vector    11             11      1271144     0.
       Krylov Solver     2              2         2888     0.
              Matrix     4              4      5500836     0.
      Preconditioner     2              2         1928     0.
              Viewer     1              0            0     0.
========================================================================================================================
Average time to get PetscTime(): 1e-07
Average time for MPI_Barrier(): 7.172e-06
Average time for zero size MPI_Send(): 4.43026e-06
#PETSc Option Table entries:
-ksp_type cg
-log_view
-pc_type bjacobi
#End of PETSc Option Table entries
Compiled without FORTRAN kernels
Compiled with full precision matrices (default)
sizeof(short) 2 sizeof(int) 4 sizeof(long) 8 sizeof(void*) 8 sizeof(PetscScalar) 8 sizeof(PetscInt) 4
Configure options: PETSC_ARCH=linux-gnu --prefix=../petsc_install/gnu --with-cc=/opt/arm/mpi/openmpi/gcc_9.2/inbox/4.0.2/bin/mpicc --with-cxx=/opt/arm/mpi/openmpi/gcc_9.2/inbox/4.0.2/bin/mpicxx --with-fc=/opt/arm/mpi/openmpi/gcc_9.2/inbox/4.0.2/bin/mpif90 --with-mpiexec=/opt/arm/mpi/openmpi/gcc_9.2/inbox/4.0.2/bin/mpirun -with-blas-lib=/opt/arm/armpl-20.0.0_ThunderX2CN99_SUSE-12_gcc_9.2.0_aarch64-linux/lib/libarmpl_lp64.a -with-lapack-lib=/opt/arm/armpl-20.0.0_ThunderX2CN99_SUSE-12_gcc_9.2.0_aarch64-linux/lib/libarmpl_lp64.a --with-debugging=0 COPTFLAGS="-O3 -march=native -mtune=native" CXXOPTFLAGS="-O3 -march=native -mtune=native" FOPTFLAGS="-O3 -march=native -mtune=native"
-----------------------------------------
Libraries compiled on 2020-04-21 07:09:34 on fulhame-login1 
Machine characteristics: Linux-4.12.14-150.22-default-aarch64-with-glibc2.17
Using PETSc directory: /scratch3/home/fh04/fh04/jdshanks/petsc_install/gnu
Using PETSc arch: 
-----------------------------------------

Using C compiler: /opt/arm/mpi/openmpi/gcc_9.2/inbox/4.0.2/bin/mpicc  -fPIC -Wall -Wwrite-strings -Wno-strict-aliasing -Wno-unknown-pragmas -fstack-protector -fvisibility=hidden -O3 -march=native -mtune=native  
Using Fortran compiler: /opt/arm/mpi/openmpi/gcc_9.2/inbox/4.0.2/bin/mpif90  -fPIC -Wall -ffree-line-length-0 -Wno-unused-dummy-argument -O3 -march=native -mtune=native    
-----------------------------------------

Using include paths: -I/scratch3/home/fh04/fh04/jdshanks/petsc_install/gnu/include
-----------------------------------------

Using C linker: /opt/arm/mpi/openmpi/gcc_9.2/inbox/4.0.2/bin/mpicc
Using Fortran linker: /opt/arm/mpi/openmpi/gcc_9.2/inbox/4.0.2/bin/mpif90
Using libraries: -Wl,-rpath,/scratch3/home/fh04/fh04/jdshanks/petsc_install/gnu/lib -L/scratch3/home/fh04/fh04/jdshanks/petsc_install/gnu/lib -lpetsc -Wl,-rpath,/opt/arm/armpl-20.0.0_ThunderX2CN99_SUSE-12_gcc_9.2.0_aarch64-linux/lib -L/opt/arm/armpl-20.0.0_ThunderX2CN99_SUSE-12_gcc_9.2.0_aarch64-linux/lib -Wl,-rpath,/opt/arm/mpi/openmpi/gcc_9.2/inbox/4.0.2/lib -L/opt/arm/mpi/openmpi/gcc_9.2/inbox/4.0.2/lib -Wl,-rpath,/scratch3/arm/gcc-9.2.0_Generic-AArch64_SUSE-12_aarch64-linux/lib/gcc/aarch64-linux/9.2.0 -L/scratch3/arm/gcc-9.2.0_Generic-AArch64_SUSE-12_aarch64-linux/lib/gcc/aarch64-linux/9.2.0 -Wl,-rpath,/scratch3/arm/gcc-9.2.0_Generic-AArch64_SUSE-12_aarch64-linux/lib/gcc -L/scratch3/arm/gcc-9.2.0_Generic-AArch64_SUSE-12_aarch64-linux/lib/gcc -Wl,-rpath,/opt/arm/gcc-9.2.0_Generic-AArch64_SUSE-12_aarch64-linux/lib64 -L/opt/arm/gcc-9.2.0_Generic-AArch64_SUSE-12_aarch64-linux/lib64 -Wl,-rpath,/scratch3/arm/gcc-9.2.0_Generic-AArch64_SUSE-12_aarch64-linux/lib64 -L/scratch3/arm/gcc-9.2.0_Generic-AArch64_SUSE-12_aarch64-linux/lib64 -Wl,-rpath,/opt/arm/gcc-9.2.0_Generic-AArch64_SUSE-12_aarch64-linux/lib -L/opt/arm/gcc-9.2.0_Generic-AArch64_SUSE-12_aarch64-linux/lib -Wl,-rpath,/scratch3/arm/gcc-9.2.0_Generic-AArch64_SUSE-12_aarch64-linux/aarch64-linux/lib -L/scratch3/arm/gcc-9.2.0_Generic-AArch64_SUSE-12_aarch64-linux/aarch64-linux/lib -Wl,-rpath,/scratch3/arm/gcc-9.2.0_Generic-AArch64_SUSE-12_aarch64-linux/lib -L/scratch3/arm/gcc-9.2.0_Generic-AArch64_SUSE-12_aarch64-linux/lib -larmpl_lp64 -lm -lstdc++ -ldl -lmpi_usempif08 -lmpi_usempi_ignore_tkr -lmpi_mpifh -lmpi -lgfortran -lm -lgfortran -lm -lgcc_s -lpthread -lstdc++ -ldl
-----------------------------------------


   Tea Version    1.000
       MPI Version
    OpenMP Version
   Task Count    512
 Thread Count:     1


   Tea Version    1.000
       MPI Version
    OpenMP Version
   Task Count    512
 Thread Count:     1

 Output file tea.out opened. All output will go there.
 Step       1 time   0.0000000 timestep   4.00E-03
Conduction error  0.1427587E-19
Iteration count     1339
      Solve Time    3.2123529911    Its   1339     Time Per It    0.0023990687
 Wall clock    3.2138969898223877     
 Average time per cell    2.0086856186389922E-007
 Step time per cell       2.0086649060249329E-007
 Step       2 time   0.0040000 timestep   4.00E-03
Conduction error  0.4949727E-16
Iteration count     1303
      Solve Time    2.9783990383    Its   1303     Time Per It    0.0022858013
 Wall clock    6.1930351257324219     
 Average time per cell    1.9353234767913818E-007
 Step time per cell       1.8616962432861328E-007
 Step       3 time   0.0080000 timestep   4.00E-03
Conduction error  0.1764605E-15
Iteration count     1281
      Solve Time    3.0956518650    Its   1281     Time Per It    0.0024165901
 Wall clock    9.2889699935913086     
 Average time per cell    1.9352020819981893E-007
 Step time per cell       1.9349430501461028E-007
 Step       4 time   0.0120000 timestep   4.00E-03
Conduction error  0.3080600E-15
Iteration count     1270
      Solve Time    2.8641688824    Its   1270     Time Per It    0.0022552511
 Wall clock    12.154016017913818     
 Average time per cell    1.8990650027990341E-007
 Step time per cell       1.7903892695903777E-007
 Step       5 time   0.0160000 timestep   4.00E-03
Conduction error  0.4176984E-15
Iteration count     1261
      Solve Time    3.0232291222    Its   1261     Time Per It    0.0023974854
 Wall clock    15.178125143051147     
 Average time per cell    1.8972656428813935E-007
 Step time per cell       1.8898019194602965E-007
 Step       6 time   0.0200000 timestep   4.00E-03
Conduction error  0.5438417E-15
Iteration count     1249
      Solve Time    3.0103330612    Its   1249     Time Per It    0.0024101946
 Wall clock    18.189186096191406     
 Average time per cell    1.8947068850199381E-007
 Step time per cell       1.8816456198692320E-007
 Step       7 time   0.0240000 timestep   4.00E-03
Conduction error  0.6257000E-15
Iteration count     1247
      Solve Time    2.7986719608    Its   1247     Time Per It    0.0022443239
 Wall clock    20.988108158111572     
 Average time per cell    1.8739382284028189E-007
 Step time per cell       1.7493075132369996E-007
 Step       8 time   0.0280000 timestep   4.00E-03
Conduction error  0.7317226E-15
Iteration count     1247
      Solve Time    2.9801249504    Its   1247     Time Per It    0.0023898356
 Wall clock    23.969094038009644     
 Average time per cell    1.8725854717195033E-007
 Step time per cell       1.8628506362438202E-007
 Step       9 time   0.0320000 timestep   4.00E-03
Conduction error  0.8378877E-15
Iteration count     1247
      Solve Time    2.8150510788    Its   1247     Time Per It    0.0022574588
 Wall clock    26.784859180450439     
 Average time per cell    1.8600596653090584E-007
 Step time per cell       1.7595881223678589E-007
 Step      10 time   0.0360000 timestep   4.00E-03
Conduction error  0.9227803E-15
Iteration count     1247
      Solve Time    3.0142199993    Its   1247     Time Per It    0.0024171772
 Wall clock    29.799720048904419     
 Average time per cell    1.8624825030565263E-007
 Step time per cell       1.8842518329620361E-007
Test problem   5 is within   0.1060101E-08% of the expected solution
 This test is considered PASSED
 First step overhead  0.23514986038208008     
 Wall clock    29.800753116607666     

Profiler Output                 Time            Percentage
Timestep              :          0.0093          0.0312
Halo Exchange         :          0.0026          0.0088
Summary               :          0.0018          0.0061
Visit                 :          0.0000          0.0000
Tea Init              :          0.0161          0.0542
Dot Product           :          0.0020          0.0067
Tea Solve             :         29.7706         99.8987
Tea Reset             :          0.0014          0.0048
Set Field             :          0.0000          0.0001
Total                 :         29.8039        100.0106
The Rest              :         -0.0032         -0.0106
************************************************************************************************************************
***             WIDEN YOUR WINDOW TO 120 CHARACTERS.  Use 'enscript -r -fCourier9' to print this document            ***
************************************************************************************************************************

---------------------------------------------- PETSc Performance Summary: ----------------------------------------------

./tea_leaf_gnu on a  named cn09 with 512 processors, by jdshanks Wed Apr 29 15:05:47 2020
Using Petsc Release Version 3.13.0, Mar 29, 2020 

                         Max       Max/Min     Avg       Total 
Time (sec):           2.985e+01     1.000   2.985e+01
Objects:              3.600e+01     1.000   3.600e+01
Flop:                 1.189e+10     1.001   1.189e+10  6.089e+12
Flop/sec:             3.985e+08     1.001   3.985e+08  2.040e+11
MPI Messages:         5.082e+04     2.000   4.844e+04  2.480e+07
MPI Message Lengths:  7.621e+07     2.000   1.508e+03  3.739e+10
MPI Reductions:       3.816e+04     1.000

Flop counting convention: 1 flop = 1 real number operation of type (multiply/divide/add/subtract)
                            e.g., VecAXPY() for real vectors of length N --> 2N flop
                            and VecAXPY() for complex vectors of length N --> 8N flop

Summary of Stages:   ----- Time ------  ----- Flop ------  --- Messages ---  -- Message Lengths --  -- Reductions --
                        Avg     %Total     Avg     %Total    Count   %Total     Avg         %Total    Count   %Total 
 0:      Main Stage: 2.9849e+01 100.0%  6.0895e+12 100.0%  2.480e+07 100.0%  1.508e+03      100.0%  3.815e+04 100.0% 

------------------------------------------------------------------------------------------------------------------------
See the 'Profiling' chapter of the users' manual for details on interpreting output.
Phase summary info:
   Count: number of times phase was executed
   Time and Flop: Max - maximum over all processors
                  Ratio - ratio of maximum to minimum over all processors
   Mess: number of messages sent
   AvgLen: average message length (bytes)
   Reduct: number of global reductions
   Global: entire computation
   Stage: stages of a computation. Set stages with PetscLogStagePush() and PetscLogStagePop().
      %T - percent time in this phase         %F - percent flop in this phase
      %M - percent messages in this phase     %L - percent message lengths in this phase
      %R - percent reductions in this phase
   Total Mflop/s: 10e-6 * (sum of flop over all processors)/(max time over all processors)
------------------------------------------------------------------------------------------------------------------------
Event                Count      Time (sec)     Flop                              --- Global ---  --- Stage ----  Total
                   Max Ratio  Max     Ratio   Max  Ratio  Mess   AvgLen  Reduct  %T %F %M %L %R  %T %F %M %L %R Mflop/s
------------------------------------------------------------------------------------------------------------------------

--- Event Stage 0: Main Stage

BuildTwoSided         13 1.0 6.6240e-03 2.9 0.00e+00 0.0 3.9e+03 4.0e+00 1.3e+01  0  0  0  0  0   0  0  0  0  0     0
BuildTwoSidedF        11 1.0 6.0956e-03 3.7 0.00e+00 0.0 0.0e+00 0.0e+00 1.1e+01  0  0  0  0  0   0  0  0  0  0     0
DMCreateMat            1 1.0 2.3160e-02 1.0 0.00e+00 0.0 3.9e+03 3.8e+02 8.0e+00  0  0  0  0  0   0  0  0  0  0     0
SFSetGraph             2 1.0 6.9120e-05 1.1 0.00e+00 0.0 0.0e+00 0.0e+00 0.0e+00  0  0  0  0  0   0  0  0  0  0     0
SFSetUp                2 1.0 1.7815e-03 1.4 0.00e+00 0.0 7.8e+03 3.8e+02 2.0e+00  0  0  0  0  0   0  0  0  0  0     0
SFBcastOpBegin     12701 1.0 3.2470e-01 1.9 0.00e+00 0.0 2.5e+07 1.5e+03 0.0e+00  1  0100100  0   1  0100100  0     0
SFBcastOpEnd       12701 1.0 2.3021e-01 2.5 0.00e+00 0.0 0.0e+00 0.0e+00 0.0e+00  0  0  0  0  0   0  0  0  0  0     0
SFPack             12701 1.0 5.7071e-02 1.8 0.00e+00 0.0 0.0e+00 0.0e+00 0.0e+00  0  0  0  0  0   0  0  0  0  0     0
SFUnpack           12701 1.0 7.2118e-03 3.5 0.00e+00 0.0 0.0e+00 0.0e+00 0.0e+00  0  0  0  0  0   0  0  0  0  0     0
VecTDot            25402 1.0 4.4473e+00 1.1 1.59e+09 1.0 0.0e+00 0.0e+00 2.5e+04 14 13  0  0 67  14 13  0  0 67 182775
VecNorm            12711 1.0 2.9504e+00 1.3 7.94e+08 1.0 0.0e+00 0.0e+00 1.3e+04  9  7  0  0 33   9  7  0  0 33 137861
VecCopy               20 1.0 1.8687e-03 1.1 0.00e+00 0.0 0.0e+00 0.0e+00 0.0e+00  0  0  0  0  0   0  0  0  0  0     0
VecSet             12742 1.0 3.6246e-01 1.1 0.00e+00 0.0 0.0e+00 0.0e+00 0.0e+00  1  0  0  0  0   1  0  0  0  0     0
VecAXPY            25402 1.0 1.8840e+00 1.0 1.59e+09 1.0 0.0e+00 0.0e+00 0.0e+00  6 13  0  0  0   6 13  0  0  0 431459
VecAYPX            12691 1.0 9.0407e-01 1.1 7.93e+08 1.0 0.0e+00 0.0e+00 0.0e+00  3  7  0  0  0   3  7  0  0  0 449203
VecScatterBegin    12701 1.0 3.5985e-01 1.9 0.00e+00 0.0 2.5e+07 1.5e+03 0.0e+00  1  0100100  0   1  0100100  0     0
VecScatterEnd      12701 1.0 2.5300e-01 2.3 0.00e+00 0.0 0.0e+00 0.0e+00 0.0e+00  1  0  0  0  0   1  0  0  0  0     0
MatMult            12701 1.0 8.3046e+00 1.1 3.57e+09 1.0 2.5e+07 1.5e+03 0.0e+00 27 30100100  0  27 30100100  0 220183
MatSolve           12711 1.0 1.1626e+01 1.1 3.56e+09 1.0 0.0e+00 0.0e+00 0.0e+00 38 30  0  0  0  38 30  0  0  0 156604
MatLUFactorNum        10 1.0 2.7863e-02 1.0 3.41e+06 1.0 0.0e+00 0.0e+00 0.0e+00  0  0  0  0  0   0  0  0  0  0 62685
MatILUFactorSym        1 1.0 2.9628e-03 1.1 0.00e+00 0.0 0.0e+00 0.0e+00 0.0e+00  0  0  0  0  0   0  0  0  0  0     0
MatAssemblyBegin      11 1.0 6.4813e-03 3.4 0.00e+00 0.0 0.0e+00 0.0e+00 1.1e+01  0  0  0  0  0   0  0  0  0  0     0
MatAssemblyEnd        11 1.0 4.5584e-03 1.0 0.00e+00 0.0 3.9e+03 3.8e+02 5.0e+00  0  0  0  0  0   0  0  0  0  0     0
MatGetRowIJ            1 1.0 1.3869e-0589.5 0.00e+00 0.0 0.0e+00 0.0e+00 0.0e+00  0  0  0  0  0   0  0  0  0  0     0
MatGetOrdering         1 1.0 2.4933e-04 1.3 0.00e+00 0.0 0.0e+00 0.0e+00 0.0e+00  0  0  0  0  0   0  0  0  0  0     0
MatZeroEntries        10 1.0 3.1039e-03 1.1 0.00e+00 0.0 0.0e+00 0.0e+00 0.0e+00  0  0  0  0  0   0  0  0  0  0     0
KSPSetUp              20 1.0 1.1302e-03 1.1 0.00e+00 0.0 0.0e+00 0.0e+00 6.0e+00  0  0  0  0  0   0  0  0  0  0     0
KSPSolve              10 1.0 2.9671e+01 1.0 1.19e+10 1.0 2.5e+07 1.5e+03 3.8e+04 99100100100100  99100100100100 205232
PCSetUp               20 1.0 3.1428e-02 1.0 3.41e+06 1.0 0.0e+00 0.0e+00 0.0e+00  0  0  0  0  0   0  0  0  0  0 55573
PCSetUpOnBlocks       10 1.0 3.1043e-02 1.0 3.41e+06 1.0 0.0e+00 0.0e+00 0.0e+00  0  0  0  0  0   0  0  0  0  0 56263
PCApply            12711 1.0 1.2124e+01 1.1 3.56e+09 1.0 0.0e+00 0.0e+00 0.0e+00 40 30  0  0  0  40 30  0  0  0 150166
------------------------------------------------------------------------------------------------------------------------

Memory usage is given in bytes:

Object Type          Creations   Destructions     Memory  Descendants' Mem.
Reports information only for process 0.

--- Event Stage 0: Main Stage

    Distributed Mesh     1              1         5552     0.
           Index Set     7              7       509320     0.
   IS L to G Mapping     1              1       127184     0.
   Star Forest Graph     4              4         4544     0.
     Discrete System     1              1          936     0.
         Vec Scatter     2              2         1632     0.
              Vector    11             11      1271144     0.
       Krylov Solver     2              2         2888     0.
              Matrix     4              4      5500836     0.
      Preconditioner     2              2         1928     0.
              Viewer     1              0            0     0.
========================================================================================================================
Average time to get PetscTime(): 1.01e-07
Average time for MPI_Barrier(): 1.98078e-05
Average time for zero size MPI_Send(): 4.42838e-06
#PETSc Option Table entries:
-ksp_type cg
-log_view
-pc_type bjacobi
#End of PETSc Option Table entries
Compiled without FORTRAN kernels
Compiled with full precision matrices (default)
sizeof(short) 2 sizeof(int) 4 sizeof(long) 8 sizeof(void*) 8 sizeof(PetscScalar) 8 sizeof(PetscInt) 4
Configure options: PETSC_ARCH=linux-gnu --prefix=../petsc_install/gnu --with-cc=/opt/arm/mpi/openmpi/gcc_9.2/inbox/4.0.2/bin/mpicc --with-cxx=/opt/arm/mpi/openmpi/gcc_9.2/inbox/4.0.2/bin/mpicxx --with-fc=/opt/arm/mpi/openmpi/gcc_9.2/inbox/4.0.2/bin/mpif90 --with-mpiexec=/opt/arm/mpi/openmpi/gcc_9.2/inbox/4.0.2/bin/mpirun -with-blas-lib=/opt/arm/armpl-20.0.0_ThunderX2CN99_SUSE-12_gcc_9.2.0_aarch64-linux/lib/libarmpl_lp64.a -with-lapack-lib=/opt/arm/armpl-20.0.0_ThunderX2CN99_SUSE-12_gcc_9.2.0_aarch64-linux/lib/libarmpl_lp64.a --with-debugging=0 COPTFLAGS="-O3 -march=native -mtune=native" CXXOPTFLAGS="-O3 -march=native -mtune=native" FOPTFLAGS="-O3 -march=native -mtune=native"
-----------------------------------------
Libraries compiled on 2020-04-21 07:09:34 on fulhame-login1 
Machine characteristics: Linux-4.12.14-150.22-default-aarch64-with-glibc2.17
Using PETSc directory: /scratch3/home/fh04/fh04/jdshanks/petsc_install/gnu
Using PETSc arch: 
-----------------------------------------

Using C compiler: /opt/arm/mpi/openmpi/gcc_9.2/inbox/4.0.2/bin/mpicc  -fPIC -Wall -Wwrite-strings -Wno-strict-aliasing -Wno-unknown-pragmas -fstack-protector -fvisibility=hidden -O3 -march=native -mtune=native  
Using Fortran compiler: /opt/arm/mpi/openmpi/gcc_9.2/inbox/4.0.2/bin/mpif90  -fPIC -Wall -ffree-line-length-0 -Wno-unused-dummy-argument -O3 -march=native -mtune=native    
-----------------------------------------

Using include paths: -I/scratch3/home/fh04/fh04/jdshanks/petsc_install/gnu/include
-----------------------------------------

Using C linker: /opt/arm/mpi/openmpi/gcc_9.2/inbox/4.0.2/bin/mpicc
Using Fortran linker: /opt/arm/mpi/openmpi/gcc_9.2/inbox/4.0.2/bin/mpif90
Using libraries: -Wl,-rpath,/scratch3/home/fh04/fh04/jdshanks/petsc_install/gnu/lib -L/scratch3/home/fh04/fh04/jdshanks/petsc_install/gnu/lib -lpetsc -Wl,-rpath,/opt/arm/armpl-20.0.0_ThunderX2CN99_SUSE-12_gcc_9.2.0_aarch64-linux/lib -L/opt/arm/armpl-20.0.0_ThunderX2CN99_SUSE-12_gcc_9.2.0_aarch64-linux/lib -Wl,-rpath,/opt/arm/mpi/openmpi/gcc_9.2/inbox/4.0.2/lib -L/opt/arm/mpi/openmpi/gcc_9.2/inbox/4.0.2/lib -Wl,-rpath,/scratch3/arm/gcc-9.2.0_Generic-AArch64_SUSE-12_aarch64-linux/lib/gcc/aarch64-linux/9.2.0 -L/scratch3/arm/gcc-9.2.0_Generic-AArch64_SUSE-12_aarch64-linux/lib/gcc/aarch64-linux/9.2.0 -Wl,-rpath,/scratch3/arm/gcc-9.2.0_Generic-AArch64_SUSE-12_aarch64-linux/lib/gcc -L/scratch3/arm/gcc-9.2.0_Generic-AArch64_SUSE-12_aarch64-linux/lib/gcc -Wl,-rpath,/opt/arm/gcc-9.2.0_Generic-AArch64_SUSE-12_aarch64-linux/lib64 -L/opt/arm/gcc-9.2.0_Generic-AArch64_SUSE-12_aarch64-linux/lib64 -Wl,-rpath,/scratch3/arm/gcc-9.2.0_Generic-AArch64_SUSE-12_aarch64-linux/lib64 -L/scratch3/arm/gcc-9.2.0_Generic-AArch64_SUSE-12_aarch64-linux/lib64 -Wl,-rpath,/opt/arm/gcc-9.2.0_Generic-AArch64_SUSE-12_aarch64-linux/lib -L/opt/arm/gcc-9.2.0_Generic-AArch64_SUSE-12_aarch64-linux/lib -Wl,-rpath,/scratch3/arm/gcc-9.2.0_Generic-AArch64_SUSE-12_aarch64-linux/aarch64-linux/lib -L/scratch3/arm/gcc-9.2.0_Generic-AArch64_SUSE-12_aarch64-linux/aarch64-linux/lib -Wl,-rpath,/scratch3/arm/gcc-9.2.0_Generic-AArch64_SUSE-12_aarch64-linux/lib -L/scratch3/arm/gcc-9.2.0_Generic-AArch64_SUSE-12_aarch64-linux/lib -larmpl_lp64 -lm -lstdc++ -ldl -lmpi_usempif08 -lmpi_usempi_ignore_tkr -lmpi_mpifh -lmpi -lgfortran -lm -lgfortran -lm -lgcc_s -lpthread -lstdc++ -ldl
-----------------------------------------


   Tea Version    1.000
       MPI Version
    OpenMP Version
   Task Count    512
 Thread Count:     1


   Tea Version    1.000
       MPI Version
    OpenMP Version
   Task Count    512
 Thread Count:     1

 Output file tea.out opened. All output will go there.
 Step       1 time   0.0000000 timestep   4.00E-03
Conduction error  0.1427587E-19
Iteration count     1339
      Solve Time    3.2282140255    Its   1339     Time Per It    0.0024109141
 Wall clock    3.2297279834747314     
 Average time per cell    2.0185799896717073E-007
 Step time per cell       2.0185592770576477E-007
 Step       2 time   0.0040000 timestep   4.00E-03
Conduction error  0.4949727E-16
Iteration count     1303
      Solve Time    2.9523627758    Its   1303     Time Per It    0.0022658195
 Wall clock    6.1828320026397705     
 Average time per cell    1.9321350008249284E-007
 Step time per cell       1.8454162776470183E-007
 Step       3 time   0.0080000 timestep   4.00E-03
Conduction error  0.1764605E-15
Iteration count     1281
      Solve Time    3.7308170795    Its   1281     Time Per It    0.0029124255
 Wall clock    9.9139201641082764     
 Average time per cell    2.0654000341892241E-007
 Step time per cell       2.3319138586521150E-007
 Step       4 time   0.0120000 timestep   4.00E-03
Conduction error  0.3080600E-15
Iteration count     1270
      Solve Time    3.0696208477    Its   1270     Time Per It    0.0024170243
 Wall clock    12.984414100646973     
 Average time per cell    2.0288147032260895E-007
 Step time per cell       1.9187988340854646E-007
 Step       5 time   0.0160000 timestep   4.00E-03
Conduction error  0.4176984E-15
Iteration count     1261
      Solve Time    2.8454859257    Its   1261     Time Per It    0.0022565313
 Wall clock    15.830773115158081     
 Average time per cell    1.9788466393947600E-007
 Step time per cell       1.7787100374698639E-007
 Step       6 time   0.0200000 timestep   4.00E-03
Conduction error  0.5438417E-15
Iteration count     1249
      Solve Time    2.9792799950    Its   1249     Time Per It    0.0023853323
 Wall clock    18.810961961746216     
 Average time per cell    1.9594752043485643E-007
 Step time per cell       1.8623556196689605E-007
 Step       7 time   0.0240000 timestep   4.00E-03
Conduction error  0.6257000E-15
Iteration count     1247
      Solve Time    3.0060842037    Its   1247     Time Per It    0.0024106529
 Wall clock    21.817789077758789     
 Average time per cell    1.9480168819427490E-007
 Step time per cell       1.8790037930011749E-007
 Step       8 time   0.0280000 timestep   4.00E-03
Conduction error  0.7317226E-15
Iteration count     1247
      Solve Time    2.8049468994    Its   1247     Time Per It    0.0022493560
 Wall clock    24.622982978820801     
 Average time per cell    1.9236705452203750E-007
 Step time per cell       1.7532287538051606E-007
 Step       9 time   0.0320000 timestep   4.00E-03
Conduction error  0.8378877E-15
Iteration count     1247
      Solve Time    2.9737591743    Its   1247     Time Per It    0.0023847307
 Wall clock    27.597599983215332     
 Average time per cell    1.9164999988343980E-007
 Step time per cell       1.8588718771934511E-007
 Step      10 time   0.0360000 timestep   4.00E-03
Conduction error  0.9227803E-15
Iteration count     1247
      Solve Time    2.8337881565    Its   1247     Time Per It    0.0022724845
 Wall clock    30.432504177093506     
 Average time per cell    1.9020315110683440E-007
 Step time per cell       1.7715369164943696E-007
Test problem   5 is within   0.1060101E-08% of the expected solution
 This test is considered PASSED
 First step overhead  0.27702879905700684     
 Wall clock    30.433515071868896     

Profiler Output                 Time            Percentage
Timestep              :          0.0098          0.0323
Halo Exchange         :          0.0037          0.0121
Summary               :          0.0016          0.0051
Visit                 :          0.0000          0.0000
Tea Init              :          0.0169          0.0556
Dot Product           :          0.0017          0.0055
Tea Solve             :         30.4021         99.8968
Tea Reset             :          0.0015          0.0049
Set Field             :          0.0000          0.0001
Total                 :         30.4373        100.0125
The Rest              :         -0.0038         -0.0125
************************************************************************************************************************
***             WIDEN YOUR WINDOW TO 120 CHARACTERS.  Use 'enscript -r -fCourier9' to print this document            ***
************************************************************************************************************************

---------------------------------------------- PETSc Performance Summary: ----------------------------------------------

./tea_leaf_gnu on a  named cn09 with 512 processors, by jdshanks Wed Apr 29 15:06:24 2020
Using Petsc Release Version 3.13.0, Mar 29, 2020 

                         Max       Max/Min     Avg       Total 
Time (sec):           3.048e+01     1.000   3.048e+01
Objects:              3.600e+01     1.000   3.600e+01
Flop:                 1.189e+10     1.001   1.189e+10  6.089e+12
Flop/sec:             3.902e+08     1.001   3.902e+08  1.998e+11
MPI Messages:         5.082e+04     2.000   4.844e+04  2.480e+07
MPI Message Lengths:  7.621e+07     2.000   1.508e+03  3.739e+10
MPI Reductions:       3.816e+04     1.000

Flop counting convention: 1 flop = 1 real number operation of type (multiply/divide/add/subtract)
                            e.g., VecAXPY() for real vectors of length N --> 2N flop
                            and VecAXPY() for complex vectors of length N --> 8N flop

Summary of Stages:   ----- Time ------  ----- Flop ------  --- Messages ---  -- Message Lengths --  -- Reductions --
                        Avg     %Total     Avg     %Total    Count   %Total     Avg         %Total    Count   %Total 
 0:      Main Stage: 3.0482e+01 100.0%  6.0895e+12 100.0%  2.480e+07 100.0%  1.508e+03      100.0%  3.815e+04 100.0% 

------------------------------------------------------------------------------------------------------------------------
See the 'Profiling' chapter of the users' manual for details on interpreting output.
Phase summary info:
   Count: number of times phase was executed
   Time and Flop: Max - maximum over all processors
                  Ratio - ratio of maximum to minimum over all processors
   Mess: number of messages sent
   AvgLen: average message length (bytes)
   Reduct: number of global reductions
   Global: entire computation
   Stage: stages of a computation. Set stages with PetscLogStagePush() and PetscLogStagePop().
      %T - percent time in this phase         %F - percent flop in this phase
      %M - percent messages in this phase     %L - percent message lengths in this phase
      %R - percent reductions in this phase
   Total Mflop/s: 10e-6 * (sum of flop over all processors)/(max time over all processors)
------------------------------------------------------------------------------------------------------------------------
Event                Count      Time (sec)     Flop                              --- Global ---  --- Stage ----  Total
                   Max Ratio  Max     Ratio   Max  Ratio  Mess   AvgLen  Reduct  %T %F %M %L %R  %T %F %M %L %R Mflop/s
------------------------------------------------------------------------------------------------------------------------

--- Event Stage 0: Main Stage

BuildTwoSided         13 1.0 7.0855e-03 2.5 0.00e+00 0.0 3.9e+03 4.0e+00 1.3e+01  0  0  0  0  0   0  0  0  0  0     0
BuildTwoSidedF        11 1.0 6.4338e-03 3.1 0.00e+00 0.0 0.0e+00 0.0e+00 1.1e+01  0  0  0  0  0   0  0  0  0  0     0
DMCreateMat            1 1.0 2.2971e-02 1.0 0.00e+00 0.0 3.9e+03 3.8e+02 8.0e+00  0  0  0  0  0   0  0  0  0  0     0
SFSetGraph             2 1.0 6.8179e-05 1.0 0.00e+00 0.0 0.0e+00 0.0e+00 0.0e+00  0  0  0  0  0   0  0  0  0  0     0
SFSetUp                2 1.0 1.7667e-03 1.4 0.00e+00 0.0 7.8e+03 3.8e+02 2.0e+00  0  0  0  0  0   0  0  0  0  0     0
SFBcastOpBegin     12701 1.0 3.1891e-01 1.7 0.00e+00 0.0 2.5e+07 1.5e+03 0.0e+00  1  0100100  0   1  0100100  0     0
SFBcastOpEnd       12701 1.0 2.3256e-01 2.3 0.00e+00 0.0 0.0e+00 0.0e+00 0.0e+00  0  0  0  0  0   0  0  0  0  0     0
SFPack             12701 1.0 5.7071e-02 1.9 0.00e+00 0.0 0.0e+00 0.0e+00 0.0e+00  0  0  0  0  0   0  0  0  0  0     0
SFUnpack           12701 1.0 7.4732e-03 3.7 0.00e+00 0.0 0.0e+00 0.0e+00 0.0e+00  0  0  0  0  0   0  0  0  0  0     0
VecTDot            25402 1.0 4.8037e+00 1.1 1.59e+09 1.0 0.0e+00 0.0e+00 2.5e+04 15 13  0  0 67  15 13  0  0 67 169215
VecNorm            12711 1.0 3.1671e+00 1.2 7.94e+08 1.0 0.0e+00 0.0e+00 1.3e+04 10  7  0  0 33  10  7  0  0 33 128430
VecCopy               20 1.0 1.8154e-03 1.1 0.00e+00 0.0 0.0e+00 0.0e+00 0.0e+00  0  0  0  0  0   0  0  0  0  0     0
VecSet             12742 1.0 3.5709e-01 1.1 0.00e+00 0.0 0.0e+00 0.0e+00 0.0e+00  1  0  0  0  0   1  0  0  0  0     0
VecAXPY            25402 1.0 1.8884e+00 1.0 1.59e+09 1.0 0.0e+00 0.0e+00 0.0e+00  6 13  0  0  0   6 13  0  0  0 430461
VecAYPX            12691 1.0 9.0550e-01 1.1 7.93e+08 1.0 0.0e+00 0.0e+00 0.0e+00  3  7  0  0  0   3  7  0  0  0 448495
VecScatterBegin    12701 1.0 3.5211e-01 1.7 0.00e+00 0.0 2.5e+07 1.5e+03 0.0e+00  1  0100100  0   1  0100100  0     0
VecScatterEnd      12701 1.0 2.6164e-01 2.1 0.00e+00 0.0 0.0e+00 0.0e+00 0.0e+00  1  0  0  0  0   1  0  0  0  0     0
MatMult            12701 1.0 8.3730e+00 1.1 3.57e+09 1.0 2.5e+07 1.5e+03 0.0e+00 26 30100100  0  26 30100100  0 218384
MatSolve           12711 1.0 1.1559e+01 1.0 3.56e+09 1.0 0.0e+00 0.0e+00 0.0e+00 37 30  0  0  0  37 30  0  0  0 157504
MatLUFactorNum        10 1.0 2.7648e-02 1.0 3.41e+06 1.0 0.0e+00 0.0e+00 0.0e+00  0  0  0  0  0   0  0  0  0  0 63171
MatILUFactorSym        1 1.0 3.0279e-03 1.2 0.00e+00 0.0 0.0e+00 0.0e+00 0.0e+00  0  0  0  0  0   0  0  0  0  0     0
MatAssemblyBegin      11 1.0 6.8314e-03 2.9 0.00e+00 0.0 0.0e+00 0.0e+00 1.1e+01  0  0  0  0  0   0  0  0  0  0     0
MatAssemblyEnd        11 1.0 4.4676e-03 1.0 0.00e+00 0.0 3.9e+03 3.8e+02 5.0e+00  0  0  0  0  0   0  0  0  0  0     0
MatGetRowIJ            1 1.0 9.5250e-0661.5 0.00e+00 0.0 0.0e+00 0.0e+00 0.0e+00  0  0  0  0  0   0  0  0  0  0     0
MatGetOrdering         1 1.0 2.5587e-04 1.3 0.00e+00 0.0 0.0e+00 0.0e+00 0.0e+00  0  0  0  0  0   0  0  0  0  0     0
MatZeroEntries        10 1.0 3.1112e-03 1.1 0.00e+00 0.0 0.0e+00 0.0e+00 0.0e+00  0  0  0  0  0   0  0  0  0  0     0
KSPSetUp              20 1.0 1.1249e-03 1.1 0.00e+00 0.0 0.0e+00 0.0e+00 6.0e+00  0  0  0  0  0   0  0  0  0  0     0
KSPSolve              10 1.0 3.0302e+01 1.0 1.19e+10 1.0 2.5e+07 1.5e+03 3.8e+04 99100100100100  99100100100100 200957
PCSetUp               20 1.0 3.1355e-02 1.0 3.41e+06 1.0 0.0e+00 0.0e+00 0.0e+00  0  0  0  0  0   0  0  0  0  0 55704
PCSetUpOnBlocks       10 1.0 3.0998e-02 1.0 3.41e+06 1.0 0.0e+00 0.0e+00 0.0e+00  0  0  0  0  0   0  0  0  0  0 56344
PCApply            12711 1.0 1.2055e+01 1.0 3.56e+09 1.0 0.0e+00 0.0e+00 0.0e+00 39 30  0  0  0  39 30  0  0  0 151027
------------------------------------------------------------------------------------------------------------------------

Memory usage is given in bytes:

Object Type          Creations   Destructions     Memory  Descendants' Mem.
Reports information only for process 0.

--- Event Stage 0: Main Stage

    Distributed Mesh     1              1         5552     0.
           Index Set     7              7       509320     0.
   IS L to G Mapping     1              1       127184     0.
   Star Forest Graph     4              4         4544     0.
     Discrete System     1              1          936     0.
         Vec Scatter     2              2         1632     0.
              Vector    11             11      1271144     0.
       Krylov Solver     2              2         2888     0.
              Matrix     4              4      5500836     0.
      Preconditioner     2              2         1928     0.
              Viewer     1              0            0     0.
========================================================================================================================
Average time to get PetscTime(): 9.95e-08
Average time for MPI_Barrier(): 6.866e-06
Average time for zero size MPI_Send(): 4.35777e-06
#PETSc Option Table entries:
-ksp_type cg
-log_view
-pc_type bjacobi
#End of PETSc Option Table entries
Compiled without FORTRAN kernels
Compiled with full precision matrices (default)
sizeof(short) 2 sizeof(int) 4 sizeof(long) 8 sizeof(void*) 8 sizeof(PetscScalar) 8 sizeof(PetscInt) 4
Configure options: PETSC_ARCH=linux-gnu --prefix=../petsc_install/gnu --with-cc=/opt/arm/mpi/openmpi/gcc_9.2/inbox/4.0.2/bin/mpicc --with-cxx=/opt/arm/mpi/openmpi/gcc_9.2/inbox/4.0.2/bin/mpicxx --with-fc=/opt/arm/mpi/openmpi/gcc_9.2/inbox/4.0.2/bin/mpif90 --with-mpiexec=/opt/arm/mpi/openmpi/gcc_9.2/inbox/4.0.2/bin/mpirun -with-blas-lib=/opt/arm/armpl-20.0.0_ThunderX2CN99_SUSE-12_gcc_9.2.0_aarch64-linux/lib/libarmpl_lp64.a -with-lapack-lib=/opt/arm/armpl-20.0.0_ThunderX2CN99_SUSE-12_gcc_9.2.0_aarch64-linux/lib/libarmpl_lp64.a --with-debugging=0 COPTFLAGS="-O3 -march=native -mtune=native" CXXOPTFLAGS="-O3 -march=native -mtune=native" FOPTFLAGS="-O3 -march=native -mtune=native"
-----------------------------------------
Libraries compiled on 2020-04-21 07:09:34 on fulhame-login1 
Machine characteristics: Linux-4.12.14-150.22-default-aarch64-with-glibc2.17
Using PETSc directory: /scratch3/home/fh04/fh04/jdshanks/petsc_install/gnu
Using PETSc arch: 
-----------------------------------------

Using C compiler: /opt/arm/mpi/openmpi/gcc_9.2/inbox/4.0.2/bin/mpicc  -fPIC -Wall -Wwrite-strings -Wno-strict-aliasing -Wno-unknown-pragmas -fstack-protector -fvisibility=hidden -O3 -march=native -mtune=native  
Using Fortran compiler: /opt/arm/mpi/openmpi/gcc_9.2/inbox/4.0.2/bin/mpif90  -fPIC -Wall -ffree-line-length-0 -Wno-unused-dummy-argument -O3 -march=native -mtune=native    
-----------------------------------------

Using include paths: -I/scratch3/home/fh04/fh04/jdshanks/petsc_install/gnu/include
-----------------------------------------

Using C linker: /opt/arm/mpi/openmpi/gcc_9.2/inbox/4.0.2/bin/mpicc
Using Fortran linker: /opt/arm/mpi/openmpi/gcc_9.2/inbox/4.0.2/bin/mpif90
Using libraries: -Wl,-rpath,/scratch3/home/fh04/fh04/jdshanks/petsc_install/gnu/lib -L/scratch3/home/fh04/fh04/jdshanks/petsc_install/gnu/lib -lpetsc -Wl,-rpath,/opt/arm/armpl-20.0.0_ThunderX2CN99_SUSE-12_gcc_9.2.0_aarch64-linux/lib -L/opt/arm/armpl-20.0.0_ThunderX2CN99_SUSE-12_gcc_9.2.0_aarch64-linux/lib -Wl,-rpath,/opt/arm/mpi/openmpi/gcc_9.2/inbox/4.0.2/lib -L/opt/arm/mpi/openmpi/gcc_9.2/inbox/4.0.2/lib -Wl,-rpath,/scratch3/arm/gcc-9.2.0_Generic-AArch64_SUSE-12_aarch64-linux/lib/gcc/aarch64-linux/9.2.0 -L/scratch3/arm/gcc-9.2.0_Generic-AArch64_SUSE-12_aarch64-linux/lib/gcc/aarch64-linux/9.2.0 -Wl,-rpath,/scratch3/arm/gcc-9.2.0_Generic-AArch64_SUSE-12_aarch64-linux/lib/gcc -L/scratch3/arm/gcc-9.2.0_Generic-AArch64_SUSE-12_aarch64-linux/lib/gcc -Wl,-rpath,/opt/arm/gcc-9.2.0_Generic-AArch64_SUSE-12_aarch64-linux/lib64 -L/opt/arm/gcc-9.2.0_Generic-AArch64_SUSE-12_aarch64-linux/lib64 -Wl,-rpath,/scratch3/arm/gcc-9.2.0_Generic-AArch64_SUSE-12_aarch64-linux/lib64 -L/scratch3/arm/gcc-9.2.0_Generic-AArch64_SUSE-12_aarch64-linux/lib64 -Wl,-rpath,/opt/arm/gcc-9.2.0_Generic-AArch64_SUSE-12_aarch64-linux/lib -L/opt/arm/gcc-9.2.0_Generic-AArch64_SUSE-12_aarch64-linux/lib -Wl,-rpath,/scratch3/arm/gcc-9.2.0_Generic-AArch64_SUSE-12_aarch64-linux/aarch64-linux/lib -L/scratch3/arm/gcc-9.2.0_Generic-AArch64_SUSE-12_aarch64-linux/aarch64-linux/lib -Wl,-rpath,/scratch3/arm/gcc-9.2.0_Generic-AArch64_SUSE-12_aarch64-linux/lib -L/scratch3/arm/gcc-9.2.0_Generic-AArch64_SUSE-12_aarch64-linux/lib -larmpl_lp64 -lm -lstdc++ -ldl -lmpi_usempif08 -lmpi_usempi_ignore_tkr -lmpi_mpifh -lmpi -lgfortran -lm -lgfortran -lm -lgcc_s -lpthread -lstdc++ -ldl
-----------------------------------------

