
   Tea Version    1.100
       MPI Version
   Task Count     64

 Tea will run from the following input:-

*tea                                                                                                
!Input state                                                                                        
state 1 density=100.0 energy=0.0001                                                                 
state 2 density=0.1 energy=25.0 geometry=cuboid xmin=1.0 xmax=2.0 ymin=1.0 ymax=2.0 zmin=0.0 zmax=1.
state 3 density=0.1 energy=0.1 geometry=cuboid xmin=1.0 xmax=2.0 ymin=1.0 ymax=2.0 zmin=1.0 zmax=6.0
state 4 density=0.1 energy=0.1 geometry=cuboid xmin=2.0 xmax=6.0 ymin=1.0 ymax=2.0 zmin=5.0 zmax=6.0
state 5 density=0.1 energy=0.1 geometry=cuboid xmin=5.0 xmax=6.0 ymin=1.0 ymax=8.0 zmin=5.0 zmax=6.0
state 6 density=0.1 energy=0.1 geometry=cuboid xmin=5.0 xmax=9.0 ymin=7.0 ymax=8.0 zmin=5.0 zmax=6.0
state 7 density=0.1 energy=0.1 geometry=cuboid xmin=8.0 xmax=9.0 ymin=7.0 ymax=8.0 zmin=5.0 zmax=10.
                                                                                                    
! Grid information                                                                                  
x_cells=250                                                                                         
y_cells=250                                                                                         
z_cells=250                                                                                         
xmin=0.0                                                                                            
ymin=0.0                                                                                            
zmin=0.0                                                                                            
xmax=10.0                                                                                           
ymax=10.0                                                                                           
zmax=10.0                                                                                           
                                                                                                    
! Timestep and solver info                                                                          
initial_timestep=0.004                                                                              
end_step=10                                                                                         
tl_max_iters=10000                                                                                  
test_problem 3                                                                                      
use_petsc                                                                                           
tl_eps=1.0e-15                                                                                      
halo_depth=1                                                                                        
*tea                                                                                                

 Initialising and generating

 Reading input file

 Reading specification for state            1

            state density   0.1000E+03
             state energy   0.1000E-03

 Reading specification for state            2

            state density   0.1000E+00
             state energy   0.2500E+02
 state geometry rectangular
               state xmin   0.1000E+01
               state xmax   0.2000E+01
               state ymin   0.1000E+01
               state ymax   0.2000E+01
               state zmin   0.0000E+00
               state zmax   0.1000E+01

 Reading specification for state            3

            state density   0.1000E+00
             state energy   0.1000E+00
 state geometry rectangular
               state xmin   0.1000E+01
               state xmax   0.2000E+01
               state ymin   0.1000E+01
               state ymax   0.2000E+01
               state zmin   0.1000E+01
               state zmax   0.6000E+01

 Reading specification for state            4

            state density   0.1000E+00
             state energy   0.1000E+00
 state geometry rectangular
               state xmin   0.2000E+01
               state xmax   0.6000E+01
               state ymin   0.1000E+01
               state ymax   0.2000E+01
               state zmin   0.5000E+01
               state zmax   0.6000E+01

 Reading specification for state            5

            state density   0.1000E+00
             state energy   0.1000E+00
 state geometry rectangular
               state xmin   0.5000E+01
               state xmax   0.6000E+01
               state ymin   0.1000E+01
               state ymax   0.8000E+01
               state zmin   0.5000E+01
               state zmax   0.6000E+01

 Reading specification for state            6

            state density   0.1000E+00
             state energy   0.1000E+00
 state geometry rectangular
               state xmin   0.5000E+01
               state xmax   0.9000E+01
               state ymin   0.7000E+01
               state ymax   0.8000E+01
               state zmin   0.5000E+01
               state zmax   0.6000E+01

 Reading specification for state            7

            state density   0.1000E+00
             state energy   0.1000E+00
 state geometry rectangular
               state xmin   0.8000E+01
               state xmax   0.9000E+01
               state ymin   0.7000E+01
               state ymax   0.8000E+01
               state zmin   0.5000E+01
               state zmax   0.1000E+02

                   x_cells         250
                   y_cells         250
                   z_cells         250
                      xmin  0.0000E+00
                      ymin  0.0000E+00
                      zmin  0.0000E+00
                      xmax  0.1000E+02
                      ymax  0.1000E+02
                      zmax  0.1000E+02
         initial_timestep   0.4000E-02
                  end_step          10
              test_problem           3

 Using Fortran Kernels

 Input read finished.

 Setting up initial geometry


 Decomposing the mesh into            4  by            4  by            4  chunks

  Using PETSc

 PETSc Setup:
 Absolute Tolerance set to   1.0000000000000001E-015
 max_iters set to       10000
 Generating chunks

 Problem initialised and generated

 Time    0.0000000000000000     
                                 Volume                      Mass                   Density                    Energy                         U
 step:      0   0.10000000000009147E+04   0.97702299999829003E+05   0.97702299999739637E+02   0.12489999999995577E+02   0.97727200000088010E+03

 Starting the calculation
 Step       1 time   0.0000000 timestep   4.00E-03
 Achieved convergence in          270  iterations
 Current Total Iterations:          270
Conduction error  0.2839824E-13
Iteration count      269
 Wall clock    7.3175280094146729     
 Average time per cell    1.1708044815063476E-004
 Step time per cell       1.1705841827392578E-004
 Step       2 time   0.0040000 timestep   4.00E-03
 Achieved convergence in          267  iterations
 Current Total Iterations:          537
Conduction error  0.3187852E-13
Iteration count      266
 Wall clock    14.596101045608521     
 Average time per cell    1.1676880836486816E-004
 Step time per cell       1.1644147491455078E-004
 Step       3 time   0.0080000 timestep   4.00E-03
 Achieved convergence in          265  iterations
 Current Total Iterations:          802
Conduction error  0.3181112E-13
Iteration count      264
 Wall clock    21.776841878890991     
 Average time per cell    1.1614315668741862E-004
 Step time per cell       1.1487601852416993E-004
 Step       4 time   0.0120000 timestep   4.00E-03
 Achieved convergence in          263  iterations
 Current Total Iterations:         1065
Conduction error  0.3462748E-13
Iteration count      262
 Wall clock    28.960042953491211     
 Average time per cell    1.1584017181396485E-004
 Step time per cell       1.1491516876220703E-004
 Step       5 time   0.0160000 timestep   4.00E-03
 Achieved convergence in          262  iterations
 Current Total Iterations:         1327
Conduction error  0.3385599E-13
Iteration count      261
 Wall clock    36.068732976913452     
 Average time per cell    1.1541994552612304E-004
 Step time per cell       1.1372337722778320E-004
 Step       6 time   0.0200000 timestep   4.00E-03
 Achieved convergence in          260  iterations
 Current Total Iterations:         1587
Conduction error  0.3377263E-13
Iteration count      259
 Wall clock    43.176936864852905     
 Average time per cell    1.1513849830627441E-004
 Step time per cell       1.1371535873413087E-004
 Step       7 time   0.0240000 timestep   4.00E-03
 Achieved convergence in          262  iterations
 Current Total Iterations:         1849
Conduction error  0.3120708E-13
Iteration count      261
 Wall clock    50.277194023132324     
 Average time per cell    1.1491930062430246E-004
 Step time per cell       1.1358844757080079E-004
 Step       8 time   0.0280000 timestep   4.00E-03
 Achieved convergence in          262  iterations
 Current Total Iterations:         2111
Conduction error  0.3208159E-13
Iteration count      261
 Wall clock    57.372715950012207     
 Average time per cell    1.1474543190002441E-004
 Step time per cell       1.1351236724853515E-004
 Step       9 time   0.0320000 timestep   4.00E-03
 Achieved convergence in          262  iterations
 Current Total Iterations:         2373
Conduction error  0.3173634E-13
Iteration count      261
 Wall clock    64.530267000198364     
 Average time per cell    1.1472047466701931E-004
 Step time per cell       1.1450465774536132E-004
 Step      10 time   0.0360000 timestep   4.00E-03
 Achieved convergence in          262  iterations
 Current Total Iterations:         2635
Conduction error  0.3095074E-13
Iteration count      261

 Time    4.0000000000000008E-002
                                 Volume                      Mass                   Density                    Energy                         U
 step:     10   0.10000000000009147E+04   0.97702299999829003E+05   0.97702299999739637E+02   0.12489999999995577E+02   0.10181900102370771E+04

 Wall clock    71.629489898681641     
 Average time per cell    1.1460718383789063E-004
 Step time per cell       1.1357155227661133E-004

 Time    4.0000000000000008E-002
                                 Volume                      Mass                   Density                    Energy                         U
 step:     10   0.10000000000009147E+04   0.97702299999829003E+05   0.97702299999739637E+02   0.12489999999995577E+02   0.10181900102370771E+04

Test problem   3 is within   0.5162946E-09% of the expected solution
 This test is considered PASSED

 Calculation complete
 Tea is finishing
 Wall clock    71.633611917495728     
 First step overhead   3.8558006286621094E-002
