 
   Tea Version    1.200
       MPI Version
    OpenMP Version
   Task Count     64
 Thread Count:     1
 
 Tea will run from the following input:-
 
*tea                                                                                                
!Input state                                                                                        
state 1 density=100.0 energy=0.0001                                                                 
state 2 density=0.1 energy=25.0 geometry=cuboid xmin=1.0 xmax=2.0 ymin=1.0 ymax=2.0 zmin=0.0 zmax=1.
state 3 density=0.1 energy=0.1 geometry=cuboid xmin=1.0 xmax=2.0 ymin=1.0 ymax=2.0 zmin=1.0 zmax=6.0
state 4 density=0.1 energy=0.1 geometry=cuboid xmin=2.0 xmax=6.0 ymin=1.0 ymax=2.0 zmin=5.0 zmax=6.0
state 5 density=0.1 energy=0.1 geometry=cuboid xmin=5.0 xmax=6.0 ymin=1.0 ymax=8.0 zmin=5.0 zmax=6.0
state 6 density=0.1 energy=0.1 geometry=cuboid xmin=5.0 xmax=9.0 ymin=7.0 ymax=8.0 zmin=5.0 zmax=6.0
state 7 density=0.1 energy=0.1 geometry=cuboid xmin=8.0 xmax=9.0 ymin=7.0 ymax=8.0 zmin=5.0 zmax=10.
                                                                                                    
! Grid information                                                                                  
x_cells=250                                                                                         
y_cells=250                                                                                         
z_cells=250                                                                                         
xmin=0.0                                                                                            
ymin=0.0                                                                                            
zmin=0.0                                                                                            
xmax=10.0                                                                                           
ymax=10.0                                                                                           
zmax=10.0                                                                                           
                                                                                                    
! Timestep and solver info                                                                          
initial_timestep=0.004                                                                              
end_step=10                                                                                         
tl_max_iters=100                                                                                    
test_problem 3                                                                                      
                                                                                                    
use_hypre                                                                                           
tl_solver_type=2                                                                                    
halo_depth=2                                                                                        
tl_eps=1.0e-15                                                                                      
                                                                                                    
*tea                                                                                                
 
 Initialising and generating
 
 Reading input file
 
 Reading specification for state             1
 
            state density   0.1000E+03
             state energy   0.1000E-03
 
 Reading specification for state             2
 
            state density   0.1000E+00
             state energy   0.2500E+02
 state geometry rectangular
               state xmin   0.1000E+01
               state xmax   0.2000E+01
               state ymin   0.1000E+01
               state ymax   0.2000E+01
               state zmin   0.0000E+00
               state zmax   0.1000E+01
 
 Reading specification for state             3
 
            state density   0.1000E+00
             state energy   0.1000E+00
 state geometry rectangular
               state xmin   0.1000E+01
               state xmax   0.2000E+01
               state ymin   0.1000E+01
               state ymax   0.2000E+01
               state zmin   0.1000E+01
               state zmax   0.6000E+01
 
 Reading specification for state             4
 
            state density   0.1000E+00
             state energy   0.1000E+00
 state geometry rectangular
               state xmin   0.2000E+01
               state xmax   0.6000E+01
               state ymin   0.1000E+01
               state ymax   0.2000E+01
               state zmin   0.5000E+01
               state zmax   0.6000E+01
 
 Reading specification for state             5
 
            state density   0.1000E+00
             state energy   0.1000E+00
 state geometry rectangular
               state xmin   0.5000E+01
               state xmax   0.6000E+01
               state ymin   0.1000E+01
               state ymax   0.8000E+01
               state zmin   0.5000E+01
               state zmax   0.6000E+01
 
 Reading specification for state             6
 
            state density   0.1000E+00
             state energy   0.1000E+00
 state geometry rectangular
               state xmin   0.5000E+01
               state xmax   0.9000E+01
               state ymin   0.7000E+01
               state ymax   0.8000E+01
               state zmin   0.5000E+01
               state zmax   0.6000E+01
 
 Reading specification for state             7
 
            state density   0.1000E+00
             state energy   0.1000E+00
 state geometry rectangular
               state xmin   0.8000E+01
               state xmax   0.9000E+01
               state ymin   0.7000E+01
               state ymax   0.8000E+01
               state zmin   0.5000E+01
               state zmax   0.1000E+02
 
                   x_cells         250
                   y_cells         250
                   z_cells         250
                      xmin  0.0000E+00
                      ymin  0.0000E+00
                      zmin  0.0000E+00
                      xmax  0.1000E+02
                      ymax  0.1000E+02
                      zmax  0.1000E+02
         initial_timestep   0.4000E-02
                  end_step          10
              test_problem           3
                halo_depth           2
       tl_ppcg_inner_steps          28
 
 Using Fortran Kernels
 
 Input read finished.
 
 Setting up initial geometry
 
 
 Decomposing the mesh into             4  by             4  by             4 
  chunks
 
 Generating chunks
 
 Problem initialised and generated
 
 Time     0.000000000000000     
                                 Volume                      Mass                   Density                    Energy                         U
 step:      0   0.10000000000009147E+04   0.97702299999828989E+05   0.97702299999739623E+02   0.12489999999995577E+02   0.97727200000088010E+03
 
 Starting the calculation
 Step       1 time   0.0000000 timestep   4.00E-03
 Wall clock     1.579041957855225     
 Average time per cell    2.5264671325683595E-005
 Step time per cell       2.5264671325683595E-005
 Step       2 time   0.0040000 timestep   4.00E-03
 Wall clock     3.074696063995361     
 Average time per cell    2.4597568511962891E-005
 Step time per cell       2.3872608184814452E-005
 Step       3 time   0.0080000 timestep   4.00E-03
 Wall clock     4.565200090408325     
 Average time per cell    2.4347733815511068E-005
 Step time per cell       2.3793231964111328E-005
 Step       4 time   0.0120000 timestep   4.00E-03
 Wall clock     6.100153923034668     
 Average time per cell    2.4400615692138671E-005
 Step time per cell       2.4504383087158202E-005
 Step       5 time   0.0160000 timestep   4.00E-03
 Wall clock     7.592911005020142     
 Average time per cell    2.4297315216064454E-005
 Step time per cell       2.3826461791992187E-005
 Step       6 time   0.0200000 timestep   4.00E-03
 Wall clock     9.083145141601563     
 Average time per cell    2.4221720377604168E-005
 Step time per cell       2.3785873413085939E-005
 Step       7 time   0.0240000 timestep   4.00E-03
 Wall clock     10.66582012176514     
 Average time per cell    2.4379017421177455E-005
 Step time per cell       2.5264255523681642E-005
 Step       8 time   0.0280000 timestep   4.00E-03
 Wall clock     12.21586704254150     
 Average time per cell    2.4431734085083008E-005
 Step time per cell       2.4742431640625001E-005
 Step       9 time   0.0320000 timestep   4.00E-03
 Wall clock     13.76992392539978     
 Average time per cell    2.4479864756266276E-005
 Step time per cell       2.4806510925292969E-005
 Step      10 time   0.0360000 timestep   4.00E-03
 
 Time    4.0000000000000008E-002
                                 Volume                      Mass                   Density                    Energy                         U
 step:     10   0.10000000000009147E+04   0.97702299999828989E+05   0.97702299999739623E+02   0.12489999999984672E+02   0.10181900102370776E+04
 
 Wall clock     15.33428406715393     
 Average time per cell    2.4534854507446290E-005
 Step time per cell       2.4971439361572266E-005
 
 Time    4.0000000000000008E-002
                                 Volume                      Mass                   Density                    Energy                         U
 step:     10   0.10000000000009147E+04   0.97702299999828989E+05   0.97702299999739623E+02   0.12489999999984672E+02   0.10181900102370776E+04
 
Test problem   3 is within   0.5163425E-09% of the expected solution
 This test is considered PASSED
 
 Calculation complete
 Tea is finishing
 First step overhead   8.7004899978637695E-002
 Wall clock     15.34007000923157     
