Source SWCi,Target SWCi,Data Domain,Data Description,Transport,Format,Middleware,Interface Description,SDLC,DCP Instance,DCP Pattern,GUID
AT00001,AT00002,Alert,Alerts,SFTP,TDS,,Alerts description,SDLC-12345,,,CORCID00001
AT00002,AT00002,Case,Cases,MFT,XML,Informatica,Compliance Cases,SDLC-54321,AT1234,S-D-T,CORCID00002
AT00002,AT00002,Case,Cases,MFT,XML,Informatica,Compliance Cases,SDLC-54321,AT1234,S-D-T,
