"BehaviorSpace results (NetLogo 6.0.4)"
"/home/ds42723/git/cabm/essa2019/local/netlogo/input/zombies/model/zombies.nlogo"
"x-02"
"06/04/2019 12:34:48:182 +0100"
"min-pxcor","max-pxcor","min-pycor","max-pycor"
"-30","30","-30","30"
"[run number]","survivors","food-respawn-time","shambler-speed","shamblers","progenitors","initial-mutation-deviation","heat-evap-rate","show-heat?","initial-survivor-courage","initial-survivor-speed","[step]","food","count zombies","count humans","count zombies","count humans","food","mean [courage] of turtles with [heredity = 1]","mean [speed] of turtles with [heredity = 1]","mean [speed] of turtles with [heredity = 1]","mean [courage] of turtles with [heredity = 1]","mean [mutation] of turtles with [heredity = 1] * 10","mean [mutation] of turtles with [heredity = 1]"
"1","11.3605194015","168.784813935","1.0177843229","157.29597497","7.77632724318","0.00596309413359","15.9844278474","false","1.13755906129","1.5355805092","0","41","157","11","157","11","41","1.1383448071674236","1.5389428029316667","1.5389428029316667","1.1383448071674236","0.05958872229856205","0.005958872229856205"
"1","11.3605194015","168.784813935","1.0177843229","157.29597497","7.77632724318","0.00596309413359","15.9844278474","false","1.13755906129","1.5355805092","1","41","157","11","157","11","41","1.1383448071674236","1.538942802931667","1.538942802931667","1.1383448071674236","0.05958872229856205","0.005958872229856205"
"1","11.3605194015","168.784813935","1.0177843229","157.29597497","7.77632724318","0.00596309413359","15.9844278474","false","1.13755906129","1.5355805092","2","40","156","11","156","11","40","1.1383448071674236","1.538942802931667","1.538942802931667","1.1383448071674236","0.05958872229856205","0.005958872229856205"
"1","11.3605194015","168.784813935","1.0177843229","157.29597497","7.77632724318","0.00596309413359","15.9844278474","false","1.13755906129","1.5355805092","3","39","156","11","156","11","39","1.1383448071674236","1.5389428029316667","1.5389428029316667","1.1383448071674236","0.05958872229856205","0.005958872229856205"
"1","11.3605194015","168.784813935","1.0177843229","157.29597497","7.77632724318","0.00596309413359","15.9844278474","false","1.13755906129","1.5355805092","4","38","156","11","156","11","38","1.1383448071674236","1.538942802931667","1.538942802931667","1.1383448071674236","0.05958872229856205","0.005958872229856205"
"1","11.3605194015","168.784813935","1.0177843229","157.29597497","7.77632724318","0.00596309413359","15.9844278474","false","1.13755906129","1.5355805092","5","37","156","11","156","11","37","1.1383448071674236","1.5389428029316667","1.5389428029316667","1.1383448071674236","0.05958872229856205","0.005958872229856205"
"1","11.3605194015","168.784813935","1.0177843229","157.29597497","7.77632724318","0.00596309413359","15.9844278474","false","1.13755906129","1.5355805092","6","37","156","11","156","11","37","1.1383448071674236","1.538942802931667","1.538942802931667","1.1383448071674236","0.05958872229856205","0.005958872229856205"
"1","11.3605194015","168.784813935","1.0177843229","157.29597497","7.77632724318","0.00596309413359","15.9844278474","false","1.13755906129","1.5355805092","7","37","156","11","156","11","37","1.1383448071674236","1.5389428029316667","1.5389428029316667","1.1383448071674236","0.05958872229856205","0.005958872229856205"
"1","11.3605194015","168.784813935","1.0177843229","157.29597497","7.77632724318","0.00596309413359","15.9844278474","false","1.13755906129","1.5355805092","8","37","157","10","157","10","37","1.1383448071674234","1.5389428029316667","1.5389428029316667","1.1383448071674234","0.05958872229856205","0.005958872229856205"
"1","11.3605194015","168.784813935","1.0177843229","157.29597497","7.77632724318","0.00596309413359","15.9844278474","false","1.13755906129","1.5355805092","9","37","158","9","158","9","37","1.1383448071674236","1.538942802931667","1.538942802931667","1.1383448071674236","0.05958872229856205","0.005958872229856205"
"1","11.3605194015","168.784813935","1.0177843229","157.29597497","7.77632724318","0.00596309413359","15.9844278474","false","1.13755906129","1.5355805092","10","36","158","9","158","9","36","1.1383448071674236","1.5389428029316667","1.5389428029316667","1.1383448071674236","0.05958872229856205","0.005958872229856205"
"1","11.3605194015","168.784813935","1.0177843229","157.29597497","7.77632724318","0.00596309413359","15.9844278474","false","1.13755906129","1.5355805092","11","36","158","9","158","9","36","1.1383448071674236","1.5389428029316667","1.5389428029316667","1.1383448071674236","0.05958872229856207","0.005958872229856207"
"1","11.3605194015","168.784813935","1.0177843229","157.29597497","7.77632724318","0.00596309413359","15.9844278474","false","1.13755906129","1.5355805092","12","35","158","9","158","9","35","1.1383448071674236","1.5389428029316667","1.5389428029316667","1.1383448071674236","0.05958872229856205","0.005958872229856205"
"1","11.3605194015","168.784813935","1.0177843229","157.29597497","7.77632724318","0.00596309413359","15.9844278474","false","1.13755906129","1.5355805092","13","35","158","9","158","9","35","1.1383448071674236","1.538942802931667","1.538942802931667","1.1383448071674236","0.05958872229856207","0.005958872229856207"
"1","11.3605194015","168.784813935","1.0177843229","157.29597497","7.77632724318","0.00596309413359","15.9844278474","false","1.13755906129","1.5355805092","14","34","158","9","158","9","34","1.1383448071674236","1.538942802931667","1.538942802931667","1.1383448071674236","0.05958872229856205","0.005958872229856205"
"1","11.3605194015","168.784813935","1.0177843229","157.29597497","7.77632724318","0.00596309413359","15.9844278474","false","1.13755906129","1.5355805092","15","34","158","9","158","9","34","1.1383448071674236","1.5389428029316667","1.5389428029316667","1.1383448071674236","0.05958872229856205","0.005958872229856205"
"1","11.3605194015","168.784813935","1.0177843229","157.29597497","7.77632724318","0.00596309413359","15.9844278474","false","1.13755906129","1.5355805092","16","33","158","9","158","9","33","1.1383448071674236","1.5389428029316667","1.5389428029316667","1.1383448071674236","0.05958872229856205","0.005958872229856205"
"1","11.3605194015","168.784813935","1.0177843229","157.29597497","7.77632724318","0.00596309413359","15.9844278474","false","1.13755906129","1.5355805092","17","32","157","9","157","9","32","1.1383448071674236","1.5389428029316667","1.5389428029316667","1.1383448071674236","0.05958872229856205","0.005958872229856205"
"1","11.3605194015","168.784813935","1.0177843229","157.29597497","7.77632724318","0.00596309413359","15.9844278474","false","1.13755906129","1.5355805092","18","32","157","9","157","9","32","1.1383448071674236","1.538942802931667","1.538942802931667","1.1383448071674236","0.05958872229856205","0.005958872229856205"
"1","11.3605194015","168.784813935","1.0177843229","157.29597497","7.77632724318","0.00596309413359","15.9844278474","false","1.13755906129","1.5355805092","19","32","157","9","157","9","32","1.1383448071674236","1.538942802931667","1.538942802931667","1.1383448071674236","0.05958872229856205","0.005958872229856205"
"1","11.3605194015","168.784813935","1.0177843229","157.29597497","7.77632724318","0.00596309413359","15.9844278474","false","1.13755906129","1.5355805092","20","32","158","8","158","8","32","1.1383448071674236","1.538942802931667","1.538942802931667","1.1383448071674236","0.05958872229856205","0.005958872229856205"
"1","11.3605194015","168.784813935","1.0177843229","157.29597497","7.77632724318","0.00596309413359","15.9844278474","false","1.13755906129","1.5355805092","21","32","157","8","157","8","32","1.1383448071674236","1.538942802931667","1.538942802931667","1.1383448071674236","0.05958872229856205","0.005958872229856205"
