"BehaviorSpace results (NetLogo 6.0.4)"
"/home/ds42723/git/cabm/essa2019/local/netlogo/input/zombies/model/zombies.nlogo"
"x-08"
"06/04/2019 12:35:46:016 +0100"
"min-pxcor","max-pxcor","min-pycor","max-pycor"
"-30","30","-30","30"
"[run number]","survivors","food-respawn-time","shambler-speed","shamblers","progenitors","initial-mutation-deviation","heat-evap-rate","show-heat?","initial-survivor-courage","initial-survivor-speed","[step]","food","count zombies","count humans","count zombies","count humans","food","mean [courage] of turtles with [heredity = 1]","mean [speed] of turtles with [heredity = 1]","mean [speed] of turtles with [heredity = 1]","mean [courage] of turtles with [heredity = 1]","mean [mutation] of turtles with [heredity = 1] * 10","mean [mutation] of turtles with [heredity = 1]"
"1","11.7216251287","134.670006833","1.14024004229","31.3373052008","5.12964834317","0.0466191733021","23.8998360048","true","1.4617044754","0.455800054885","0","54","31","11","31","11","54","1.4752743690859942","0.44887429597703404","0.44887429597703404","1.4752743690859942","0.470225383897595","0.0470225383897595"
"1","11.7216251287","134.670006833","1.14024004229","31.3373052008","5.12964834317","0.0466191733021","23.8998360048","true","1.4617044754","0.455800054885","1","54","31","11","31","11","54","1.4752743690859942","0.448874295977034","0.448874295977034","1.4752743690859942","0.47022538389759494","0.04702253838975949"
"1","11.7216251287","134.670006833","1.14024004229","31.3373052008","5.12964834317","0.0466191733021","23.8998360048","true","1.4617044754","0.455800054885","2","54","31","11","31","11","54","1.4752743690859942","0.44887429597703404","0.44887429597703404","1.4752743690859942","0.4702253838975951","0.04702253838975951"
"1","11.7216251287","134.670006833","1.14024004229","31.3373052008","5.12964834317","0.0466191733021","23.8998360048","true","1.4617044754","0.455800054885","3","54","31","11","31","11","54","1.4752743690859937","0.448874295977034","0.448874295977034","1.4752743690859937","0.470225383897595","0.0470225383897595"
"1","11.7216251287","134.670006833","1.14024004229","31.3373052008","5.12964834317","0.0466191733021","23.8998360048","true","1.4617044754","0.455800054885","4","53","30","11","30","11","53","1.4752743690859942","0.448874295977034","0.448874295977034","1.4752743690859942","0.4702253838975951","0.04702253838975951"
"1","11.7216251287","134.670006833","1.14024004229","31.3373052008","5.12964834317","0.0466191733021","23.8998360048","true","1.4617044754","0.455800054885","5","52","30","11","30","11","52","1.4752743690859942","0.44887429597703404","0.44887429597703404","1.4752743690859942","0.470225383897595","0.0470225383897595"
"1","11.7216251287","134.670006833","1.14024004229","31.3373052008","5.12964834317","0.0466191733021","23.8998360048","true","1.4617044754","0.455800054885","6","52","31","10","31","10","52","1.4752743690859942","0.448874295977034","0.448874295977034","1.4752743690859942","0.470225383897595","0.0470225383897595"
"1","11.7216251287","134.670006833","1.14024004229","31.3373052008","5.12964834317","0.0466191733021","23.8998360048","true","1.4617044754","0.455800054885","7","50","31","10","31","10","50","1.4752743690859937","0.44887429597703404","0.44887429597703404","1.4752743690859937","0.470225383897595","0.0470225383897595"
"1","11.7216251287","134.670006833","1.14024004229","31.3373052008","5.12964834317","0.0466191733021","23.8998360048","true","1.4617044754","0.455800054885","8","48","31","10","31","10","48","1.4752743690859942","0.448874295977034","0.448874295977034","1.4752743690859942","0.470225383897595","0.0470225383897595"
"1","11.7216251287","134.670006833","1.14024004229","31.3373052008","5.12964834317","0.0466191733021","23.8998360048","true","1.4617044754","0.455800054885","9","48","31","10","31","10","48","1.4752743690859937","0.44887429597703404","0.44887429597703404","1.4752743690859937","0.470225383897595","0.0470225383897595"
"1","11.7216251287","134.670006833","1.14024004229","31.3373052008","5.12964834317","0.0466191733021","23.8998360048","true","1.4617044754","0.455800054885","10","46","31","10","31","10","46","1.4752743690859937","0.448874295977034","0.448874295977034","1.4752743690859937","0.4702253838975951","0.04702253838975951"
"1","11.7216251287","134.670006833","1.14024004229","31.3373052008","5.12964834317","0.0466191733021","23.8998360048","true","1.4617044754","0.455800054885","11","45","31","10","31","10","45","1.4752743690859942","0.448874295977034","0.448874295977034","1.4752743690859942","0.4702253838975951","0.04702253838975951"
"1","11.7216251287","134.670006833","1.14024004229","31.3373052008","5.12964834317","0.0466191733021","23.8998360048","true","1.4617044754","0.455800054885","12","44","31","10","31","10","44","1.4752743690859942","0.448874295977034","0.448874295977034","1.4752743690859942","0.470225383897595","0.0470225383897595"
"1","11.7216251287","134.670006833","1.14024004229","31.3373052008","5.12964834317","0.0466191733021","23.8998360048","true","1.4617044754","0.455800054885","13","43","31","10","31","10","43","1.4752743690859942","0.44887429597703404","0.44887429597703404","1.4752743690859942","0.470225383897595","0.0470225383897595"
"1","11.7216251287","134.670006833","1.14024004229","31.3373052008","5.12964834317","0.0466191733021","23.8998360048","true","1.4617044754","0.455800054885","14","43","31","10","31","10","43","1.4752743690859942","0.448874295977034","0.448874295977034","1.4752743690859942","0.470225383897595","0.0470225383897595"
"1","11.7216251287","134.670006833","1.14024004229","31.3373052008","5.12964834317","0.0466191733021","23.8998360048","true","1.4617044754","0.455800054885","15","42","31","10","31","10","42","1.4752743690859942","0.448874295977034","0.448874295977034","1.4752743690859942","0.4702253838975951","0.04702253838975951"
"1","11.7216251287","134.670006833","1.14024004229","31.3373052008","5.12964834317","0.0466191733021","23.8998360048","true","1.4617044754","0.455800054885","16","42","31","10","31","10","42","1.4752743690859942","0.448874295977034","0.448874295977034","1.4752743690859942","0.470225383897595","0.0470225383897595"
"1","11.7216251287","134.670006833","1.14024004229","31.3373052008","5.12964834317","0.0466191733021","23.8998360048","true","1.4617044754","0.455800054885","17","41","30","10","30","10","41","1.4752743690859937","0.44887429597703404","0.44887429597703404","1.4752743690859937","0.470225383897595","0.0470225383897595"
"1","11.7216251287","134.670006833","1.14024004229","31.3373052008","5.12964834317","0.0466191733021","23.8998360048","true","1.4617044754","0.455800054885","18","41","30","10","30","10","41","1.4752743690859942","0.448874295977034","0.448874295977034","1.4752743690859942","0.470225383897595","0.0470225383897595"
"1","11.7216251287","134.670006833","1.14024004229","31.3373052008","5.12964834317","0.0466191733021","23.8998360048","true","1.4617044754","0.455800054885","19","41","30","10","30","10","41","1.4752743690859942","0.44887429597703393","0.44887429597703393","1.4752743690859942","0.470225383897595","0.0470225383897595"
"1","11.7216251287","134.670006833","1.14024004229","31.3373052008","5.12964834317","0.0466191733021","23.8998360048","true","1.4617044754","0.455800054885","20","40","30","10","30","10","40","1.4752743690859942","0.448874295977034","0.448874295977034","1.4752743690859942","0.4702253838975951","0.04702253838975951"
"1","11.7216251287","134.670006833","1.14024004229","31.3373052008","5.12964834317","0.0466191733021","23.8998360048","true","1.4617044754","0.455800054885","21","40","30","10","30","10","40","1.4752743690859942","0.448874295977034","0.448874295977034","1.4752743690859942","0.470225383897595","0.0470225383897595"
"1","11.7216251287","134.670006833","1.14024004229","31.3373052008","5.12964834317","0.0466191733021","23.8998360048","true","1.4617044754","0.455800054885","22","39","30","10","30","10","39","1.4752743690859942","0.448874295977034","0.448874295977034","1.4752743690859942","0.470225383897595","0.0470225383897595"
"1","11.7216251287","134.670006833","1.14024004229","31.3373052008","5.12964834317","0.0466191733021","23.8998360048","true","1.4617044754","0.455800054885","23","39","31","9","31","9","39","1.4752743690859942","0.44887429597703404","0.44887429597703404","1.4752743690859942","0.470225383897595","0.0470225383897595"
"1","11.7216251287","134.670006833","1.14024004229","31.3373052008","5.12964834317","0.0466191733021","23.8998360048","true","1.4617044754","0.455800054885","24","38","32","8","32","8","38","1.4752743690859937","0.448874295977034","0.448874295977034","1.4752743690859937","0.470225383897595","0.0470225383897595"
"1","11.7216251287","134.670006833","1.14024004229","31.3373052008","5.12964834317","0.0466191733021","23.8998360048","true","1.4617044754","0.455800054885","25","37","31","8","31","8","37","1.4752743690859937","0.448874295977034","0.448874295977034","1.4752743690859937","0.470225383897595","0.0470225383897595"
"1","11.7216251287","134.670006833","1.14024004229","31.3373052008","5.12964834317","0.0466191733021","23.8998360048","true","1.4617044754","0.455800054885","26","37","31","8","31","8","37","1.4752743690859942","0.448874295977034","0.448874295977034","1.4752743690859942","0.470225383897595","0.0470225383897595"
"1","11.7216251287","134.670006833","1.14024004229","31.3373052008","5.12964834317","0.0466191733021","23.8998360048","true","1.4617044754","0.455800054885","27","37","31","8","31","8","37","1.4752743690859937","0.448874295977034","0.448874295977034","1.4752743690859937","0.470225383897595","0.0470225383897595"
"1","11.7216251287","134.670006833","1.14024004229","31.3373052008","5.12964834317","0.0466191733021","23.8998360048","true","1.4617044754","0.455800054885","28","36","31","8","31","8","36","1.4752743690859942","0.44887429597703404","0.44887429597703404","1.4752743690859942","0.470225383897595","0.0470225383897595"
"1","11.7216251287","134.670006833","1.14024004229","31.3373052008","5.12964834317","0.0466191733021","23.8998360048","true","1.4617044754","0.455800054885","29","36","31","8","31","8","36","1.4752743690859942","0.44887429597703404","0.44887429597703404","1.4752743690859942","0.4702253838975951","0.04702253838975951"
"1","11.7216251287","134.670006833","1.14024004229","31.3373052008","5.12964834317","0.0466191733021","23.8998360048","true","1.4617044754","0.455800054885","30","36","31","8","31","8","36","1.4752743690859942","0.448874295977034","0.448874295977034","1.4752743690859942","0.470225383897595","0.0470225383897595"
"1","11.7216251287","134.670006833","1.14024004229","31.3373052008","5.12964834317","0.0466191733021","23.8998360048","true","1.4617044754","0.455800054885","31","36","31","8","31","8","36","1.4752743690859942","0.448874295977034","0.448874295977034","1.4752743690859942","0.470225383897595","0.0470225383897595"
"1","11.7216251287","134.670006833","1.14024004229","31.3373052008","5.12964834317","0.0466191733021","23.8998360048","true","1.4617044754","0.455800054885","32","35","30","8","30","8","35","1.4752743690859944","0.448874295977034","0.448874295977034","1.4752743690859944","0.470225383897595","0.0470225383897595"
"1","11.7216251287","134.670006833","1.14024004229","31.3373052008","5.12964834317","0.0466191733021","23.8998360048","true","1.4617044754","0.455800054885","33","34","29","8","29","8","34","1.4752743690859942","0.448874295977034","0.448874295977034","1.4752743690859942","0.470225383897595","0.0470225383897595"
"1","11.7216251287","134.670006833","1.14024004229","31.3373052008","5.12964834317","0.0466191733021","23.8998360048","true","1.4617044754","0.455800054885","34","34","29","8","29","8","34","1.4752743690859942","0.448874295977034","0.448874295977034","1.4752743690859942","0.470225383897595","0.0470225383897595"
"1","11.7216251287","134.670006833","1.14024004229","31.3373052008","5.12964834317","0.0466191733021","23.8998360048","true","1.4617044754","0.455800054885","35","34","29","8","29","8","34","1.4752743690859942","0.44887429597703404","0.44887429597703404","1.4752743690859942","0.470225383897595","0.0470225383897595"
"1","11.7216251287","134.670006833","1.14024004229","31.3373052008","5.12964834317","0.0466191733021","23.8998360048","true","1.4617044754","0.455800054885","36","33","29","8","29","8","33","1.4752743690859942","0.448874295977034","0.448874295977034","1.4752743690859942","0.470225383897595","0.0470225383897595"
"1","11.7216251287","134.670006833","1.14024004229","31.3373052008","5.12964834317","0.0466191733021","23.8998360048","true","1.4617044754","0.455800054885","37","33","28","8","28","8","33","1.4752743690859937","0.44887429597703404","0.44887429597703404","1.4752743690859937","0.4702253838975951","0.04702253838975951"
"1","11.7216251287","134.670006833","1.14024004229","31.3373052008","5.12964834317","0.0466191733021","23.8998360048","true","1.4617044754","0.455800054885","38","33","28","8","28","8","33","1.4752743690859942","0.44887429597703404","0.44887429597703404","1.4752743690859942","0.470225383897595","0.0470225383897595"
"1","11.7216251287","134.670006833","1.14024004229","31.3373052008","5.12964834317","0.0466191733021","23.8998360048","true","1.4617044754","0.455800054885","39","33","28","8","28","8","33","1.4752743690859937","0.448874295977034","0.448874295977034","1.4752743690859937","0.4702253838975951","0.04702253838975951"
"1","11.7216251287","134.670006833","1.14024004229","31.3373052008","5.12964834317","0.0466191733021","23.8998360048","true","1.4617044754","0.455800054885","40","32","29","7","29","7","32","1.4752743690859942","0.44887429597703404","0.44887429597703404","1.4752743690859942","0.4702253838975951","0.04702253838975951"
"1","11.7216251287","134.670006833","1.14024004229","31.3373052008","5.12964834317","0.0466191733021","23.8998360048","true","1.4617044754","0.455800054885","41","31","29","7","29","7","31","1.4752743690859942","0.448874295977034","0.448874295977034","1.4752743690859942","0.470225383897595","0.0470225383897595"
"1","11.7216251287","134.670006833","1.14024004229","31.3373052008","5.12964834317","0.0466191733021","23.8998360048","true","1.4617044754","0.455800054885","42","31","29","7","29","7","31","1.4752743690859942","0.448874295977034","0.448874295977034","1.4752743690859942","0.470225383897595","0.0470225383897595"
"1","11.7216251287","134.670006833","1.14024004229","31.3373052008","5.12964834317","0.0466191733021","23.8998360048","true","1.4617044754","0.455800054885","43","31","29","7","29","7","31","1.4752743690859937","0.448874295977034","0.448874295977034","1.4752743690859937","0.470225383897595","0.0470225383897595"
"1","11.7216251287","134.670006833","1.14024004229","31.3373052008","5.12964834317","0.0466191733021","23.8998360048","true","1.4617044754","0.455800054885","44","31","29","7","29","7","31","1.4752743690859942","0.448874295977034","0.448874295977034","1.4752743690859942","0.470225383897595","0.0470225383897595"
"1","11.7216251287","134.670006833","1.14024004229","31.3373052008","5.12964834317","0.0466191733021","23.8998360048","true","1.4617044754","0.455800054885","45","31","29","7","29","7","31","1.4752743690859942","0.448874295977034","0.448874295977034","1.4752743690859942","0.4702253838975951","0.04702253838975951"
"1","11.7216251287","134.670006833","1.14024004229","31.3373052008","5.12964834317","0.0466191733021","23.8998360048","true","1.4617044754","0.455800054885","46","30","28","7","28","7","30","1.4752743690859942","0.448874295977034","0.448874295977034","1.4752743690859942","0.470225383897595","0.0470225383897595"
"1","11.7216251287","134.670006833","1.14024004229","31.3373052008","5.12964834317","0.0466191733021","23.8998360048","true","1.4617044754","0.455800054885","47","30","28","7","28","7","30","1.4752743690859942","0.448874295977034","0.448874295977034","1.4752743690859942","0.470225383897595","0.0470225383897595"
"1","11.7216251287","134.670006833","1.14024004229","31.3373052008","5.12964834317","0.0466191733021","23.8998360048","true","1.4617044754","0.455800054885","48","30","28","7","28","7","30","1.4752743690859937","0.44887429597703404","0.44887429597703404","1.4752743690859937","0.4702253838975951","0.04702253838975951"
"1","11.7216251287","134.670006833","1.14024004229","31.3373052008","5.12964834317","0.0466191733021","23.8998360048","true","1.4617044754","0.455800054885","49","30","29","6","29","6","30","1.4752743690859937","0.44887429597703404","0.44887429597703404","1.4752743690859937","0.4702253838975951","0.04702253838975951"
"1","11.7216251287","134.670006833","1.14024004229","31.3373052008","5.12964834317","0.0466191733021","23.8998360048","true","1.4617044754","0.455800054885","50","30","28","6","28","6","30","1.4752743690859942","0.44887429597703404","0.44887429597703404","1.4752743690859942","0.470225383897595","0.0470225383897595"
"1","11.7216251287","134.670006833","1.14024004229","31.3373052008","5.12964834317","0.0466191733021","23.8998360048","true","1.4617044754","0.455800054885","51","29","28","6","28","6","29","1.4752743690859942","0.448874295977034","0.448874295977034","1.4752743690859942","0.4702253838975951","0.04702253838975951"
"1","11.7216251287","134.670006833","1.14024004229","31.3373052008","5.12964834317","0.0466191733021","23.8998360048","true","1.4617044754","0.455800054885","52","29","28","6","28","6","29","1.4752743690859942","0.44887429597703404","0.44887429597703404","1.4752743690859942","0.470225383897595","0.0470225383897595"
