"BehaviorSpace results (NetLogo 6.0.4)"
"/home/ds42723/git/cabm/essa2019/local/netlogo/input/zombies/model/zombies.nlogo"
"x-01"
"06/04/2019 12:34:40:152 +0100"
"min-pxcor","max-pxcor","min-pycor","max-pycor"
"-30","30","-30","30"
"[run number]","survivors","food-respawn-time","shambler-speed","shamblers","progenitors","initial-mutation-deviation","heat-evap-rate","show-heat?","initial-survivor-courage","initial-survivor-speed","[step]","food","count zombies","count humans","count zombies","count humans","food","mean [courage] of turtles with [heredity = 1]","mean [speed] of turtles with [heredity = 1]","mean [speed] of turtles with [heredity = 1]","mean [courage] of turtles with [heredity = 1]","mean [mutation] of turtles with [heredity = 1] * 10","mean [mutation] of turtles with [heredity = 1]"
"1","5.40356060371","124.919489577","0.788521953539","61.1299201467","8.13796093676","0.0293930223337","4.1844451871","false","0.783729331675","0.428928272923","0","44","61","5","61","5","44","0.7715695494686621","0.4316523119436223","0.4316523119436223","0.7715695494686621","0.29357673002481743","0.029357673002481745"
