parameter,type,setting,minimum,maximum
food-respawn-time,numeric,180.0,45,180
heat-evap-rate,numeric,25.0,0,99
initial-mutation-deviation,numeric,0.04,0,0.1
initial-survivor-courage,numeric,1.0,0.1,3
initial-survivor-speed,numeric,1.0,0,2
progenitors,numeric,2.0,0,10
shambler-speed,numeric,0.75,0.5,1.5
shamblers,numeric,100.0,1,200
show-heat?,boolean,True,true,false
survivors,numeric,10.0,1,20
