﻿{
  "dependencies": {
    "Microsoft.NETCore.UniversalWindowsPlatform": "5.1.0",
    "OpenCV.Win.Core": "310.6.0",
    "OpenCV.Win.HighGUI": "310.6.0",
    "OpenCV.Win.ImgCodecs": "310.6.0",
    "OpenCV.Win.ImgProc": "310.6.0",
    "OpenCV.Win.VideoIO": "310.6.0"
  },
  "frameworks": {
    "uap10.0": {}
  },
  "runtimes": {
    "win10-arm": {},
    "win10-arm-aot": {},
    "win10-x86": {},
    "win10-x86-aot": {},
    "win10-x64": {},
    "win10-x64-aot": {}
  }
}