[gd_resource type="SpatialMaterial" format=2]

[resource]
albedo_color = Color( 0.89, 0.957833, 1, 1 )
metallic_specular = 1.0
roughness = 0.0
emission_enabled = true
emission = Color( 0.388235, 0.788235, 1, 1 )
emission_energy = 0.5
emission_operator = 0
emission_on_uv2 = false
