15.625;9.375;-3.125;0;-21.875;-9.375;-12.5;-6.25;-6.25;-6.25;-3.125;18.75;15.625;3.125;9.375;6.25;0;-3.125
31.25;31.25;28.125;28.125;25;21.875;0;0;-3.125;12.5;-15.625;-12.5;6.25;15.625;-6.25;15.625;3.125;6.25
15.625;12.5;15.625;18.75;15.625;21.875;15.625;21.875;3.125;15.625;6.25;15.625;6.25;6.25;-3.125;3.125;9.375;25
25;31.25;21.875;25;15.625;9.375;18.75;15.625;12.5;3.125;12.5;15.625;34.375;34.375;9.375;18.75;18.75;15.625
18.75;9.375;3.125;0;0;0;0;-3.125;0;-9.375;-18.75;0;-6.25;12.5;-9.375;0;-12.5;-9.375
15.625;12.5;25;21.875;18.75;9.375;21.875;15.625;21.875;12.5;12.5;12.5;25;28.125;28.125;18.75;18.75;18.75
28.125;37.5;28.125;40.625;37.5;37.5;31.25;34.375;28.125;28.125;31.25;34.375;40.625;37.5;43.75;37.5;34.375;37.5
31.25;25;15.625;9.375;12.5;6.25;3.125;-9.375;6.25;-9.375;6.25;6.25;9.375;12.5;25;21.875;-6.25;-9.375
-9.375;-3.125;3.125;0;0;-6.25;-6.25;-3.125;3.125;3.125;-6.25;3.125;0;3.125;6.25;9.375;-9.375;-9.375
0;6.25;-6.25;-3.125;0;6.25;3.125;28.125;9.375;6.25;12.5;21.875;-6.25;-12.5;0;0;6.25;15.625
18.75;15.625;15.625;21.875;21.875;9.375;25;21.875;9.375;3.125;6.25;15.625;28.125;28.125;18.75;18.75;21.875;21.875
3.125;0;3.125;6.25;-12.5;-6.25;-9.375;-9.375;-3.125;-6.25;-31.25;-18.75;-9.375;-9.375;-6.25;-6.25;-12.5;-6.25
18.75;18.75;25;21.875;25;28.125;28.125;25;25;18.75;34.375;25;18.75;12.5;18.75;15.625;28.125;31.25
-3.125;0;6.25;9.375;21.875;25;18.75;12.5;9.375;12.5;15.625;12.5;3.125;6.25;-18.75;-18.75;12.5;9.375
-15.625;0;3.125;0;3.125;0;3.125;3.125;0;-6.25;-12.5;0;3.125;0;-6.25;-12.5;3.125;6.25
28.125;34.375;31.25;34.375;34.375;37.5;34.375;31.25;28.125;34.375;21.875;12.5;40.625;37.5;28.125;21.875;34.375;34.375
21.875;21.875;18.75;28.125;0;9.375;0;0;9.375;3.125;25;9.375;12.5;18.75;6.25;9.375;3.125;12.5
28.125;34.375;21.875;25;31.25;28.125;25;25;21.875;28.125;6.25;12.5;15.625;15.625;9.375;3.125;9.375;15.625
-15.625;-12.5;6.25;0;-9.375;-9.375;-3.125;0;-3.125;9.375;15.625;18.75;-6.25;6.25;0;-15.625;3.125;-3.125
6.25;21.875;9.375;12.5;0;3.125;6.25;18.75;-6.25;0;-6.25;6.25;15.625;21.875;18.75;15.625;18.75;21.875
-15.625;-3.125;-6.25;0;18.75;25;15.625;18.75;12.5;9.375;-3.125;-15.625;9.375;6.25;6.25;6.25;18.75;28.125
25;25;25;28.125;25;12.5;18.75;21.875;21.875;21.875;18.75;12.5;15.625;25;9.375;21.875;21.875;25
25;25;15.625;15.625;31.25;31.25;43.75;25;34.375;37.5;6.25;25;18.75;3.125;15.625;15.625;31.25;21.875
21.875;15.625;21.875;15.625;18.75;6.25;9.375;3.125;3.125;3.125;18.75;18.75;12.5;15.625;18.75;6.25;15.625;18.75
9.375;6.25;0;-3.125;-6.25;-9.375;0;0;-3.125;-6.25;28.125;28.125;9.375;12.5;21.875;28.125;9.375;3.125
9.375;15.625;6.25;-6.25;9.375;6.25;12.5;6.25;-6.25;9.375;0;-6.25;12.5;3.125;21.875;21.875;9.375;9.375
-6.25;-3.125;-3.125;0;3.125;-15.625;-3.125;6.25;3.125;-15.625;-3.125;9.375;6.25;12.5;15.625;15.625;-3.125;0
28.125;28.125;15.625;18.75;12.5;6.25;0;-9.375;-6.25;-21.875;3.125;3.125;15.625;34.375;37.5;31.25;9.375;9.375
