0.85194;1.26;0.2417;0.42006;0.18442;0.52122;0.064308;-0.47566;-0.014739;-0.0052785;-0.54522;0.11197;0.99485;1.1833;0.50986;0.47194;0.11966;-0.080038
1.7486;1.3893;1.4092;1.4717;0.39651;0.6215;0.17214;-0.031064;-0.1583;0.50754;-0.60091;-0.30104;0.37598;0.38487;-1.088;-0.76149;-0.26746;-0.12213
1.2073;0.99073;1.1353;1.0268;1.2669;1.5785;1.2776;1.4962;1.451;1.4654;0.72777;1.386;0.30768;0.86537;0.74138;0.8572;1.1459;1.1137
1.309;1.1856;1.3773;1.6039;1.426;1.4968;1.2826;1.3588;0.86043;0.19387;0.49215;0.31858;1.8593;1.5062;1.459;1.1136;1.5444;1.0024
1.3788;1.9086;0.51525;0.57081;1.1394;1.0439;0.65676;-0.19336;0.81372;0.22965;0.082175;0.10295;0.80512;0.76866;0.83929;0.57321;-0.75775;-0.68693
0.66356;0.86443;0.85749;1.0552;0.69576;0.9649;0.93328;0.86099;0.61157;0.9303;0.57921;0.55134;0.8215;0.99835;1.0541;0.72608;0.88218;0.90499
5.2071;5.4126;5.5403;5.6379;5.4645;5.1255;5.235;5.1503;4.4423;4.774;4.526;4.1148;5.6543;5.444;5.2076;5.5437;6.1543;5.0765
1.4879;1.7077;0.97263;0.95503;0.81343;0.33753;0.51263;0.057706;0.80492;0.22573;0.88423;0.46491;1.0075;1.2555;0.80209;0.96618;0.21137;0.19223
0.16409;0.59136;0.46648;0.25741;0.48676;0.18209;-0.30586;-0.50084;0.016902;-0.36255;-0.63164;-0.25313;-0.28035;-0.046592;-0.65836;-0.61559;-0.86077;-0.72905
-0.10346;-0.27151;0.19369;0.18041;-0.22461;1.278;-0.5037;1.4756;-0.48723;-0.19604;0.70041;1.0449;-0.028474;0.089534;-0.17349;-0.18406;0.85415;0.99582
-0.36919;0.024117;0.84829;0.25959;1.3134;0.55613;0.70035;0.73119;0.61556;-0.068118;-0.058541;0.028465;0.61746;0.36903;-0.050491;0.37972;0.80546;0.59195
0.68749;1.075;0.40224;-0.077276;-0.48579;-0.28226;-0.48231;-0.48623;-0.40485;-0.29433;-1.3286;-1.1382;-1.2028;-0.66761;-0.73643;-0.37859;-1.4512;-1.3062
0.59421;0.5523;0.52702;0.55084;0.81963;1.2232;1.1387;1.7586;1.3435;1.6622;1.0469;1.1746;0.45895;0.21448;0.89644;0.85386;1.486;1.5536
-0.28016;-0.23767;0.28004;0.35467;1.3485;1.302;1.1836;1.0624;1.1695;1.4573;0.90672;0.72501;0.11452;0.026848;-0.031001;-0.33873;0.58133;0.42188
-1.3801;-0.6476;0.19814;0.11293;-0.33297;-0.34638;-0.64656;-0.35457;-0.74254;-0.29431;-1.2117;-0.85261;-0.065561;-0.13218;-0.77714;-0.83351;-0.74092;-0.16462
1.2327;1.3683;1.0292;1.4393;1.1505;1.3584;1.1794;1.0905;1.1295;0.96805;1.8403;0.97257;1.0059;0.98888;0.43777;0.69947;1.153;1.1528
0.37624;0.3042;0.64072;0.52482;0.64174;0.93005;0.22785;-0.2839;0.02217;0.10046;0.93387;0.54859;-0.117;0.14964;-0.3335;-0.80406;-0.53825;-0.59632
0.66792;0.73445;0.67818;0.66767;0.74835;0.91095;0.45715;0.58499;0.41049;0.77762;0.37155;0.74307;0.51385;0.3239;0.45877;0.36564;0.39696;0.51194
-0.70172;-0.081812;0.096319;0.091371;-0.029133;0.085764;0.50299;0.69217;0.61643;0.85777;0.083768;0.58128;0.19141;0.2558;0.040676;-0.25615;-0.16927;-0.25297
0.84335;0.64567;0.60713;1.703;1.1467;1.4357;0.76827;1.0719;-0.3554;0.64009;0.24238;0.59569;1.2754;1.2475;0.91077;0.80188;0.91031;1.0005
-0.43814;-0.56981;-0.32625;0.20404;0.24676;0.29694;0.38464;0.46141;0.76879;0.075571;-0.79682;-0.68849;0.30287;0.48523;0.1629;0.2225;0.70238;0.67496
1.1499;1.3074;1.3973;1.4065;1.2111;0.91635;1.2693;0.90431;1.2577;1.1277;0.76173;0.97241;0.59214;0.8167;0.2998;0.38721;0.70867;0.53826
1.0592;1.0442;1.294;1.3046;1.2504;1.4191;1.5579;1.39;1.4157;1.2975;1.6794;2.5926;1.2155;0.87484;1.172;0.92275;1.3045;1.235
1.2342;0.84708;1.2904;1.2349;1.4017;1.6923;1.0726;0.85925;0.9269;0.36386;0.84852;0.44203;1.1547;1.0165;1.4741;1.4035;1.1333;1.0286
0.69585;0.94308;1.2174;0.84159;0.50047;0.57121;-0.018213;0.54075;0.58351;0.42578;0.73143;0.89493;0.91468;1.0908;1.0628;1.1271;0.088799;-0.51589
0.64136;0.54757;0.42103;0.37774;0.3109;-0.39186;-0.015899;-0.42647;-0.37305;-0.33954;-0.25246;-0.57148;0.44885;0.058794;0.63306;1.1579;0.11838;0.20651
0.082603;0.1052;0.075355;0.052653;-0.06002;-0.74398;-0.36428;-0.28709;-0.38188;-0.78403;-0.21433;0.1452;0.44341;1.0386;1.1832;1.0507;-0.35852;0.030237
1.3659;0.95069;0.25796;0.72602;0.63824;0.87018;0.42469;0.28407;0.72417;0.4991;-0.10432;-0.1752;0.82429;1.0332;1.1393;1.148;0.50718;0.48979
