-1.8197;1;-2.1524;1;-1.3884;1;-1.6173;1;-1.4726;1;-1.6734;1;-1.5911;1;-2.2151;1;-0.90191;1;-0.49092;1;-2.8968;1;-1.9301;1;-2.8087;1;-3.1778;1;-3.5827;1;-4.3604;1;-2.6371;1;-3.095;1
-1.4367;2;-0.15352;2;-1.0399;2;0.081726;2;-2.3495;2;-1.7945;2;-2.3326;2;-1.7433;2;-1.6482;2;-0.01785;2;-1.956;2;-1.9573;2;-1.2129;2;-0.54322;2;-1.2622;2;-1.3009;2;-1.8926;2;-0.52564;2
-1.4522;3;-1.4267;3;-1.3981;3;-0.32569;3;-1.5235;3;-0.84844;3;-2.2515;3;-1.1349;3;-0.89903;3;-1.3807;3;-0.54956;3;-0.033922;3;-1.2865;3;-1.2547;3;-2.7406;3;-3.2578;3;-1.6315;3;-1.3288;3
0.1067;4;0.38946;4;0.028993;4;0.68343;4;-0.029774;4;0.17946;4;0.22476;4;0.17775;4;0.63686;4;1.0402;4;-1.3857;4;-0.45854;4;-0.21209;4;-0.082167;4;-0.60457;4;-0.26511;4;-0.57979;4;-0.44253;4
-0.34495;5;0.38919;5;-0.046079;5;0.91224;5;-0.58866;5;-0.55122;5;-1.9753;5;-0.10941;5;-2.0651;5;-1.4461;5;-0.027574;5;-0.74623;5;-1.397;5;-0.65473;5;-1.5018;5;-1.0993;5;-0.26609;5;-0.18397;5
-1.413;6;-1.0126;6;-1.1231;6;-0.87497;6;-1.4701;6;-1.762;6;-1.5308;6;-2.5516;6;-1.2707;6;-2.1243;6;-1.4926;6;-1.6496;6;-1.2005;6;-1.6477;6;-2.6012;6;-2.5597;6;-1.7411;6;-1.2249;6
-1.436;7;-1.0405;7;-0.568;7;0.019055;7;0.16535;7;0.99085;7;0.16913;7;-0.47393;7;-0.49499;7;0.041148;7;-0.43989;7;-0.59107;7;-1.5667;7;-1.7117;7;-3.3672;7;-3.1997;7;-0.43664;7;-0.54849;7
-0.98351;8;-0.89415;8;-0.64392;8;-0.65749;8;-1.4522;8;-1.5476;8;-1.3906;8;-1.6561;8;-1.4149;8;-0.77199;8;-1.8551;8;-1.3686;8;-1.2686;8;-1.6904;8;-1.3687;8;-2.2882;8;-1.5125;8;-1.4572;8
-1.3762;9;-1.8601;9;-1.6458;9;-1.7145;9;-1.7957;9;-2.3129;9;-1.8663;9;-2.0113;9;-1.605;9;-2.9022;9;-1.9225;9;-2.9005;9;-2.3109;9;-2.469;9;-2.9909;9;-3.1437;9;-2.295;9;-2.7497;9
-1.7025;10;-1.5586;10;-1.0782;10;-0.7645;10;-1.0657;10;-1.1429;10;-1.432;10;-1.2146;10;-1.6995;10;-1.2799;10;-2.5906;10;-2.0048;10;-1.1819;10;-0.80282;10;-2.2167;10;-2.2349;10;-1.9299;10;-1.5518;10
-0.92729;11;-0.66631;11;-0.90101;11;-0.83718;11;-1.3456;11;-1.1113;11;-1.0524;11;-1.1449;11;-0.48368;11;-0.63803;11;-1.1401;11;-1.1276;11;-0.94966;11;-0.87724;11;-1.4092;11;-1.6036;11;-1.6294;11;-1.5722;11
-0.31764;12;-0.42984;12;-0.70932;12;-0.67845;12;-1.4829;12;-1.8646;12;-1.0914;12;-0.47111;12;-0.64264;12;-0.52819;12;-0.58594;12;-1.0135;12;-1.3744;12;-1.0928;12;-2.0044;12;-1.9797;12;-1.8832;12;-1.4395;12
-0.7739;13;-0.50843;13;-0.45161;13;-0.2547;13;-0.46843;13;-0.24073;13;-0.47194;13;-0.68724;13;0.3085;13;0.16438;13;1.1755;13;0.97385;13;-0.96061;13;-0.6009;13;-0.73422;13;-0.60804;13;-0.46558;13;-0.81982;13
-0.90116;14;-1.0631;14;0.6456;14;0.60926;14;-0.35845;14;-1.1512;14;-0.26144;14;0.55031;14;0.5855;14;0.37786;14;0.15709;14;0.87566;14;0.39638;14;-0.28537;14;-2.4423;14;-2.6938;14;0.63828;14;0.71211;14
-1.4265;15;-1.5906;15;-1.0101;15;-1.0441;15;-1.3042;15;-1.0283;15;-1.2461;15;-1.6538;15;-0.51958;15;-0.65593;15;-1.1097;15;-0.92708;15;-1.863;15;-2.4561;15;-1.814;15;-2.0396;15;-1.8283;15;-1.7598;15
-0.6963;16;-0.28946;16;-0.41785;16;-0.080847;16;-0.73897;16;-0.52309;16;0.20028;16;0.24052;16;1.2649;16;1.0037;16;2.621;16;2.3763;16;-1.5736;16;-1.7685;16;-2.371;16;-1.9546;16;-0.59654;16;-0.52555;16
-0.84202;17;-0.61759;17;-1.0231;17;-0.80706;17;-1.5974;17;-2.1018;17;-1.0986;17;-1.472;17;-0.86259;17;-1.0533;17;-1.6456;17;-1.599;17;-1.4469;17;-1.6911;17;-2.2556;17;-2.2517;17;-1.6912;17;-1.6247;17
-1.3699;18;-0.9161;18;-1.3568;18;-0.90619;18;-1.3625;18;-1.1532;18;-1.3991;18;-1.6664;18;-0.35292;18;-0.62729;18;-1.0234;18;-0.83648;18;-1.357;18;-1.1533;18;-2.5409;18;-2.2035;18;-2.057;18;-1.3882;18
-1.3368;19;-1.4929;19;-0.81829;19;-0.85494;19;-0.46984;19;-0.58166;19;-1.1037;19;-0.69457;19;-1.7082;19;-1.1829;19;-2.2818;19;-1.6598;19;-0.74709;19;-0.74841;19;-1.535;19;-1.3994;19;-1.0685;19;-0.42939;19
-0.77684;20;-0.51038;20;-0.7269;20;-0.44308;20;-1.073;20;-0.78632;20;-1.1919;20;-1.0975;20;-0.512;20;-0.54934;20;-0.8155;20;-0.84839;20;-1.0358;20;-0.8653;20;-1.3734;20;-0.92309;20;-1.5792;20;-1.2398;20
-4.5655;21;-4.8903;21;-8.1154;21;-9.7057;21;-10.022;21;-10.436;21;-4.2165;21;-5.4927;21;-5.0005;21;-3.4008;21;-5.6708;21;-7.4018;21;-10.68;21;-11.047;21;-6.2468;21;-6.7593;21;-7.3866;21;-8.9029;21
-0.22938;22;-0.32242;22;-0.36759;22;0.086861;22;-0.4943;22;-0.57529;22;-1.3604;22;-1.1359;22;-0.77521;22;-0.19624;22;-0.9199;22;-1.1007;22;-0.54777;22;-0.26398;22;-0.76825;22;-0.72407;22;-1.0003;22;-0.91895;22
-1.0416;23;-0.78266;23;-0.97239;23;-1.0608;23;-2.1101;23;-2.0835;23;-1.7341;23;-1.71;23;-1.009;23;-1.0184;23;-1.1863;23;-1.2499;23;-1.6638;23;-1.3102;23;-1.2315;23;-1.4873;23;-1.7774;23;-1.7542;23
-0.86726;24;-0.1056;24;0.11475;24;1.085;24;0.30747;24;1.2649;24;-0.93559;24;-1.0583;24;0.021325;24;-0.23164;24;-0.7272;24;-0.46985;24;-0.12228;24;0.80806;24;-1.4031;24;-0.94827;24;-1.6553;24;-0.073206;24
-0.52626;25;-0.65232;25;-1.0094;25;-1.1159;25;-1.4584;25;-1.8787;25;-1.9089;25;-2.3615;25;-0.94546;25;-1.5132;25;-1.496;25;-1.1197;25;-1.5631;25;-1.4917;25;-1.1261;25;-1.1002;25;-1.9252;25;-2.0731;25
-0.87855;26;-0.65347;26;-1.2152;26;-0.52867;26;-2.0584;26;-0.45892;26;-2.9436;26;-1.0922;26;-0.20441;26;1.1941;26;-1.9153;26;-1.8827;26;-2.7905;26;-0.65494;26;-1.6045;26;-0.6558;26;-2.3541;26;-1.3394;26
-1.0842;27;-1.2096;27;-1.1851;27;-1.3175;27;-1.4724;27;-1.6935;27;-1.5815;27;-1.9891;27;-1.1787;27;-1.3851;27;-1.3179;27;-1.2266;27;-1.6091;27;-2.1443;27;-2.8785;27;-3.1736;27;-1.8175;27;-1.8441;27
-0.40833;28;-0.18632;28;-0.59805;28;-0.58535;28;-0.7603;28;-1.0976;28;-1.3954;28;-1.2498;28;-0.80391;28;-0.49085;28;-1.1189;28;-0.30055;28;-0.5516;28;-0.73432;28;-1.351;28;-1.0841;28;-1.2532;28;-1.0098;28
