-1.0964;1;-1.0159;1;-1.0946;1;-1.0228;1;-1.0205;1;-1.5551;1;-0.98968;1;-1.5842;1;-0.60012;1;-0.81968;1;-0.9305;1;-0.85729;1;-1.3989;1;-1.7782;1;-1.8126;1;-2.4941;1;-1.3236;1;-1.3414;1
-1.1821;2;0.00087171;2;-0.81536;2;0.18073;2;-2.1962;2;-1.6304;2;-1.984;2;-1.4069;2;-1.1005;2;-0.35673;2;-1.2765;2;-1.2471;2;-0.85363;2;-0.28346;2;-0.74231;2;-0.60381;2;-1.4737;2;-0.24598;2
-0.45662;3;-0.012674;3;0.27375;3;1.5104;3;0.031985;3;0.28147;3;-0.59155;3;-1.2216;3;-0.42389;3;1.0269;3;-0.68818;3;-0.34674;3;-0.10096;3;-0.13817;3;-2.1338;3;-2.5934;3;-1.3827;3;-0.32154;3
-0.52422;4;-0.22804;4;-0.83344;4;-0.62454;4;-1.5689;4;-2.7075;4;-1.2943;4;-2.2389;4;-0.50842;4;-0.64674;4;-2.9224;4;-2.3359;4;-1.6112;4;-1.5502;4;-1.0296;4;-0.96924;4;-2.7547;4;-2.8542;4
-0.70596;5;-0.068383;5;0.030163;5;0.96963;5;-0.95407;5;-1.4358;5;-1.7102;5;-0.39679;5;-3.1395;5;-2.6591;5;-0.11987;5;-0.64957;5;-1.2455;5;-0.13763;5;-1.6953;5;-1.5216;5;-0.42094;5;-0.31255;5
-0.28589;6;0.13255;6;0.21853;6;0.68933;6;0.29819;6;0.85574;6;0.5014;6;0.88368;6;0.3567;6;0.84219;6;0.8492;6;1.0132;6;0.59228;6;0.7826;6;-0.44284;6;-0.85994;6;0.88652;6;1.0076;6
-1.0058;7;-0.27434;7;-0.3134;7;0.1546;7;-0.62596;7;0.58697;7;-0.2124;7;-0.78653;7;-0.33846;7;-0.075228;7;0.29724;7;0.10249;7;-1.0968;7;-1.3389;7;-4.0566;7;-3.5024;7;-0.56961;7;-0.081374;7
-0.27153;8;0.20425;8;-0.14833;8;0.56258;8;-0.22226;8;0.21405;8;-0.42215;8;-0.76318;8;-0.44376;8;-0.11248;8;-0.43196;8;-1.3218;8;-0.28117;8;0.059345;8;-0.13215;8;-0.35876;8;-0.77545;8;-0.26825;8
-1.0338;9;-1.0351;9;-0.62107;9;-0.15185;9;-0.63701;9;-1.2472;9;-1.2472;9;-1.2096;9;-1.4292;9;-2.8315;9;-1.1729;9;-1.0439;9;-1.1539;9;-0.88585;9;-2.4741;9;-2.5124;9;-1.6774;9;-1.1659;9
-1.0715;10;-0.66042;10;-0.75814;10;-0.45969;10;-0.63274;10;-0.61933;10;-1.0968;10;-0.42329;10;-1.5597;10;-0.94214;10;-1.0373;10;-1.06;10;-0.92622;10;-0.62155;10;-1.0093;10;-1.3191;10;-0.72948;10;-0.64107;10
0.2887;11;0.68422;11;0.62463;11;1.3774;11;1.05;11;1.1234;11;0.10831;11;0.72372;11;-0.49341;11;-0.19107;11;0.88843;11;0.38025;11;2.427;11;2.6249;11;1.0501;11;0.94428;11;0.9884;11;1.8374;11
-1.487;12;-1.5735;12;-2.1317;12;-1.8322;12;-2.0513;12;-2.1141;12;-2.9268;12;-2.6006;12;-1.9124;12;-2.3058;12;-1.5069;12;-0.88648;12;-2.4032;12;-2.3779;12;-3.352;12;-3.0908;12;-2.348;12;-2.4792;12
-1.186;13;-0.89134;13;-1.2328;13;-0.97555;13;-0.42405;13;0.77103;13;0.012865;13;0.42373;13;1.1127;13;0.5234;13;-0.28783;13;-0.13576;13;-0.68459;13;-0.78144;13;-1.1496;13;-0.87576;13;-0.54474;13;-0.029029;13
-0.09305;14;0.08421;14;0.45117;14;0.74967;14;-1.0124;14;-2.0166;14;-1.6935;14;-1.8443;14;-0.78895;14;-1.1598;14;-1.0665;14;-1.0703;14;0.12014;14;0.75016;14;-1.2029;14;-1.3678;14;-1.0217;14;-0.69617;14
-1.2976;15;-1.7231;15;-0.88271;15;-0.35239;15;-1.8611;15;-1.0919;15;-2.0529;15;-2.4533;15;-0.757;15;-0.11639;15;-1.565;15;-1.446;15;-2.0946;15;-2.5355;15;-2.3286;15;-2.7724;15;-2.4865;15;-1.8924;15
-1.1609;16;-0.74198;16;-0.86092;16;-0.85549;16;-3.4565;16;-4.3628;16;-2.0317;16;-2.2273;16;-0.01788;16;-1.0052;16;-0.42842;16;0.1522;16;-2.7096;16;-2.9078;16;-2.5468;16;-2.3879;16;-2.1403;16;-2.5197;16
-0.62461;17;-0.06589;17;-0.25923;17;0.35377;17;-0.59589;17;-0.8121;17;-0.47967;17;-0.032391;17;-0.26984;17;0.075157;17;-0.30991;17;0.084609;17;-0.62095;17;-0.44781;17;-1.5312;17;-1.3406;17;-0.59577;17;-0.11334;17
-0.53994;18;-0.30692;18;-0.48994;18;-0.16674;18;-0.763;18;-0.19618;18;-1.2422;18;-1.0816;18;0.10565;18;-0.23517;18;-0.096504;18;0.031888;18;-0.86471;18;0.11664;18;-0.53552;18;-0.27695;18;-1.2814;18;-0.19037;18
0.39318;19;0.14654;19;0.56951;19;0.55373;19;0.84548;19;0.69742;19;0.63025;19;0.56834;19;0.76373;19;0.05902;19;0.004428;19;0.16171;19;1.0225;19;0.83072;19;-0.050115;19;0.074213;19;0.20026;19;0.84843;19
-0.52921;20;0.022351;20;0.14813;20;0.48689;20;-0.41219;20;0.31375;20;-0.14776;20;0.17934;20;0.39782;20;0.61529;20;-0.6942;20;-0.76185;20;-0.75368;20;-0.90585;20;-0.9557;20;-0.5684;20;-0.95584;20;-0.38453;20
-0.79702;21;-1.2792;21;0.67839;21;0.66505;21;-0.10921;21;-1.3141;21;0.067157;21;-0.73906;21;-0.0062095;21;-0.88859;21;-5.7348;21;-5.0348;21;0.4703;21;0.27959;21;-0.049495;21;-0.19794;21;-1.1459;21;0.093475;21
-1.0179;22;-1.0458;22;-1.1463;22;-1.2692;22;-1.5977;22;-2.4467;22;-3.0016;22;-3.1523;22;-1.5326;22;-1.7275;22;-1.7472;22;-1.2545;22;-1.7576;22;-1.7447;22;-1.7826;22;-2.1528;22;-2.8497;22;-2.8641;22
-1.2299;23;-1.0195;23;-1.3905;23;-1.5102;23;-2.4507;23;-2.273;23;-2.3935;23;-2.3988;23;-1.4064;23;-1.2532;23;-2.2801;23;-1.941;23;-2.4289;23;-1.7613;23;-1.8136;23;-1.8022;23;-2.6667;23;-2.2058;23
-0.61567;24;0.028973;24;0.045315;24;0.66616;24;-0.13994;24;0.56354;24;-1.3248;24;-0.82409;24;0.37104;24;-0.95828;24;0.54905;24;0.84999;24;0.23615;24;0.84804;24;-0.42023;24;-0.19306;24;-0.16626;24;0.44525;24
-0.65298;25;-0.47712;25;-0.78557;25;-0.82503;25;-0.94332;25;-1.3942;25;-1.187;25;-1.4985;25;-0.15077;25;-1.0711;25;-0.73759;25;-0.35591;25;-1.1563;25;-1.2932;25;-1.2995;25;-1.2701;25;-1.2695;25;-1.4889;25
-0.3255;26;0.080614;26;-0.025834;26;0.27822;26;-0.65735;26;0.13751;26;-2.1266;26;-0.39624;26;-1.5455;26;0.16657;26;-1.0375;26;-1.6729;26;0.42569;26;0.53585;26;0.62241;26;0.26695;26;-0.65389;26;-0.1657;26
-0.83702;27;-1.0497;27;-0.97275;27;-0.92652;27;-1.4191;27;-1.4349;27;-1.43;27;-1.4927;27;-0.86916;27;-1.1058;27;-1.1126;27;-1.3091;27;-1.2817;27;-1.7652;27;-2.656;27;-3.0543;27;-1.4142;27;-1.4675;27
-0.8877;28;-0.52121;28;-0.96177;28;-0.65726;28;-1.4932;28;-2.1825;28;-2.6922;28;-1.9555;28;-1.4513;28;-1.8969;28;-1.4758;28;-1.2195;28;-1.2143;28;-1.4643;28;-2.1699;28;-2.1421;28;-1.4023;28;-1.434;28
