<?xml version="1.0" encoding="utf-8"?>
<!-- Generator: Adobe Illustrator 18.1.1, SVG Export Plug-In . SVG Version: 6.00 Build 0)  -->
<svg version="1.1" id="Layer_1" xmlns="http://www.w3.org/2000/svg" xmlns:xlink="http://www.w3.org/1999/xlink" x="0px" y="0px"
	 viewBox="0 0 50 50" enable-background="new 0 0 50 50" xml:space="preserve">
<path id="bg" fill="#173a60" d="M50,41.7c0,4.6-3.8,8.3-8.3,8.3H8.3C3.7,50,0,46.3,0,41.7V8.3C0,3.7,3.7,0,8.3,0h33.3
	C46.3,0,50,3.7,50,8.3V41.7z"/>
<path fill="#FFFFFF" d="M13.8,11.1h14.5c7.6,0,9,5.6,9,8.1c0,3.2-1.6,5.9-4.4,6.8c2.4,1,3.6,1.9,3.6,7.3c0,4.2,0,5.2,1.3,5.7v0.8
	h-6.6c-0.4-1.4-0.6-2.8-0.6-5.8c0-3.9-0.2-5.4-4.7-5.4h-6.2v11.2h-5.9V11.1z M26.7,23.7c3.1,0,4.6-1.1,4.6-3.9
	c0-1.5-0.7-3.8-4.2-3.8h-7.5v7.7H26.7z"/>
</svg>
