com/code/employeedbmanager/models/Leaves.class
com/code/employeedbmanager/models/Address.class
com/code/employeedbmanager/models/Salary.class
com/code/employeedbmanager/models/Employee.class
com/code/employeedbmanager/service/EmployeeService.class
com/code/employeedbmanager/controller/ExceptionAdvice.class
com/code/employeedbmanager/repo/EmployeeRepository.class
com/code/employeedbmanager/dto/GroupByDistrictResponse.class
com/code/employeedbmanager/controller/EmployeeController.class
com/code/employeedbmanager/EmployeeDbManagerApplication.class
com/code/employeedbmanager/models/ApiError.class
com/code/employeedbmanager/exception/EmployeeNotFoundException.class
