/home/qbuser/Donny/project/local/employee-db-manager/src/main/java/com/code/employeedbmanager/service/EmployeeService.java
/home/qbuser/Donny/project/local/employee-db-manager/src/main/java/com/code/employeedbmanager/exception/EmployeeNotFoundException.java
/home/qbuser/Donny/project/local/employee-db-manager/src/main/java/com/code/employeedbmanager/models/Employee.java
/home/qbuser/Donny/project/local/employee-db-manager/src/main/java/com/code/employeedbmanager/dto/GroupByDistrictResponse.java
/home/qbuser/Donny/project/local/employee-db-manager/src/main/java/com/code/employeedbmanager/EmployeeDbManagerApplication.java
/home/qbuser/Donny/project/local/employee-db-manager/src/main/java/com/code/employeedbmanager/repo/EmployeeRepository.java
/home/qbuser/Donny/project/local/employee-db-manager/src/main/java/com/code/employeedbmanager/controller/EmployeeController.java
/home/qbuser/Donny/project/local/employee-db-manager/src/main/java/com/code/employeedbmanager/models/Leaves.java
/home/qbuser/Donny/project/local/employee-db-manager/src/main/java/com/code/employeedbmanager/models/Address.java
/home/qbuser/Donny/project/local/employee-db-manager/src/main/java/com/code/employeedbmanager/models/Salary.java
/home/qbuser/Donny/project/local/employee-db-manager/src/main/java/com/code/employeedbmanager/controller/ExceptionAdvice.java
/home/qbuser/Donny/project/local/employee-db-manager/src/main/java/com/code/employeedbmanager/models/ApiError.java
