%YAML 1.1
%TAG !u! tag:unity3d.com,2011:
--- !u!1001 &4815670997465212658
PrefabInstance:
  m_ObjectHideFlags: 0
  serializedVersion: 2
  m_Modification:
    m_TransformParent: {fileID: 0}
    m_Modifications:
    - target: {fileID: 5809684845285789887, guid: d66f5436a7d731e49b1694f006dda5f1, type: 3}
      propertyPath: m_Name
      value: Tower 1
      objectReference: {fileID: 0}
    - target: {fileID: 7259974247197633808, guid: d66f5436a7d731e49b1694f006dda5f1, type: 3}
      propertyPath: m_RootOrder
      value: 0
      objectReference: {fileID: 0}
    - target: {fileID: 7259974247197633808, guid: d66f5436a7d731e49b1694f006dda5f1, type: 3}
      propertyPath: m_LocalPosition.x
      value: 0
      objectReference: {fileID: 0}
    - target: {fileID: 7259974247197633808, guid: d66f5436a7d731e49b1694f006dda5f1, type: 3}
      propertyPath: m_LocalPosition.y
      value: 0
      objectReference: {fileID: 0}
    - target: {fileID: 7259974247197633808, guid: d66f5436a7d731e49b1694f006dda5f1, type: 3}
      propertyPath: m_LocalPosition.z
      value: 0
      objectReference: {fileID: 0}
    - target: {fileID: 7259974247197633808, guid: d66f5436a7d731e49b1694f006dda5f1, type: 3}
      propertyPath: m_LocalRotation.w
      value: 1
      objectReference: {fileID: 0}
    - target: {fileID: 7259974247197633808, guid: d66f5436a7d731e49b1694f006dda5f1, type: 3}
      propertyPath: m_LocalRotation.x
      value: 0
      objectReference: {fileID: 0}
    - target: {fileID: 7259974247197633808, guid: d66f5436a7d731e49b1694f006dda5f1, type: 3}
      propertyPath: m_LocalRotation.y
      value: 0
      objectReference: {fileID: 0}
    - target: {fileID: 7259974247197633808, guid: d66f5436a7d731e49b1694f006dda5f1, type: 3}
      propertyPath: m_LocalRotation.z
      value: 0
      objectReference: {fileID: 0}
    - target: {fileID: 7259974247197633808, guid: d66f5436a7d731e49b1694f006dda5f1, type: 3}
      propertyPath: m_LocalEulerAnglesHint.x
      value: 0
      objectReference: {fileID: 0}
    - target: {fileID: 7259974247197633808, guid: d66f5436a7d731e49b1694f006dda5f1, type: 3}
      propertyPath: m_LocalEulerAnglesHint.y
      value: 0
      objectReference: {fileID: 0}
    - target: {fileID: 7259974247197633808, guid: d66f5436a7d731e49b1694f006dda5f1, type: 3}
      propertyPath: m_LocalEulerAnglesHint.z
      value: 0
      objectReference: {fileID: 0}
    - target: {fileID: 8156652218173195937, guid: d66f5436a7d731e49b1694f006dda5f1, type: 3}
      propertyPath: _shootDelay
      value: 3
      objectReference: {fileID: 0}
    - target: {fileID: 8156652218173195937, guid: d66f5436a7d731e49b1694f006dda5f1, type: 3}
      propertyPath: _shootPower
      value: 2
      objectReference: {fileID: 0}
    - target: {fileID: 8156652218173195937, guid: d66f5436a7d731e49b1694f006dda5f1, type: 3}
      propertyPath: _bulletPrefab
      value: 
      objectReference: {fileID: 4986766827978039354, guid: 39e29c622aa82cf4b83c52c3728ec210, type: 3}
    m_RemovedComponents: []
  m_SourcePrefab: {fileID: 100100000, guid: d66f5436a7d731e49b1694f006dda5f1, type: 3}
