   ____ _ _      ____       _     _____          
  / ___(_) |_   / ___| ___ | |_  |_   _|__   ___ 
 | |  _| | __| | |  _ / _ \| __|   | |/ _ \ / _ \
 | |_| | | |_  | |_| | (_) | |_    | | (_) |  __/
  \____|_|\__|  \____|\___/ \__|   |_|\___/ \___|



              A   B   C
              
          1     |   |   
             ---+---+---
          2     |   |   
             ---+---+---
          3     |   |   


