...
----------------------------------------------------------------------
Ran 3 tests in 0.001s

OK
Name             Stmts   Miss Branch BrPart  Cover   Missing
------------------------------------------------------------
Netflix.py          66      8     20      3    83%   26-29, 115, 117-120, 22->26, 114->115, 116->117
TestNetflix.py      23      0      0      0   100%
------------------------------------------------------------
TOTAL               89      8     20      3    86%

