...................
----------------------------------------------------------------------
Ran 19 tests in 4.175s

OK
Name             Stmts   Miss Branch BrPart  Cover   Missing
------------------------------------------------------------
Collatz.py          33      1     14      1    96%   60, 58->60
TestCollatz.py      88      4      0      0    95%   84-88
------------------------------------------------------------
TOTAL              121      5     14      1    96%
