1 10 20
100 200 125
201 210 89
900 1000 174
1 1 1
9000 20000 279
8 4 17
888 9999 262
1 500000 449
6767 89899 351
777 7777 262
99999 100000 227
12345 98765 351
1 100 119
8000 9000 247
9000 10000 260
4000 5000 215
3000 4000 238
2000 3000 217
1000 2000 182
100000 200000 383
9 8 20
8 9 20
444 555 142
999999 999999 259
878787 989898 507
2 20 21
3 30 112
40 400 144
50 500 144
600 6000 238
700 7000 262
508 528 124
789 987 179
900 901 55
2000 2030 157
30 40 107
50 60 113
60 70 108
80 90 111
90 100 119
20 30 112
67 70 28
70 67 28
888 999 174
454 545 142
80000 90000 333
99 99 26
13 31 112
141 414 144
700 890 179
555 666 145
666 777 171
777 888 179
101010 202020 383
4500 6000 236
6000 7500 262
7500 9000 252
45 54 113
56 65 108
67 76 116
78 87 111
89 98 119
90 9 116
888888 999999 507
40000 45000 288
80 80 10
90 900 179
101 1001 179
1001 10001 262
21 42 112
13 26 24
1 2 2
2 4 8
4 8 17
8 16 20
16 32 112
32 64 113
64 128 119
128 256 128
512 1024 179
1024 2048 182
2048 4096 238
4096 8196 262
8196 4096 262
4112 2048 238
2048 1024 182
1024 512 179
512 256 144
256 128 128
128 64 119
64 32 113
32 16 112
16 8 20
8 4 17
4 2 8
2 1 2
80000 100000 333
10 10 7
78 89 111
66 77 116
77 88 111
44 55 113
45050 54040 340
7777 8888 252
1111 2222 182
2222 3333 217
99 99 26
