FFFFF...FFF.F
======================================================================
FAIL: test_eval_1 (__main__.TestCollatz)
----------------------------------------------------------------------
Traceback (most recent call last):
  File "TestCollatz.py", line 67, in test_eval_1
    self.assertEqual(v, 20)
AssertionError: 1 != 20

======================================================================
FAIL: test_eval_2 (__main__.TestCollatz)
----------------------------------------------------------------------
Traceback (most recent call last):
  File "TestCollatz.py", line 71, in test_eval_2
    self.assertEqual(v, 125)
AssertionError: 1 != 125

======================================================================
FAIL: test_eval_3 (__main__.TestCollatz)
----------------------------------------------------------------------
Traceback (most recent call last):
  File "TestCollatz.py", line 75, in test_eval_3
    self.assertEqual(v, 89)
AssertionError: 1 != 89

======================================================================
FAIL: test_eval_4 (__main__.TestCollatz)
----------------------------------------------------------------------
Traceback (most recent call last):
  File "TestCollatz.py", line 79, in test_eval_4
    self.assertEqual(v, 174)
AssertionError: 1 != 174

======================================================================
FAIL: test_eval_5 (__main__.TestCollatz)
----------------------------------------------------------------------
Traceback (most recent call last):
  File "TestCollatz.py", line 83, in test_eval_5
    self.assertEqual(v,2)
AssertionError: 1 != 2

======================================================================
FAIL: test_read_1 (__main__.TestCollatz)
----------------------------------------------------------------------
Traceback (most recent call last):
  File "TestCollatz.py", line 39, in test_read_1
    self.assertEqual(i, 1)
AssertionError: 10 != 1

======================================================================
FAIL: test_read_2 (__main__.TestCollatz)
----------------------------------------------------------------------
Traceback (most recent call last):
  File "TestCollatz.py", line 45, in test_read_2
    self.assertEqual(i,5)
AssertionError: 8 != 5

======================================================================
FAIL: test_read_3 (__main__.TestCollatz)
----------------------------------------------------------------------
Traceback (most recent call last):
  File "TestCollatz.py", line 52, in test_read_3
    self.assertEqual(i,35)
AssertionError: 12 != 35

======================================================================
FAIL: test_solve (__main__.TestCollatz)
----------------------------------------------------------------------
Traceback (most recent call last):
  File "TestCollatz.py", line 125, in test_solve
    w.getvalue(), "10 1 20\n200 100 125\n210 201 89\n1000 900 174\n")
AssertionError: '10 1 1\n200 100 1\n210 201 1\n1000 900 1\n' != '10 1 20\n200 100 125\n210 201 89\n1000 900 174\n'
- 10 1 1
?      ^
+ 10 1 20
?      ^^
- 200 100 1
+ 200 100 125
?          ++
- 210 201 1
?         ^
+ 210 201 89
?         ^^
- 1000 900 1
+ 1000 900 174
?           ++


----------------------------------------------------------------------
Ran 13 tests in 0.002s

FAILED (failures=9)
