%YAML 1.1
%TAG !u! tag:unity3d.com,2011:
--- !u!1 &120296
GameObject:
  m_ObjectHideFlags: 0
  m_CorrespondingSourceObject: {fileID: 0}
  m_PrefabInstance: {fileID: 0}
  m_PrefabAsset: {fileID: 0}
  serializedVersion: 6
  m_Component:
  - component: {fileID: 459968}
  - component: {fileID: 2056488}
  - component: {fileID: 12455804}
  - component: {fileID: 8165074}
  - component: {fileID: 11488424}
  - component: {fileID: 11455738}
  - component: {fileID: 37155099}
  - component: {fileID: 37155100}
  - component: {fileID: 37155097}
  m_Layer: 0
  m_Name: RTS_Camera
  m_TagString: MainCamera
  m_Icon: {fileID: 0}
  m_NavMeshLayer: 0
  m_StaticEditorFlags: 0
  m_IsActive: 1
--- !u!4 &459968
Transform:
  m_ObjectHideFlags: 0
  m_CorrespondingSourceObject: {fileID: 0}
  m_PrefabInstance: {fileID: 0}
  m_PrefabAsset: {fileID: 0}
  m_GameObject: {fileID: 120296}
  m_LocalRotation: {x: 0.7071068, y: 0, z: 0, w: 0.70710677}
  m_LocalPosition: {x: 0, y: 6.75, z: 0}
  m_LocalScale: {x: 1, y: 1, z: 1}
  m_Children: []
  m_Father: {fileID: 0}
  m_RootOrder: 0
  m_LocalEulerAnglesHint: {x: 90.00001, y: 0, z: 0}
--- !u!20 &2056488
Camera:
  m_ObjectHideFlags: 0
  m_CorrespondingSourceObject: {fileID: 0}
  m_PrefabInstance: {fileID: 0}
  m_PrefabAsset: {fileID: 0}
  m_GameObject: {fileID: 120296}
  m_Enabled: 1
  serializedVersion: 2
  m_ClearFlags: 2
  m_BackGroundColor: {r: 0, g: 0, b: 0, a: 0.019607844}
  m_projectionMatrixMode: 1
  m_GateFitMode: 2
  m_FOVAxisMode: 0
  m_SensorSize: {x: 36, y: 24}
  m_LensShift: {x: 0, y: 0}
  m_FocalLength: 50
  m_NormalizedViewPortRect:
    serializedVersion: 2
    x: 0
    y: 0
    width: 1
    height: 1
  near clip plane: 0.3
  far clip plane: 1000
  field of view: 60
  orthographic: 0
  orthographic size: 20
  m_Depth: -1
  m_CullingMask:
    serializedVersion: 2
    m_Bits: 1815
  m_RenderingPath: -1
  m_TargetTexture: {fileID: 0}
  m_TargetDisplay: 0
  m_TargetEye: 3
  m_HDR: 0
  m_AllowMSAA: 1
  m_AllowDynamicResolution: 0
  m_ForceIntoRT: 0
  m_OcclusionCulling: 1
  m_StereoConvergence: 10
  m_StereoSeparation: 0.022
--- !u!124 &12455804
Behaviour:
  m_ObjectHideFlags: 0
  m_CorrespondingSourceObject: {fileID: 0}
  m_PrefabInstance: {fileID: 0}
  m_PrefabAsset: {fileID: 0}
  m_GameObject: {fileID: 120296}
  m_Enabled: 1
--- !u!81 &8165074
AudioListener:
  m_ObjectHideFlags: 0
  m_CorrespondingSourceObject: {fileID: 0}
  m_PrefabInstance: {fileID: 0}
  m_PrefabAsset: {fileID: 0}
  m_GameObject: {fileID: 120296}
  m_Enabled: 1
--- !u!114 &11488424
MonoBehaviour:
  m_ObjectHideFlags: 0
  m_CorrespondingSourceObject: {fileID: 0}
  m_PrefabInstance: {fileID: 0}
  m_PrefabAsset: {fileID: 0}
  m_GameObject: {fileID: 120296}
  m_Enabled: 0
  m_EditorHideFlags: 0
  m_Script: {fileID: 11500000, guid: e4a7bdbb9f7e4394fab86c6d55659f28, type: 3}
  m_Name: 
  m_EditorClassIdentifier: 
  targetsTag: Player
  targetSlot: {fileID: 0}
--- !u!114 &11455738
MonoBehaviour:
  m_ObjectHideFlags: 0
  m_CorrespondingSourceObject: {fileID: 0}
  m_PrefabInstance: {fileID: 0}
  m_PrefabAsset: {fileID: 0}
  m_GameObject: {fileID: 120296}
  m_Enabled: 1
  m_EditorHideFlags: 0
  m_Script: {fileID: 11500000, guid: 28ef8c68bade09b41aca258d42a632f2, type: 3}
  m_Name: 
  m_EditorClassIdentifier: 
  lastTab: 2
  movementSettingsFoldout: 1
  zoomingSettingsFoldout: 0
  rotationSettingsFoldout: 1
  heightSettingsFoldout: 1
  mapLimitSettingsFoldout: 1
  targetingSettingsFoldout: 1
  inputSettingsFoldout: 1
  useFixedUpdate: 0
  keyboardMovementSpeed: 50
  screenEdgeMovementSpeed: 50
  followingSpeed: 5
  rotationSped: 50
  panningSpeed: 100
  mouseRotationSpeed: 100
  autoHeight: 1
  groundMask:
    serializedVersion: 2
    m_Bits: 55
  maxHeight: 10
  minHeight: 25
  heightDampening: 5
  keyboardZoomingSensitivity: 2
  scrollWheelZoomingSensitivity: 25
  limitMap: 1
  limitX: {x: 80, y: 80}
  limitY: {x: 100, y: 60}
  targetFollow: {fileID: 0}
  targetOffset: {x: 5, y: 0, z: -15}
  useScreenEdgeInput: 1
  screenEdgeBorder: 25
  useKeyboardInput: 1
  horizontalAxis: Horizontal
  verticalAxis: Vertical
  usePanning: 0
  panningKey: 325
  useKeyboardZooming: 1
  zoomInKey: 269
  zoomOutKey: 270
  useScrollwheelZooming: 1
  zoomingAxis: Mouse ScrollWheel
  useKeyboardRotation: 1
  rotateRightKey: 127
  rotateLeftKey: 277
  useMouseRotation: 0
  mouseRotationKey: 324
--- !u!114 &37155099
MonoBehaviour:
  m_ObjectHideFlags: 0
  m_CorrespondingSourceObject: {fileID: 0}
  m_PrefabInstance: {fileID: 0}
  m_PrefabAsset: {fileID: 0}
  m_GameObject: {fileID: 120296}
  m_Enabled: 0
  m_EditorHideFlags: 0
  m_Script: {fileID: 11500000, guid: 0eaeef38c4df35147a66eb88e846db43, type: 3}
  m_Name: 
  m_EditorClassIdentifier: 
  squareImage: {fileID: 0}
--- !u!114 &37155100
MonoBehaviour:
  m_ObjectHideFlags: 0
  m_CorrespondingSourceObject: {fileID: 0}
  m_PrefabInstance: {fileID: 0}
  m_PrefabAsset: {fileID: 0}
  m_GameObject: {fileID: 120296}
  m_Enabled: 1
  m_EditorHideFlags: 0
  m_Script: {fileID: 11500000, guid: 9d4c7c0c69f2b474c9360b99ae9d786e, type: 3}
  m_Name: 
  m_EditorClassIdentifier: 
  player: {fileID: 0}
  uIController: {fileID: 0}
  clickablesLayer:
    serializedVersion: 2
    m_Bits: 512
  selectableObjects: []
  playerProjector: {fileID: 2100000, guid: 213407f5ae5868945be42896d60f32b0, type: 2}
  enemyProjector: {fileID: 2100000, guid: 319df0b06bafc8e4986e68bb57079603, type: 2}
  neutralProjector: {fileID: 2100000, guid: 49f46adccb2f69442929c0f8ca9aa604, type: 2}
--- !u!114 &37155097
MonoBehaviour:
  m_ObjectHideFlags: 0
  m_CorrespondingSourceObject: {fileID: 0}
  m_PrefabInstance: {fileID: 0}
  m_PrefabAsset: {fileID: 0}
  m_GameObject: {fileID: 120296}
  m_Enabled: 1
  m_EditorHideFlags: 0
  m_Script: {fileID: 11500000, guid: 54276d96385f4fe4ea1610746e016cf1, type: 3}
  m_Name: 
  m_EditorClassIdentifier: 
  angle: 60
