%YAML 1.1
%TAG !u! tag:unity3d.com,2011:
--- !u!114 &11400000
MonoBehaviour:
  m_ObjectHideFlags: 0
  m_CorrespondingSourceObject: {fileID: 0}
  m_PrefabInstance: {fileID: 0}
  m_PrefabAsset: {fileID: 0}
  m_GameObject: {fileID: 0}
  m_Enabled: 1
  m_EditorHideFlags: 0
  m_Script: {fileID: 11500000, guid: ca3fe23869b974240acce63a0114ba42, type: 3}
  m_Name: Ranged Lvl1
  m_EditorClassIdentifier: 
  action: {fileID: 7629571233880289873, guid: 516ccecaac712c94b9bde7f7fb9cac6d, type: 3}
  upgradeTime: 60
  level: 0
  upgradeCost:
  - type: 0
    amount: 100
  - type: 1
    amount: 50
  requirements: 
