%YAML 1.1
%TAG !u! tag:unity3d.com,2011:
--- !u!114 &11400000
MonoBehaviour:
  m_ObjectHideFlags: 0
  m_CorrespondingSourceObject: {fileID: 0}
  m_PrefabInstance: {fileID: 0}
  m_PrefabAsset: {fileID: 0}
  m_GameObject: {fileID: 0}
  m_Enabled: 1
  m_EditorHideFlags: 0
  m_Script: {fileID: 11500000, guid: 09cb5733b2daac04bb703d30be9b286e, type: 3}
  m_Name: HealBonus
  m_EditorClassIdentifier: 
  bonusName: Heal
  bonusEffect: 0
  isPercentageEffect: 0
  effectValuePercentage: 0
  effectValueNumber: 25
  duration: 1
  bonusImage: {fileID: 21300000, guid: 960db7ff93607b041a7962fe746523ca, type: 3}
  bonusFx: {fileID: 0}
