%YAML 1.1
%TAG !u! tag:unity3d.com,2011:
--- !u!114 &11400000
MonoBehaviour:
  m_ObjectHideFlags: 0
  m_CorrespondingSourceObject: {fileID: 0}
  m_PrefabInstance: {fileID: 0}
  m_PrefabAsset: {fileID: 0}
  m_GameObject: {fileID: 0}
  m_Enabled: 1
  m_EditorHideFlags: 0
  m_Script: {fileID: 11500000, guid: e6f156aa22f61604484d87acb91569a6, type: 3}
  m_Name: Knight stat
  m_EditorClassIdentifier: 
  buildTime: 45
  costs:
  - type: 0
    amount: 245
  - type: 1
    amount: 60
  - type: 2
    amount: 4
  invulnerable: 0
  unitType: 0
  attackType: 0
  upgradeType: 0
  currentLvl: 0
  lvlStats:
  - maxHitPoint: 835
    minAttack: 33
    maxAttack: 35
    defense: 5
    detectionRange: 20
    weaponRange: 1.5
    weaponRechargeTime: 1.5
    speed: 7.5
    exp: 20
    healthRegeneration: 1
    healthRegenerationValue: 0.25
    healthRegenerationRate: 1
    healthRegenerationDelay: 5
    useMana: 0
    maxManaPoint: 0
    manaRegeneration: 0
    manaRegenerationValue: 0
    manaRegenerationRate: 0
    manaRegenerationDelay: 0
  - maxHitPoint: 880
    minAttack: 35
    maxAttack: 37
    defense: 6.5
    detectionRange: 20
    weaponRange: 1.5
    weaponRechargeTime: 1.5
    speed: 7.5
    exp: 20
    healthRegeneration: 1
    healthRegenerationValue: 0.25
    healthRegenerationRate: 1
    healthRegenerationDelay: 5
    useMana: 0
    maxManaPoint: 0
    manaRegeneration: 0
    manaRegenerationValue: 0
    manaRegenerationRate: 0
    manaRegenerationDelay: 0
  - maxHitPoint: 930
    minAttack: 38
    maxAttack: 40
    defense: 8
    detectionRange: 20
    weaponRange: 1.5
    weaponRechargeTime: 1.5
    speed: 7.5
    exp: 30
    healthRegeneration: 1
    healthRegenerationValue: 0.25
    healthRegenerationRate: 1
    healthRegenerationDelay: 5
    useMana: 0
    maxManaPoint: 0
    manaRegeneration: 0
    manaRegenerationValue: 0
    manaRegenerationRate: 0
    manaRegenerationDelay: 0
  - maxHitPoint: 985
    minAttack: 42
    maxAttack: 44
    defense: 11
    detectionRange: 20
    weaponRange: 1.5
    weaponRechargeTime: 1.4
    speed: 7.5
    exp: 30
    healthRegeneration: 1
    healthRegenerationValue: 0.25
    healthRegenerationRate: 1
    healthRegenerationDelay: 5
    useMana: 0
    maxManaPoint: 0
    manaRegeneration: 0
    manaRegenerationValue: 0
    manaRegenerationRate: 0
    manaRegenerationDelay: 0
