%YAML 1.1
%TAG !u! tag:unity3d.com,2011:
--- !u!114 &11400000
MonoBehaviour:
  m_ObjectHideFlags: 0
  m_CorrespondingSourceObject: {fileID: 0}
  m_PrefabInstance: {fileID: 0}
  m_PrefabAsset: {fileID: 0}
  m_GameObject: {fileID: 0}
  m_Enabled: 1
  m_EditorHideFlags: 0
  m_Script: {fileID: 11500000, guid: 61776f47f6ffedb4a92c2db6083375da, type: 3}
  m_Name: Player AM
  m_EditorClassIdentifier: 
  sounds:
  - soundCategorie: 14
    clip:
    - {fileID: 8300000, guid: aa27d78880fe1423facdecc1e4579c25, type: 3}
    volume: 0.75
    pitch: 1
    loop: 0
  - soundCategorie: 15
    clip:
    - {fileID: 8300000, guid: a20dbe986e8d242e49950bada7a3867b, type: 3}
    volume: 0.75
    pitch: 1
    loop: 0
  - soundCategorie: 16
    clip:
    - {fileID: 8300000, guid: 79e5f02a452e2418ea25941b2dfee2e1, type: 3}
    volume: 0.75
    pitch: 1
    loop: 0
  - soundCategorie: 5
    clip:
    - {fileID: 8300000, guid: d04c0d230aea74a4285be9872bdd5191, type: 3}
    - {fileID: 8300000, guid: a5a5e5238ad4c46eeb4ff664c7c90989, type: 3}
    - {fileID: 8300000, guid: 16e031dc6cddb4acb8f25b9a297a67d5, type: 3}
    volume: 0.75
    pitch: 1
    loop: 0
  - soundCategorie: 7
    clip:
    - {fileID: 8300000, guid: e35a2f3d22fc4463eafecb70e9cb76af, type: 3}
    volume: 0.75
    pitch: 1
    loop: 0
