%YAML 1.1
%TAG !u! tag:unity3d.com,2011:
--- !u!114 &11400000
MonoBehaviour:
  m_ObjectHideFlags: 0
  m_CorrespondingSourceObject: {fileID: 0}
  m_PrefabInstance: {fileID: 0}
  m_PrefabAsset: {fileID: 0}
  m_GameObject: {fileID: 0}
  m_Enabled: 1
  m_EditorHideFlags: 0
  m_Script: {fileID: 11500000, guid: 45b863ff4c87d9d4b8118a2c96db2bfc, type: 3}
  m_Name: Build Keep
  m_EditorClassIdentifier: 
  actionName: Keep
  actionNameData: 11
  image: {fileID: 21300000, guid: 6b3a9c9d40682494895b29f4a26c8a06, type: 3}
  type: 1
  description: Main building of your settlement. Train workers here, and even a hero,
    your armies general.
  requirements: 
  shortcut: 117
