%YAML 1.1
%TAG !u! tag:unity3d.com,2011:
--- !u!114 &11400000
MonoBehaviour:
  m_ObjectHideFlags: 0
  m_CorrespondingSourceObject: {fileID: 0}
  m_PrefabInstance: {fileID: 0}
  m_PrefabAsset: {fileID: 0}
  m_GameObject: {fileID: 0}
  m_Enabled: 1
  m_EditorHideFlags: 0
  m_Script: {fileID: 11500000, guid: ca3fe23869b974240acce63a0114ba42, type: 3}
  m_Name: Melee Lvl2
  m_EditorClassIdentifier: 
  action: {fileID: 791324128989789854, guid: 60cd2ffde9aa4ad428e00af26a43588c, type: 3}
  upgradeTime: 75
  level: 1
  upgradeCost:
  - type: 0
    amount: 175
  - type: 1
    amount: 175
  requirements: 0b000000
