%YAML 1.1
%TAG !u! tag:unity3d.com,2011:
--- !u!114 &11400000
MonoBehaviour:
  m_ObjectHideFlags: 0
  m_CorrespondingSourceObject: {fileID: 0}
  m_PrefabInstance: {fileID: 0}
  m_PrefabAsset: {fileID: 0}
  m_GameObject: {fileID: 0}
  m_Enabled: 1
  m_EditorHideFlags: 0
  m_Script: {fileID: 11500000, guid: 61776f47f6ffedb4a92c2db6083375da, type: 3}
  m_Name: Knight AM
  m_EditorClassIdentifier: 
  sounds:
  - soundCategorie: 0
    clip:
    - {fileID: 8300000, guid: b5bbb11243be74bc89a369741ffa9ef5, type: 3}
    - {fileID: 8300000, guid: 763d41b309aa3439c8e3849e089e2689, type: 3}
    - {fileID: 8300000, guid: d8360fef9aef14d0c82cb080f97d90fb, type: 3}
    - {fileID: 8300000, guid: 382c0be1a39d74b86b31a7e804102913, type: 3}
    volume: 0.75
    pitch: 1
    loop: 0
  - soundCategorie: 1
    clip:
    - {fileID: 8300000, guid: 67579a3eefe0b4e9fa3bb9a655fad4c3, type: 3}
    - {fileID: 8300000, guid: 175a47f0c212b4c769b10ad8db5cd4e6, type: 3}
    - {fileID: 8300000, guid: fb51aef487fa8404daccdbb2931289fb, type: 3}
    - {fileID: 8300000, guid: 9a8bdba22b8704d4fba2896c1354c26d, type: 3}
    volume: 0.75
    pitch: 1
    loop: 0
  - soundCategorie: 4
    clip:
    - {fileID: 8300000, guid: ecf9cf4f3e9564b1caf011beaa67d74e, type: 3}
    - {fileID: 8300000, guid: 076646191e25b44208097356c482ac11, type: 3}
    - {fileID: 8300000, guid: dd7b17f36dfd34a17aece65ae3f81c35, type: 3}
    volume: 0.75
    pitch: 1
    loop: 0
  - soundCategorie: 5
    clip:
    - {fileID: 8300000, guid: 895339a19ea8d4a958f283e9980f499f, type: 3}
    - {fileID: 8300000, guid: 49c8d02d0347447cf970fe2a780a7ac0, type: 3}
    volume: 0.75
    pitch: 1
    loop: 0
  - soundCategorie: 8
    clip:
    - {fileID: 8300000, guid: bcb3dacb89da740d8b2a27903ce26353, type: 3}
    - {fileID: 8300000, guid: f54eef5151a77451298f22c6835c0d83, type: 3}
    volume: 0.75
    pitch: 1
    loop: 0
