%YAML 1.1
%TAG !u! tag:unity3d.com,2011:
--- !u!114 &11400000
MonoBehaviour:
  m_ObjectHideFlags: 0
  m_CorrespondingSourceObject: {fileID: 0}
  m_PrefabInstance: {fileID: 0}
  m_PrefabAsset: {fileID: 0}
  m_GameObject: {fileID: 0}
  m_Enabled: 1
  m_EditorHideFlags: 0
  m_Script: {fileID: 11500000, guid: ca3fe23869b974240acce63a0114ba42, type: 3}
  m_Name: Ranged Lvl3
  m_EditorClassIdentifier: 
  action: {fileID: 5285957728743438454, guid: 90180e3059d98ce4faa2f233f9a353ea, type: 3}
  upgradeTime: 90
  level: 2
  upgradeCost:
  - type: 0
    amount: 250
  - type: 1
    amount: 300
  requirements: 0c000000
