%YAML 1.1
%TAG !u! tag:unity3d.com,2011:
--- !u!1 &2886980541672835797
GameObject:
  m_ObjectHideFlags: 0
  m_CorrespondingSourceObject: {fileID: 0}
  m_PrefabInstance: {fileID: 0}
  m_PrefabAsset: {fileID: 0}
  serializedVersion: 6
  m_Component:
  - component: {fileID: 2886980541672835795}
  - component: {fileID: 2886980541672835794}
  m_Layer: 9
  m_Name: Stump
  m_TagString: Ground
  m_Icon: {fileID: 0}
  m_NavMeshLayer: 0
  m_StaticEditorFlags: 0
  m_IsActive: 1
--- !u!4 &2886980541672835795
Transform:
  m_ObjectHideFlags: 0
  m_CorrespondingSourceObject: {fileID: 0}
  m_PrefabInstance: {fileID: 0}
  m_PrefabAsset: {fileID: 0}
  m_GameObject: {fileID: 2886980541672835797}
  m_LocalRotation: {x: 0, y: 0, z: 0, w: 1}
  m_LocalPosition: {x: 0, y: 0, z: 0}
  m_LocalScale: {x: 1, y: 1, z: 1}
  m_Children:
  - {fileID: 2890933266649111323}
  m_Father: {fileID: 0}
  m_RootOrder: 0
  m_LocalEulerAnglesHint: {x: 0, y: 0, z: 0}
--- !u!114 &2886980541672835794
MonoBehaviour:
  m_ObjectHideFlags: 0
  m_CorrespondingSourceObject: {fileID: 0}
  m_PrefabInstance: {fileID: 0}
  m_PrefabAsset: {fileID: 0}
  m_GameObject: {fileID: 2886980541672835797}
  m_Enabled: 1
  m_EditorHideFlags: 0
  m_Script: {fileID: 11500000, guid: e3d8421fdd5e39d4b9dcb2916e9f5427, type: 3}
  m_Name: 
  m_EditorClassIdentifier: 
--- !u!1001 &2886980542071402009
PrefabInstance:
  m_ObjectHideFlags: 0
  serializedVersion: 2
  m_Modification:
    m_TransformParent: {fileID: 2886980541672835795}
    m_Modifications:
    - target: {fileID: 1000013046627174, guid: 3cf54fe7110fb624283a9c1e886cab04, type: 3}
      propertyPath: m_Name
      value: Stump
      objectReference: {fileID: 0}
    - target: {fileID: 1000013046627174, guid: 3cf54fe7110fb624283a9c1e886cab04, type: 3}
      propertyPath: m_Layer
      value: 9
      objectReference: {fileID: 0}
    - target: {fileID: 1000013046627174, guid: 3cf54fe7110fb624283a9c1e886cab04, type: 3}
      propertyPath: m_TagString
      value: Ground
      objectReference: {fileID: 0}
    - target: {fileID: 4000010020304130, guid: 3cf54fe7110fb624283a9c1e886cab04, type: 3}
      propertyPath: m_LocalPosition.x
      value: 0
      objectReference: {fileID: 0}
    - target: {fileID: 4000010020304130, guid: 3cf54fe7110fb624283a9c1e886cab04, type: 3}
      propertyPath: m_LocalPosition.y
      value: 0
      objectReference: {fileID: 0}
    - target: {fileID: 4000010020304130, guid: 3cf54fe7110fb624283a9c1e886cab04, type: 3}
      propertyPath: m_LocalPosition.z
      value: 0
      objectReference: {fileID: 0}
    - target: {fileID: 4000010020304130, guid: 3cf54fe7110fb624283a9c1e886cab04, type: 3}
      propertyPath: m_LocalRotation.x
      value: 0.000000021855694
      objectReference: {fileID: 0}
    - target: {fileID: 4000010020304130, guid: 3cf54fe7110fb624283a9c1e886cab04, type: 3}
      propertyPath: m_LocalRotation.y
      value: -1.1102232e-16
      objectReference: {fileID: 0}
    - target: {fileID: 4000010020304130, guid: 3cf54fe7110fb624283a9c1e886cab04, type: 3}
      propertyPath: m_LocalRotation.z
      value: 1.1102232e-16
      objectReference: {fileID: 0}
    - target: {fileID: 4000010020304130, guid: 3cf54fe7110fb624283a9c1e886cab04, type: 3}
      propertyPath: m_LocalRotation.w
      value: 1
      objectReference: {fileID: 0}
    - target: {fileID: 4000010020304130, guid: 3cf54fe7110fb624283a9c1e886cab04, type: 3}
      propertyPath: m_RootOrder
      value: 0
      objectReference: {fileID: 0}
    - target: {fileID: 4000010020304130, guid: 3cf54fe7110fb624283a9c1e886cab04, type: 3}
      propertyPath: m_LocalEulerAnglesHint.x
      value: 0
      objectReference: {fileID: 0}
    - target: {fileID: 4000010020304130, guid: 3cf54fe7110fb624283a9c1e886cab04, type: 3}
      propertyPath: m_LocalEulerAnglesHint.y
      value: 0
      objectReference: {fileID: 0}
    - target: {fileID: 4000010020304130, guid: 3cf54fe7110fb624283a9c1e886cab04, type: 3}
      propertyPath: m_LocalEulerAnglesHint.z
      value: 0
      objectReference: {fileID: 0}
    m_RemovedComponents: []
  m_SourcePrefab: {fileID: 100100000, guid: 3cf54fe7110fb624283a9c1e886cab04, type: 3}
--- !u!4 &2890933266649111323 stripped
Transform:
  m_CorrespondingSourceObject: {fileID: 4000010020304130, guid: 3cf54fe7110fb624283a9c1e886cab04,
    type: 3}
  m_PrefabInstance: {fileID: 2886980542071402009}
  m_PrefabAsset: {fileID: 0}
