%YAML 1.1
%TAG !u! tag:unity3d.com,2011:
--- !u!114 &11400000
MonoBehaviour:
  m_ObjectHideFlags: 0
  m_CorrespondingSourceObject: {fileID: 0}
  m_PrefabInstance: {fileID: 0}
  m_PrefabAsset: {fileID: 0}
  m_GameObject: {fileID: 0}
  m_Enabled: 1
  m_EditorHideFlags: 0
  m_Script: {fileID: 11500000, guid: 61776f47f6ffedb4a92c2db6083375da, type: 3}
  m_Name: MTower AM
  m_EditorClassIdentifier: 
  sounds:
  - soundCategorie: 6
    clip:
    - {fileID: 8300000, guid: efef928b80ef44ac7b454e70b7e14c4d, type: 3}
    volume: 0.75
    pitch: 1
    loop: 0
  - soundCategorie: 19
    clip:
    - {fileID: 8300000, guid: 3f2eef90c95b3458ea43b1fb2b43b5db, type: 3}
    volume: 0.75
    pitch: 1
    loop: 0
  - soundCategorie: 20
    clip:
    - {fileID: 8300000, guid: ffc945f843ae54df8a57676d4a324e53, type: 3}
    volume: 0.75
    pitch: 1
    loop: 0
