{
    "id": "author_random",
    "name": "Random Author Bio",
    "description": "This use case navigates to the QotD home page, then clicks on the link to view a Random quote.  Then follows the link to the biography about the author.",
    "type": "normal",
    "steps": [
        {
            "name": "Navigate to home page",
            "type": "url",
            "service": "web"
        },
        {
            "name": "Pause for about 3 seconds",
            "type": "delay",
            "duration": 3000
        },
        {
            "name": "Navigate to Random quote",
            "type": "url_from_anchor",
            "anchor": "random_link"
        },
        {
            "name": "Pause for about 3 seconds",
            "type": "delay",
            "duration": 3000
        },
        {
            "name": "View Author bio",
            "type": "url_from_anchor",
            "anchor": "author_link"
        },
        {
            "name": "Get author image",
            "type": "image",
            "img": "author_image"
        },
        {
            "name": "Pause for about 5 seconds",
            "type": "delay",
            "duration": 5000
        }

    ]
}