{
  "variables": {
    "hcloud_token": "{{env `HCLOUD_TOKEN`}}"
  },
  "sensitive-variables": [
    "hcloud_token"
  ],
  "provisioners": [
    {
      "type": "shell",
      "inline": [
        "while [ ! -f /var/lib/cloud/instance/boot-finished ];",
        "do echo 'Waiting for Cloud-init to finish...';",
        "sleep 5;",
        "done;",
        "echo Cloud-init finished;"
      ],
      "expect_disconnect": "true"
    },
    {
      "type": "shell",
      "inline": [
        "echo Reboot complete."
      ],
      "timeout": "5m"
    }
  ],
  "builders": [
    {
      "type": "hcloud",
      "token": "{{user `hcloud_token`}}",
      "image": "ubuntu-20.04",
      "location": "nbg1",
      "server_type": "cx11",
      "ssh_username": "root",
      "user_data_file": "cloud_config.yml",
      "snapshot_name": "zire_basetemplate_ubuntu_20_04",
      "snapshot_labels": {
        "name": "zire_basetemplate_ubuntu_20_04"
      }
    }
  ]
}