module gitlab.com/dominiquehassel/tools/photo/cli

go 1.16

require (
	github.com/mitchellh/go-homedir v1.1.0
	github.com/sirupsen/logrus v1.2.0
	github.com/spf13/cobra v1.1.3
	github.com/spf13/viper v1.7.1
)
