ISO-10303-21;
HEADER;
FILE_DESCRIPTION (( 'STEP AP203' ),
    '1' );
FILE_NAME ('Stange Fadenkreuz.STEP',
    '2021-02-03T17:48:17',
    ( '' ),
    ( '' ),
    'SwSTEP 2.0',
    'SolidWorks 2018',
    '' );
FILE_SCHEMA (( 'CONFIG_CONTROL_DESIGN' ));
ENDSEC;

DATA;
#1 = CC_DESIGN_APPROVAL ( #49, ( #67 ) ) ;
#2 = FACE_OUTER_BOUND ( 'NONE', #5, .T. ) ;
#3 = ORIENTED_EDGE ( 'NONE', *, *, #168, .T. ) ;
#4 = DATE_AND_TIME ( #40, #80 ) ;
#5 = EDGE_LOOP ( 'NONE', ( #75, #34, #30, #68 ) ) ;
#6 = CYLINDRICAL_SURFACE ( 'NONE', #140, 4.999999999999964473 ) ;
#7 = ADVANCED_FACE ( 'NONE', ( #31 ), #126, .T. ) ;
#8 = CARTESIAN_POINT ( 'NONE',  ( -4.999999999999969802, -134.0704392372641394, 0.000000000000000000 ) ) ;
#9 = PERSON_AND_ORGANIZATION ( #163, #18 ) ;
#10 =( NAMED_UNIT ( * ) PLANE_ANGLE_UNIT ( ) SI_UNIT ( $, .RADIAN. ) );
#11 = PRODUCT_RELATED_PRODUCT_CATEGORY ( 'detail', '', ( #114 ) ) ;
#12 = DIRECTION ( 'NONE',  ( -2.881521880346712196E-17, 1.000000000000000000, -0.000000000000000000 ) ) ;
#13 = DIRECTION ( 'NONE',  ( -2.881521880346712196E-17, 1.000000000000000000, -0.000000000000000000 ) ) ;
#14 = EDGE_CURVE ( 'NONE', #41, #43, #119, .T. ) ;
#15 = LOCAL_TIME ( 18, 48, 17.00000000000000000, #54 ) ;
#16 = EDGE_CURVE ( 'NONE', #43, #41, #110, .T. ) ;
#17 = PERSON_AND_ORGANIZATION ( #163, #18 ) ;
#18 = ORGANIZATION ( 'UNSPECIFIED', 'UNSPECIFIED', '' ) ;
#19 = CARTESIAN_POINT ( 'NONE',  ( -4.999999999999974243, 205.9295607627360027, 0.000000000000000000 ) ) ;
#20 =( GEOMETRIC_REPRESENTATION_CONTEXT ( 3 ) GLOBAL_UNCERTAINTY_ASSIGNED_CONTEXT ( ( #85 ) ) GLOBAL_UNIT_ASSIGNED_CONTEXT ( ( #81, #10, #173 ) ) REPRESENTATION_CONTEXT ( 'NONE', 'WORKASPACE' ) );
#21 = DIRECTION ( 'NONE',  ( -2.881521880346712196E-17, 1.000000000000000000, -0.000000000000000000 ) ) ;
#22 = PERSON_AND_ORGANIZATION ( #163, #18 ) ;
#23 = EDGE_LOOP ( 'NONE', ( #115, #151, #170, #133 ) ) ;
#24 = EDGE_CURVE ( 'NONE', #41, #142, #149, .T. ) ;
#25 = CIRCLE ( 'NONE', #55, 4.999999999999958256 ) ;
#26 = CC_DESIGN_DATE_AND_TIME_ASSIGNMENT ( #118, #129, ( #67 ) ) ;
#27 = LOCAL_TIME ( 18, 48, 17.00000000000000000, #125 ) ;
#28 = FACE_OUTER_BOUND ( 'NONE', #156, .T. ) ;
#29 = APPROVAL_STATUS ( 'not_yet_approved' ) ;
#30 = ORIENTED_EDGE ( 'NONE', *, *, #63, .T. ) ;
#31 = FACE_OUTER_BOUND ( 'NONE', #47, .T. ) ;
#32 = APPLICATION_CONTEXT ( 'configuration controlled 3d designs of mechanical parts and assemblies' ) ;
#33 = CARTESIAN_POINT ( 'NONE',  ( 0.000000000000000000, 0.000000000000000000, 0.000000000000000000 ) ) ;
#34 = ORIENTED_EDGE ( 'NONE', *, *, #14, .T. ) ;
#35 = MECHANICAL_CONTEXT ( 'NONE', #32, 'mechanical' ) ;
#36 = CARTESIAN_POINT ( 'NONE',  ( 1.597490176674318647E-30, -134.0704392372640825, 0.000000000000000000 ) ) ;
#37 = AXIS2_PLACEMENT_3D ( 'NONE', #136, #90, #160 ) ;
#38 = DIRECTION ( 'NONE',  ( -1.000000000000000000, 0.000000000000000000, 0.000000000000000000 ) ) ;
#39 = AXIS2_PLACEMENT_3D ( 'NONE', #36, #109, #91 ) ;
#40 = CALENDAR_DATE ( 2021, 3, 2 ) ;
#41 = VERTEX_POINT ( 'NONE', #88 ) ;
#42 = APPROVAL_DATE_TIME ( #141, #70 ) ;
#43 = VERTEX_POINT ( 'NONE', #8 ) ;
#44 = PRODUCT_DEFINITION_SHAPE ( 'NONE', 'NONE',  #130 ) ;
#45 = CALENDAR_DATE ( 2021, 3, 2 ) ;
#46 = ADVANCED_FACE ( 'NONE', ( #2 ), #6, .T. ) ;
#47 = EDGE_LOOP ( 'NONE', ( #167, #3 ) ) ;
#48 = DIRECTION ( 'NONE',  ( -2.881521880346712196E-17, 1.000000000000000000, -0.000000000000000000 ) ) ;
#49 = APPROVAL ( #29, 'UNSPECIFIED' ) ;
#50 = PERSON_AND_ORGANIZATION ( #163, #18 ) ;
#51 = DIRECTION ( 'NONE',  ( 1.000000000000000000, 0.000000000000000000, 0.000000000000000000 ) ) ;
#52 = DIRECTION ( 'NONE',  ( -1.000000000000000000, 0.000000000000000000, 0.000000000000000000 ) ) ;
#53 = APPROVAL_STATUS ( 'not_yet_approved' ) ;
#54 = COORDINATED_UNIVERSAL_TIME_OFFSET ( 1, 0, .AHEAD. ) ;
#55 = AXIS2_PLACEMENT_3D ( 'NONE', #108, #12, #62 ) ;
#56 = PERSON_AND_ORGANIZATION_ROLE ( 'design_supplier' ) ;
#57 = APPROVAL_ROLE ( '' ) ;
#58 = LOCAL_TIME ( 18, 48, 17.00000000000000000, #83 ) ;
#59 = SHAPE_DEFINITION_REPRESENTATION ( #44, #73 ) ;
#60 = CARTESIAN_POINT ( 'NONE',  ( 4.999999999999954703, 205.9295607627360027, 6.123233995736722895E-16 ) ) ;
#61 = APPLICATION_PROTOCOL_DEFINITION ( 'international standard', 'config_control_design', 1994, #32 ) ;
#62 = DIRECTION ( 'NONE',  ( -1.000000000000000000, 0.000000000000000000, 0.000000000000000000 ) ) ;
#63 = EDGE_CURVE ( 'NONE', #43, #105, #112, .T. ) ;
#64 = PERSON_AND_ORGANIZATION ( #163, #18 ) ;
#65 = CARTESIAN_POINT ( 'NONE',  ( -9.797174393178822896E-15, 205.9295607627360027, 0.000000000000000000 ) ) ;
#66 = CLOSED_SHELL ( 'NONE', ( #132, #7, #104, #46 ) ) ;
#67 = SECURITY_CLASSIFICATION ( '', '', #95 ) ;
#68 = ORIENTED_EDGE ( 'NONE', *, *, #168, .F. ) ;
#69 = VECTOR ( 'NONE', #48, 1000.000000000000000 ) ;
#70 = APPROVAL ( #82, 'UNSPECIFIED' ) ;
#71 = PERSON_AND_ORGANIZATION ( #163, #18 ) ;
#72 = APPROVAL ( #53, 'UNSPECIFIED' ) ;
#73 = ADVANCED_BREP_SHAPE_REPRESENTATION ( 'Stange Fadenkreuz', ( #147, #117 ), #20 ) ;
#74 = CC_DESIGN_PERSON_AND_ORGANIZATION_ASSIGNMENT ( #50, #116, ( #67 ) ) ;
#75 = ORIENTED_EDGE ( 'NONE', *, *, #24, .F. ) ;
#76 = DIRECTION ( 'NONE',  ( -2.881521880346712196E-17, 1.000000000000000000, -0.000000000000000000 ) ) ;
#77 = APPLICATION_CONTEXT ( 'configuration controlled 3d designs of mechanical parts and assemblies' ) ;
#78 = AXIS2_PLACEMENT_3D ( 'NONE', #120, #76, #52 ) ;
#79 = PERSON_AND_ORGANIZATION_ROLE ( 'creator' ) ;
#80 = LOCAL_TIME ( 18, 48, 17.00000000000000000, #100 ) ;
#81 =( LENGTH_UNIT ( ) NAMED_UNIT ( * ) SI_UNIT ( .MILLI., .METRE. ) );
#82 = APPROVAL_STATUS ( 'not_yet_approved' ) ;
#83 = COORDINATED_UNIVERSAL_TIME_OFFSET ( 1, 0, .AHEAD. ) ;
#84 = APPROVAL_DATE_TIME ( #89, #72 ) ;
#85 = UNCERTAINTY_MEASURE_WITH_UNIT (LENGTH_MEASURE( 1.000000000000000082E-05 ), #81, 'distance_accuracy_value', 'NONE');
#86 = APPROVAL_PERSON_ORGANIZATION ( #128, #72, #146 ) ;
#87 = AXIS2_PLACEMENT_3D ( 'NONE', #124, #122, #92 ) ;
#88 = CARTESIAN_POINT ( 'NONE',  ( 4.999999999999969802, -134.0704392372641394, 6.123233995736734728E-16 ) ) ;
#89 = DATE_AND_TIME ( #45, #15 ) ;
#90 = DIRECTION ( 'NONE',  ( -2.881521880346712196E-17, 1.000000000000000000, -0.000000000000000000 ) ) ;
#91 = DIRECTION ( 'NONE',  ( 1.000000000000000000, 2.881521880346712196E-17, 0.000000000000000000 ) ) ;
#92 = DIRECTION ( 'NONE',  ( -1.000000000000000000, 0.000000000000000000, 0.000000000000000000 ) ) ;
#93 = PERSON_AND_ORGANIZATION_ROLE ( 'creator' ) ;
#94 = CALENDAR_DATE ( 2021, 3, 2 ) ;
#95 = SECURITY_CLASSIFICATION_LEVEL ( 'unclassified' ) ;
#96 = CIRCLE ( 'NONE', #78, 4.999999999999958256 ) ;
#97 = CARTESIAN_POINT ( 'NONE',  ( -4.999999999999968026, 205.9295607627360027, 0.000000000000000000 ) ) ;
#98 = AXIS2_PLACEMENT_3D ( 'NONE', #97, #152, #111 ) ;
#99 = CARTESIAN_POINT ( 'NONE',  ( 3.081487911019577365E-30, -134.0704392372641394, 0.000000000000000000 ) ) ;
#100 = COORDINATED_UNIVERSAL_TIME_OFFSET ( 1, 0, .AHEAD. ) ;
#101 = VECTOR ( 'NONE', #21, 1000.000000000000000 ) ;
#102 = APPROVAL_PERSON_ORGANIZATION ( #64, #70, #174 ) ;
#103 = ORIENTED_EDGE ( 'NONE', *, *, #16, .F. ) ;
#104 = ADVANCED_FACE ( 'NONE', ( #28 ), #134, .T. ) ;
#105 = VERTEX_POINT ( 'NONE', #172 ) ;
#106 = DIRECTION ( 'NONE',  ( -2.881521880346712196E-17, 1.000000000000000000, -0.000000000000000000 ) ) ;
#107 = PRODUCT_DEFINITION_FORMATION_WITH_SPECIFIED_SOURCE ( 'ANY', '', #114, .NOT_KNOWN. ) ;
#108 = CARTESIAN_POINT ( 'NONE',  ( -9.797174393178822896E-15, 205.9295607627360027, 0.000000000000000000 ) ) ;
#109 = DIRECTION ( 'NONE',  ( 2.881521880346712196E-17, -1.000000000000000000, 0.000000000000000000 ) ) ;
#110 = CIRCLE ( 'NONE', #87, 4.999999999999969802 ) ;
#111 = DIRECTION ( 'NONE',  ( -1.000000000000000000, -2.881521880346712196E-17, 0.000000000000000000 ) ) ;
#112 = LINE ( 'NONE', #19, #69 ) ;
#113 = ORIENTED_EDGE ( 'NONE', *, *, #14, .F. ) ;
#114 = PRODUCT ( 'Stange Fadenkreuz', 'Stange Fadenkreuz', '', ( #35 ) ) ;
#115 = ORIENTED_EDGE ( 'NONE', *, *, #16, .T. ) ;
#116 = PERSON_AND_ORGANIZATION_ROLE ( 'classification_officer' ) ;
#117 = AXIS2_PLACEMENT_3D ( 'NONE', #33, #123, #51 ) ;
#118 = DATE_AND_TIME ( #131, #137 ) ;
#119 = CIRCLE ( 'NONE', #164, 4.999999999999969802 ) ;
#120 = CARTESIAN_POINT ( 'NONE',  ( -9.797174393178822896E-15, 205.9295607627360027, 0.000000000000000000 ) ) ;
#121 = PERSON_AND_ORGANIZATION ( #163, #18 ) ;
#122 = DIRECTION ( 'NONE',  ( -2.881521880346712196E-17, 1.000000000000000000, -0.000000000000000000 ) ) ;
#123 = DIRECTION ( 'NONE',  ( 0.000000000000000000, 0.000000000000000000, 1.000000000000000000 ) ) ;
#124 = CARTESIAN_POINT ( 'NONE',  ( 3.081487911019577365E-30, -134.0704392372641394, 0.000000000000000000 ) ) ;
#125 = COORDINATED_UNIVERSAL_TIME_OFFSET ( 1, 0, .AHEAD. ) ;
#126 = PLANE ( 'NONE',  #98 ) ;
#127 = CC_DESIGN_APPROVAL ( #70, ( #107 ) ) ;
#128 = PERSON_AND_ORGANIZATION ( #163, #18 ) ;
#129 = DATE_TIME_ROLE ( 'classification_date' ) ;
#130 = PRODUCT_DEFINITION ( 'UNKNOWN', '', #107, #157 ) ;
#131 = CALENDAR_DATE ( 2021, 3, 2 ) ;
#132 = ADVANCED_FACE ( 'NONE', ( #139 ), #138, .T. ) ;
#133 = ORIENTED_EDGE ( 'NONE', *, *, #63, .F. ) ;
#134 = PLANE ( 'NONE',  #39 ) ;
#135 = APPLICATION_PROTOCOL_DEFINITION ( 'international standard', 'config_control_design', 1994, #77 ) ;
#136 = CARTESIAN_POINT ( 'NONE',  ( -9.797174393178822896E-15, 205.9295607627360027, 0.000000000000000000 ) ) ;
#137 = LOCAL_TIME ( 18, 48, 17.00000000000000000, #166 ) ;
#138 = CYLINDRICAL_SURFACE ( 'NONE', #37, 4.999999999999964473 ) ;
#139 = FACE_OUTER_BOUND ( 'NONE', #23, .T. ) ;
#140 = AXIS2_PLACEMENT_3D ( 'NONE', #65, #106, #159 ) ;
#141 = DATE_AND_TIME ( #153, #58 ) ;
#142 = VERTEX_POINT ( 'NONE', #143 ) ;
#143 = CARTESIAN_POINT ( 'NONE',  ( 4.999999999999948486, 205.9295607627360027, 6.123233995736718951E-16 ) ) ;
#144 = CC_DESIGN_DATE_AND_TIME_ASSIGNMENT ( #155, #162, ( #130 ) ) ;
#145 = PERSON_AND_ORGANIZATION_ROLE ( 'design_owner' ) ;
#146 = APPROVAL_ROLE ( '' ) ;
#147 = MANIFOLD_SOLID_BREP ( 'Rotation1', #66 ) ;
#148 = APPROVAL_DATE_TIME ( #4, #49 ) ;
#149 = LINE ( 'NONE', #60, #101 ) ;
#150 = CC_DESIGN_PERSON_AND_ORGANIZATION_ASSIGNMENT ( #71, #145, ( #114 ) ) ;
#151 = ORIENTED_EDGE ( 'NONE', *, *, #24, .T. ) ;
#152 = DIRECTION ( 'NONE',  ( -2.881521880346712196E-17, 1.000000000000000000, 0.000000000000000000 ) ) ;
#153 = CALENDAR_DATE ( 2021, 3, 2 ) ;
#154 = CC_DESIGN_SECURITY_CLASSIFICATION ( #67, ( #107 ) ) ;
#155 = DATE_AND_TIME ( #94, #27 ) ;
#156 = EDGE_LOOP ( 'NONE', ( #103, #113 ) ) ;
#157 = DESIGN_CONTEXT ( 'detailed design', #77, 'design' ) ;
#158 = CC_DESIGN_PERSON_AND_ORGANIZATION_ASSIGNMENT ( #17, #93, ( #107 ) ) ;
#159 = DIRECTION ( 'NONE',  ( -1.000000000000000000, 0.000000000000000000, 0.000000000000000000 ) ) ;
#160 = DIRECTION ( 'NONE',  ( -1.000000000000000000, 0.000000000000000000, 0.000000000000000000 ) ) ;
#161 = CC_DESIGN_PERSON_AND_ORGANIZATION_ASSIGNMENT ( #22, #79, ( #130 ) ) ;
#162 = DATE_TIME_ROLE ( 'creation_date' ) ;
#163 = PERSON ( 'UNSPECIFIED', 'UNSPECIFIED', 'UNSPECIFIED', ('UNSPECIFIED'), ('UNSPECIFIED'), ('UNSPECIFIED') ) ;
#164 = AXIS2_PLACEMENT_3D ( 'NONE', #99, #13, #38 ) ;
#165 = APPROVAL_PERSON_ORGANIZATION ( #9, #49, #57 ) ;
#166 = COORDINATED_UNIVERSAL_TIME_OFFSET ( 1, 0, .AHEAD. ) ;
#167 = ORIENTED_EDGE ( 'NONE', *, *, #175, .T. ) ;
#168 = EDGE_CURVE ( 'NONE', #142, #105, #96, .T. ) ;
#169 = CC_DESIGN_PERSON_AND_ORGANIZATION_ASSIGNMENT ( #121, #56, ( #107 ) ) ;
#170 = ORIENTED_EDGE ( 'NONE', *, *, #175, .F. ) ;
#171 = CC_DESIGN_APPROVAL ( #72, ( #130 ) ) ;
#172 = CARTESIAN_POINT ( 'NONE',  ( -4.999999999999968026, 205.9295607627360027, 0.000000000000000000 ) ) ;
#173 =( NAMED_UNIT ( * ) SI_UNIT ( $, .STERADIAN. ) SOLID_ANGLE_UNIT ( ) );
#174 = APPROVAL_ROLE ( '' ) ;
#175 = EDGE_CURVE ( 'NONE', #105, #142, #25, .T. ) ;
ENDSEC;
END-ISO-10303-21;
