ISO-10303-21;
HEADER;
FILE_DESCRIPTION (( 'STEP AP203' ),
    '1' );
FILE_NAME ('Motoraufhalterung x-y Koord.STEP',
    '2021-02-03T17:44:55',
    ( '' ),
    ( '' ),
    'SwSTEP 2.0',
    'SolidWorks 2018',
    '' );
FILE_SCHEMA (( 'CONFIG_CONTROL_DESIGN' ));
ENDSEC;

DATA;
#1 = CARTESIAN_POINT ( 'NONE',  ( -39.00000000000000000, 40.49999999999998579, 3.000000000000000000 ) ) ;
#2 = CARTESIAN_POINT ( 'NONE',  ( -50.00000000000000000, -6.123233995736764507E-15, 3.000000000000000000 ) ) ;
#3 = VECTOR ( 'NONE', #366, 1000.000000000000000 ) ;
#4 = AXIS2_PLACEMENT_3D ( 'NONE', #339, #96, #395 ) ;
#5 = CARTESIAN_POINT ( 'NONE',  ( -40.50000000000000000, 9.499999999999994671, 3.000000000000000000 ) ) ;
#6 = DIRECTION ( 'NONE',  ( -0.000000000000000000, -0.000000000000000000, -1.000000000000000000 ) ) ;
#7 = LOCAL_TIME ( 18, 44, 55.00000000000000000, #422 ) ;
#8 = CARTESIAN_POINT ( 'NONE',  ( 0.000000000000000000, 0.000000000000000000, 3.000000000000000000 ) ) ;
#9 = DIRECTION ( 'NONE',  ( 0.000000000000000000, -0.000000000000000000, 1.000000000000000000 ) ) ;
#10 = VERTEX_POINT ( 'NONE', #521 ) ;
#11 = DIRECTION ( 'NONE',  ( -1.000000000000000000, 0.000000000000000000, 0.000000000000000000 ) ) ;
#12 = EDGE_CURVE ( 'NONE', #568, #195, #217, .T. ) ;
#13 = VERTEX_POINT ( 'NONE', #475 ) ;
#14 = DIRECTION ( 'NONE',  ( 0.000000000000000000, 0.000000000000000000, 1.000000000000000000 ) ) ;
#15 = LINE ( 'NONE', #565, #615 ) ;
#16 = CARTESIAN_POINT ( 'NONE',  ( -8.000000000000000000, 9.499999999999994671, 3.000000000000000000 ) ) ;
#17 = DIRECTION ( 'NONE',  ( 1.000000000000000000, 0.000000000000000000, 0.000000000000000000 ) ) ;
#18 = EDGE_CURVE ( 'NONE', #568, #589, #655, .T. ) ;
#19 = DIRECTION ( 'NONE',  ( 0.000000000000000000, 0.000000000000000000, 1.000000000000000000 ) ) ;
#20 = AXIS2_PLACEMENT_3D ( 'NONE', #301, #414, #120 ) ;
#21 = ORIENTED_EDGE ( 'NONE', *, *, #315, .F. ) ;
#22 = FACE_OUTER_BOUND ( 'NONE', #681, .T. ) ;
#23 = CYLINDRICAL_SURFACE ( 'NONE', #607, 15.50000000000000711 ) ;
#24 = APPLICATION_PROTOCOL_DEFINITION ( 'international standard', 'config_control_design', 1994, #604 ) ;
#25 = PERSON_AND_ORGANIZATION_ROLE ( 'creator' ) ;
#26 = AXIS2_PLACEMENT_3D ( 'NONE', #305, #705, #40 ) ;
#27 = DIRECTION ( 'NONE',  ( 1.000000000000000000, 0.000000000000000000, 0.000000000000000000 ) ) ;
#28 = ORIENTED_EDGE ( 'NONE', *, *, #201, .F. ) ;
#29 = CIRCLE ( 'NONE', #678, 2.500000000000000444 ) ;
#30 = VERTEX_POINT ( 'NONE', #2 ) ;
#31 = VERTEX_POINT ( 'NONE', #253 ) ;
#32 = ADVANCED_FACE ( 'NONE', ( #611 ), #307, .F. ) ;
#33 = CARTESIAN_POINT ( 'NONE',  ( -50.00000000000000000, -6.123233995736764507E-15, 3.000000000000000000 ) ) ;
#34 = DIRECTION ( 'NONE',  ( 0.000000000000000000, 0.000000000000000000, 1.000000000000000000 ) ) ;
#35 = EDGE_LOOP ( 'NONE', ( #709, #317, #149, #296 ) ) ;
#36 = ADVANCED_FACE ( 'NONE', ( #114 ), #250, .F. ) ;
#37 = FACE_BOUND ( 'NONE', #415, .T. ) ;
#38 = EDGE_CURVE ( 'NONE', #567, #365, #29, .T. ) ;
#39 = LINE ( 'NONE', #574, #659 ) ;
#40 = DIRECTION ( 'NONE',  ( 1.000000000000000000, 0.000000000000000000, 0.000000000000000000 ) ) ;
#41 = DIRECTION ( 'NONE',  ( -0.000000000000000000, -0.000000000000000000, -1.000000000000000000 ) ) ;
#42 = COORDINATED_UNIVERSAL_TIME_OFFSET ( 1, 0, .AHEAD. ) ;
#43 = ADVANCED_FACE ( 'NONE', ( #56 ), #577, .F. ) ;
#44 = VERTEX_POINT ( 'NONE', #131 ) ;
#45 = EDGE_LOOP ( 'NONE', ( #684, #461, #635, #407 ) ) ;
#46 = ORIENTED_EDGE ( 'NONE', *, *, #254, .T. ) ;
#47 = DIRECTION ( 'NONE',  ( 0.000000000000000000, 1.000000000000000000, 0.000000000000000000 ) ) ;
#48 = AXIS2_PLACEMENT_3D ( 'NONE', #69, #140, #193 ) ;
#49 = LINE ( 'NONE', #159, #472 ) ;
#50 = EDGE_CURVE ( 'NONE', #629, #537, #504, .T. ) ;
#51 = DIRECTION ( 'NONE',  ( -0.000000000000000000, -0.000000000000000000, -1.000000000000000000 ) ) ;
#52 = CARTESIAN_POINT ( 'NONE',  ( -50.00000000000000000, -6.123233995736764507E-15, 3.000000000000000000 ) ) ;
#53 = AXIS2_PLACEMENT_3D ( 'NONE', #277, #172, #223 ) ;
#54 = AXIS2_PLACEMENT_3D ( 'NONE', #394, #34, #553 ) ;
#55 = DIRECTION ( 'NONE',  ( -0.000000000000000000, -0.000000000000000000, -1.000000000000000000 ) ) ;
#56 = FACE_OUTER_BOUND ( 'NONE', #416, .T. ) ;
#57 = VERTEX_POINT ( 'NONE', #74 ) ;
#58 = AXIS2_PLACEMENT_3D ( 'NONE', #478, #133, #17 ) ;
#59 = LINE ( 'NONE', #8, #161 ) ;
#60 = DIRECTION ( 'NONE',  ( 0.000000000000000000, 0.000000000000000000, 1.000000000000000000 ) ) ;
#61 = CIRCLE ( 'NONE', #526, 15.50000000000000533 ) ;
#62 = DATE_AND_TIME ( #459, #7 ) ;
#63 = EDGE_CURVE ( 'NONE', #455, #76, #351, .T. ) ;
#64 = DIRECTION ( 'NONE',  ( 0.000000000000000000, 0.000000000000000000, 1.000000000000000000 ) ) ;
#65 = EDGE_LOOP ( 'NONE', ( #156, #720, #527, #470 ) ) ;
#66 = ORIENTED_EDGE ( 'NONE', *, *, #216, .F. ) ;
#67 = CYLINDRICAL_SURFACE ( 'NONE', #340, 1.500000000000001332 ) ;
#68 = AXIS2_PLACEMENT_3D ( 'NONE', #115, #124, #178 ) ;
#69 = CARTESIAN_POINT ( 'NONE',  ( -9.500000000000001776, 9.499999999999994671, 3.000000000000000000 ) ) ;
#70 = CARTESIAN_POINT ( 'NONE',  ( 0.000000000000000000, 105.0000000000000000, 0.000000000000000000 ) ) ;
#71 = DIRECTION ( 'NONE',  ( 1.000000000000000000, 0.000000000000000000, 0.000000000000000000 ) ) ;
#72 = CARTESIAN_POINT ( 'NONE',  ( -50.00000000000000000, -6.123233995736764507E-15, 0.000000000000000000 ) ) ;
#73 = CARTESIAN_POINT ( 'NONE',  ( -9.499999999999996447, 24.99999999999999289, 3.000000000000000000 ) ) ;
#74 = CARTESIAN_POINT ( 'NONE',  ( -9.499999999999996447, 24.99999999999999289, 0.000000000000000000 ) ) ;
#75 = EDGE_LOOP ( 'NONE', ( #206, #755 ) ) ;
#76 = VERTEX_POINT ( 'NONE', #420 ) ;
#77 = CARTESIAN_POINT ( 'NONE',  ( -42.00000000000000000, 9.499999999999994671, 3.000000000000000000 ) ) ;
#78 = EDGE_LOOP ( 'NONE', ( #99, #46 ) ) ;
#79 = CIRCLE ( 'NONE', #53, 1.500000000000001332 ) ;
#80 = FACE_OUTER_BOUND ( 'NONE', #297, .T. ) ;
#81 = CC_DESIGN_APPROVAL ( #109, ( #433 ) ) ;
#82 = DIRECTION ( 'NONE',  ( 0.000000000000000000, 0.000000000000000000, 1.000000000000000000 ) ) ;
#83 = EDGE_CURVE ( 'NONE', #260, #558, #102, .T. ) ;
#84 = PERSON_AND_ORGANIZATION_ROLE ( 'creator' ) ;
#85 = AXIS2_PLACEMENT_3D ( 'NONE', #404, #562, #281 ) ;
#86 = DIRECTION ( 'NONE',  ( -0.000000000000000000, -0.000000000000000000, -1.000000000000000000 ) ) ;
#87 = EDGE_LOOP ( 'NONE', ( #207, #108 ) ) ;
#88 = ORIENTED_EDGE ( 'NONE', *, *, #634, .T. ) ;
#89 = EDGE_CURVE ( 'NONE', #76, #10, #711, .T. ) ;
#90 = VERTEX_POINT ( 'NONE', #372 ) ;
#91 = CIRCLE ( 'NONE', #170, 1.500000000000001332 ) ;
#92 = MANIFOLD_SOLID_BREP ( 'Aufsatz-Linear austragen1', #225 ) ;
#93 = CARTESIAN_POINT ( 'NONE',  ( -11.00000000000000355, 40.49999999999999289, 3.000000000000000000 ) ) ;
#94 = ADVANCED_FACE ( 'NONE', ( #549 ), #409, .F. ) ;
#95 = AXIS2_PLACEMENT_3D ( 'NONE', #536, #706, #375 ) ;
#96 = DIRECTION ( 'NONE',  ( 0.000000000000000000, 0.000000000000000000, 1.000000000000000000 ) ) ;
#97 = CARTESIAN_POINT ( 'NONE',  ( 0.000000000000000000, 0.000000000000000000, 3.000000000000000000 ) ) ;
#98 = AXIS2_PLACEMENT_3D ( 'NONE', #329, #617, #674 ) ;
#99 = ORIENTED_EDGE ( 'NONE', *, *, #598, .T. ) ;
#100 = CARTESIAN_POINT ( 'NONE',  ( -40.00000000000000000, 95.00000000000000000, 0.000000000000000000 ) ) ;
#101 = ORIENTED_EDGE ( 'NONE', *, *, #168, .F. ) ;
#102 = LINE ( 'NONE', #16, #517 ) ;
#103 = AXIS2_PLACEMENT_3D ( 'NONE', #657, #428, #715 ) ;
#104 = APPROVAL_PERSON_ORGANIZATION ( #606, #109, #385 ) ;
#105 = DIRECTION ( 'NONE',  ( 1.000000000000000000, 0.000000000000000000, 0.000000000000000000 ) ) ;
#106 = PLANE ( 'NONE',  #323 ) ;
#107 = EDGE_LOOP ( 'NONE', ( #506, #464, #367, #514 ) ) ;
#108 = ORIENTED_EDGE ( 'NONE', *, *, #421, .T. ) ;
#109 = APPROVAL ( #209, 'UNSPECIFIED' ) ;
#110 = CIRCLE ( 'NONE', #155, 1.500000000000001332 ) ;
#111 = EDGE_CURVE ( 'NONE', #90, #442, #220, .T. ) ;
#112 = CIRCLE ( 'NONE', #625, 15.50000000000000533 ) ;
#113 = PLANE ( 'NONE',  #85 ) ;
#114 = FACE_OUTER_BOUND ( 'NONE', #721, .T. ) ;
#115 = CARTESIAN_POINT ( 'NONE',  ( -10.00000000000000000, 95.00000000000000000, 0.000000000000000000 ) ) ;
#116 = ORIENTED_EDGE ( 'NONE', *, *, #63, .F. ) ;
#117 = ORIENTED_EDGE ( 'NONE', *, *, #89, .T. ) ;
#118 = EDGE_CURVE ( 'NONE', #636, #445, #622, .T. ) ;
#119 = FACE_BOUND ( 'NONE', #235, .T. ) ;
#120 = DIRECTION ( 'NONE',  ( -1.000000000000000000, 0.000000000000000000, 0.000000000000000000 ) ) ;
#121 = DIRECTION ( 'NONE',  ( 0.000000000000000000, 0.000000000000000000, 1.000000000000000000 ) ) ;
#122 = CARTESIAN_POINT ( 'NONE',  ( -42.00000000000000000, 9.499999999999994671, 0.000000000000000000 ) ) ;
#123 = EDGE_CURVE ( 'NONE', #480, #288, #658, .T. ) ;
#124 = DIRECTION ( 'NONE',  ( 0.000000000000000000, 0.000000000000000000, 1.000000000000000000 ) ) ;
#125 = ORIENTED_EDGE ( 'NONE', *, *, #239, .F. ) ;
#126 = EDGE_LOOP ( 'NONE', ( #522, #101 ) ) ;
#127 = VERTEX_POINT ( 'NONE', #189 ) ;
#128 = VECTOR ( 'NONE', #51, 1000.000000000000000 ) ;
#129 = CARTESIAN_POINT ( 'NONE',  ( -42.50000000000000000, 95.00000000000000000, 3.000000000000000000 ) ) ;
#130 = FACE_BOUND ( 'NONE', #556, .T. ) ;
#131 = CARTESIAN_POINT ( 'NONE',  ( -40.50000000000000711, 24.99999999999998934, 0.000000000000000000 ) ) ;
#132 = EDGE_CURVE ( 'NONE', #442, #31, #358, .T. ) ;
#133 = DIRECTION ( 'NONE',  ( 0.000000000000000000, 0.000000000000000000, 1.000000000000000000 ) ) ;
#134 = CARTESIAN_POINT ( 'NONE',  ( -9.500000000000001776, 40.49999999999999289, 3.000000000000000000 ) ) ;
#135 = PERSON_AND_ORGANIZATION ( #344, #320 ) ;
#136 = DIRECTION ( 'NONE',  ( 1.000000000000000000, 0.000000000000000000, 0.000000000000000000 ) ) ;
#137 = DIRECTION ( 'NONE',  ( -0.000000000000000000, -0.000000000000000000, -1.000000000000000000 ) ) ;
#138 = AXIS2_PLACEMENT_3D ( 'NONE', #267, #390, #669 ) ;
#139 = EDGE_LOOP ( 'NONE', ( #666, #692, #631, #579 ) ) ;
#140 = DIRECTION ( 'NONE',  ( -0.000000000000000000, -0.000000000000000000, -1.000000000000000000 ) ) ;
#141 = ORIENTED_EDGE ( 'NONE', *, *, #663, .F. ) ;
#142 = ORIENTED_EDGE ( 'NONE', *, *, #398, .T. ) ;
#143 = FACE_BOUND ( 'NONE', #78, .T. ) ;
#144 = CIRCLE ( 'NONE', #566, 2.500000000000002220 ) ;
#145 = CARTESIAN_POINT ( 'NONE',  ( 0.000000000000000000, 0.000000000000000000, 3.000000000000000000 ) ) ;
#146 = DIRECTION ( 'NONE',  ( 1.000000000000000000, 1.224646799147352961E-16, -0.000000000000000000 ) ) ;
#147 = EDGE_CURVE ( 'NONE', #30, #13, #59, .T. ) ;
#148 = DIRECTION ( 'NONE',  ( 1.000000000000000000, 0.000000000000000000, 0.000000000000000000 ) ) ;
#149 = ORIENTED_EDGE ( 'NONE', *, *, #216, .T. ) ;
#150 = DIRECTION ( 'NONE',  ( -1.000000000000000000, 0.000000000000000000, 0.000000000000000000 ) ) ;
#151 = APPROVAL_PERSON_ORGANIZATION ( #701, #509, #205 ) ;
#152 = LINE ( 'NONE', #642, #342 ) ;
#153 = AXIS2_PLACEMENT_3D ( 'NONE', #369, #592, #136 ) ;
#154 = CALENDAR_DATE ( 2021, 3, 2 ) ;
#155 = AXIS2_PLACEMENT_3D ( 'NONE', #572, #751, #410 ) ;
#156 = ORIENTED_EDGE ( 'NONE', *, *, #754, .T. ) ;
#157 = ORIENTED_EDGE ( 'NONE', *, *, #411, .F. ) ;
#158 = VERTEX_POINT ( 'NONE', #186 ) ;
#159 = CARTESIAN_POINT ( 'NONE',  ( 0.000000000000000000, 0.000000000000000000, 3.000000000000000000 ) ) ;
#160 = VERTEX_POINT ( 'NONE', #646 ) ;
#161 = VECTOR ( 'NONE', #146, 1000.000000000000000 ) ;
#162 = ADVANCED_FACE ( 'NONE', ( #748, #571, #667, #197, #482, #143, #499, #37 ), #449, .F. ) ;
#163 = LINE ( 'NONE', #538, #712 ) ;
#164 = DIRECTION ( 'NONE',  ( 1.000000000000000000, 0.000000000000000000, 0.000000000000000000 ) ) ;
#165 = DATE_AND_TIME ( #689, #314 ) ;
#166 = DIRECTION ( 'NONE',  ( 0.000000000000000000, 0.000000000000000000, 1.000000000000000000 ) ) ;
#167 = CC_DESIGN_PERSON_AND_ORGANIZATION_ASSIGNMENT ( #533, #84, ( #433 ) ) ;
#168 = EDGE_CURVE ( 'NONE', #158, #90, #368, .T. ) ;
#169 = DIRECTION ( 'NONE',  ( -0.000000000000000000, -0.000000000000000000, -1.000000000000000000 ) ) ;
#170 = AXIS2_PLACEMENT_3D ( 'NONE', #753, #291, #520 ) ;
#171 = LOCAL_TIME ( 18, 44, 55.00000000000000000, #405 ) ;
#172 = DIRECTION ( 'NONE',  ( 0.000000000000000000, 0.000000000000000000, 1.000000000000000000 ) ) ;
#173 = ORIENTED_EDGE ( 'NONE', *, *, #234, .T. ) ;
#174 = ORIENTED_EDGE ( 'NONE', *, *, #411, .T. ) ;
#175 = ORIENTED_EDGE ( 'NONE', *, *, #213, .F. ) ;
#176 = EDGE_CURVE ( 'NONE', #13, #665, #693, .T. ) ;
#177 = CIRCLE ( 'NONE', #4, 15.50000000000000533 ) ;
#178 = DIRECTION ( 'NONE',  ( 1.000000000000000000, 0.000000000000000000, 0.000000000000000000 ) ) ;
#179 = EDGE_CURVE ( 'NONE', #383, #160, #531, .T. ) ;
#180 = ORIENTED_EDGE ( 'NONE', *, *, #450, .F. ) ;
#181 = ORIENTED_EDGE ( 'NONE', *, *, #510, .F. ) ;
#182 = CIRCLE ( 'NONE', #363, 1.500000000000001332 ) ;
#183 = CARTESIAN_POINT ( 'NONE',  ( -40.50000000000000000, 9.499999999999994671, 3.000000000000000000 ) ) ;
#184 = DIRECTION ( 'NONE',  ( 0.000000000000000000, 0.000000000000000000, 1.000000000000000000 ) ) ;
#185 = CC_DESIGN_DATE_AND_TIME_ASSIGNMENT ( #726, #322, ( #271 ) ) ;
#186 = CARTESIAN_POINT ( 'NONE',  ( -8.000000000000000000, 40.49999999999999289, 3.000000000000000000 ) ) ;
#187 = AXIS2_PLACEMENT_3D ( 'NONE', #544, #218, #211 ) ;
#188 = VERTEX_POINT ( 'NONE', #498 ) ;
#189 = CARTESIAN_POINT ( 'NONE',  ( -40.50000000000000711, 24.99999999999998934, 3.000000000000000000 ) ) ;
#190 = ORIENTED_EDGE ( 'NONE', *, *, #699, .T. ) ;
#191 = CIRCLE ( 'NONE', #54, 2.500000000000002220 ) ;
#192 = DIRECTION ( 'NONE',  ( -0.000000000000000000, -0.000000000000000000, -1.000000000000000000 ) ) ;
#193 = DIRECTION ( 'NONE',  ( -1.000000000000000000, 0.000000000000000000, 0.000000000000000000 ) ) ;
#194 = DIRECTION ( 'NONE',  ( -0.000000000000000000, -0.000000000000000000, -1.000000000000000000 ) ) ;
#195 = VERTEX_POINT ( 'NONE', #679 ) ;
#196 = ORIENTED_EDGE ( 'NONE', *, *, #168, .T. ) ;
#197 = FACE_BOUND ( 'NONE', #298, .T. ) ;
#198 = CC_DESIGN_PERSON_AND_ORGANIZATION_ASSIGNMENT ( #135, #722, ( #433 ) ) ;
#199 = VECTOR ( 'NONE', #242, 1000.000000000000000 ) ;
#200 = DIRECTION ( 'NONE',  ( -0.000000000000000000, -0.000000000000000000, -1.000000000000000000 ) ) ;
#201 = EDGE_CURVE ( 'NONE', #537, #188, #212, .T. ) ;
#202 = DIRECTION ( 'NONE',  ( 1.000000000000000000, 0.000000000000000000, 0.000000000000000000 ) ) ;
#203 = DATE_AND_TIME ( #397, #240 ) ;
#204 = AXIS2_PLACEMENT_3D ( 'NONE', #241, #300, #696 ) ;
#205 = APPROVAL_ROLE ( '' ) ;
#206 = ORIENTED_EDGE ( 'NONE', *, *, #754, .F. ) ;
#207 = ORIENTED_EDGE ( 'NONE', *, *, #609, .T. ) ;
#208 = EDGE_LOOP ( 'NONE', ( #645, #746 ) ) ;
#209 = APPROVAL_STATUS ( 'not_yet_approved' ) ;
#210 = ORIENTED_EDGE ( 'NONE', *, *, #648, .T. ) ;
#211 = DIRECTION ( 'NONE',  ( 1.000000000000000000, 0.000000000000000000, 0.000000000000000000 ) ) ;
#212 = CIRCLE ( 'NONE', #138, 1.500000000000001332 ) ;
#213 = EDGE_CURVE ( 'NONE', #13, #590, #49, .T. ) ;
#214 = PLANE ( 'NONE',  #98 ) ;
#215 = CC_DESIGN_APPROVAL ( #509, ( #698 ) ) ;
#216 = EDGE_CURVE ( 'NONE', #601, #30, #675, .T. ) ;
#217 = CIRCLE ( 'NONE', #488, 1.500000000000001332 ) ;
#218 = DIRECTION ( 'NONE',  ( 0.000000000000000000, 0.000000000000000000, 1.000000000000000000 ) ) ;
#219 = EDGE_LOOP ( 'NONE', ( #400, #733, #157, #283 ) ) ;
#220 = LINE ( 'NONE', #93, #602 ) ;
#221 = DIRECTION ( 'NONE',  ( 0.000000000000000000, -0.000000000000000000, 1.000000000000000000 ) ) ;
#222 = ADVANCED_FACE ( 'NONE', ( #593 ), #214, .F. ) ;
#223 = DIRECTION ( 'NONE',  ( 1.000000000000000000, 0.000000000000000000, 0.000000000000000000 ) ) ;
#224 = APPROVAL ( #605, 'UNSPECIFIED' ) ;
#225 = CLOSED_SHELL ( 'NONE', ( #623, #546, #738, #730, #330, #345, #516, #619, #162, #333, #222, #501, #396, #43, #32, #36, #548, #627, #552, #94 ) ) ;
#226 = AXIS2_PLACEMENT_3D ( 'NONE', #620, #221, #739 ) ;
#227 = ORIENTED_EDGE ( 'NONE', *, *, #132, .F. ) ;
#228 = DIRECTION ( 'NONE',  ( -0.000000000000000000, -0.000000000000000000, -1.000000000000000000 ) ) ;
#229 = VECTOR ( 'NONE', #228, 1000.000000000000000 ) ;
#230 = DIRECTION ( 'NONE',  ( 1.000000000000000000, 1.224646799147352961E-16, -0.000000000000000000 ) ) ;
#231 = DIRECTION ( 'NONE',  ( 0.000000000000000000, 0.000000000000000000, 1.000000000000000000 ) ) ;
#232 = ORIENTED_EDGE ( 'NONE', *, *, #421, .F. ) ;
#233 = ORIENTED_EDGE ( 'NONE', *, *, #123, .F. ) ;
#234 = EDGE_CURVE ( 'NONE', #160, #383, #191, .T. ) ;
#235 = EDGE_LOOP ( 'NONE', ( #338, #141 ) ) ;
#236 = LINE ( 'NONE', #500, #229 ) ;
#237 = CARTESIAN_POINT ( 'NONE',  ( -8.000000000000000000, 9.499999999999994671, 0.000000000000000000 ) ) ;
#238 = CARTESIAN_POINT ( 'NONE',  ( -7.500000000000000000, 95.00000000000000000, 3.000000000000000000 ) ) ;
#239 = EDGE_CURVE ( 'NONE', #445, #160, #734, .T. ) ;
#240 = LOCAL_TIME ( 18, 44, 55.00000000000000000, #661 ) ;
#241 = CARTESIAN_POINT ( 'NONE',  ( -50.00000000000000000, -6.123233995736764507E-15, 3.000000000000000000 ) ) ;
#242 = DIRECTION ( 'NONE',  ( -0.000000000000000000, -0.000000000000000000, -1.000000000000000000 ) ) ;
#243 = EDGE_LOOP ( 'NONE', ( #142, #273, #175, #327 ) ) ;
#244 = ORIENTED_EDGE ( 'NONE', *, *, #335, .F. ) ;
#245 = CIRCLE ( 'NONE', #353, 1.500000000000001332 ) ;
#246 = CYLINDRICAL_SURFACE ( 'NONE', #381, 1.500000000000001332 ) ;
#247 = DIRECTION ( 'NONE',  ( -1.000000000000000000, 0.000000000000000000, 0.000000000000000000 ) ) ;
#248 = CARTESIAN_POINT ( 'NONE',  ( 0.000000000000000000, 0.000000000000000000, 0.000000000000000000 ) ) ;
#249 = CARTESIAN_POINT ( 'NONE',  ( -9.500000000000001776, 40.49999999999999289, 3.000000000000000000 ) ) ;
#250 = CYLINDRICAL_SURFACE ( 'NONE', #727, 1.500000000000001332 ) ;
#251 = ORIENTED_EDGE ( 'NONE', *, *, #179, .T. ) ;
#252 = CARTESIAN_POINT ( 'NONE',  ( -10.00000000000000000, 95.00000000000000000, 3.000000000000000000 ) ) ;
#253 = CARTESIAN_POINT ( 'NONE',  ( -8.000000000000000000, 40.49999999999999289, 0.000000000000000000 ) ) ;
#254 = EDGE_CURVE ( 'NONE', #57, #44, #177, .T. ) ;
#255 = FACE_BOUND ( 'NONE', #75, .T. ) ;
#256 = PERSON_AND_ORGANIZATION ( #344, #320 ) ;
#257 =( LENGTH_UNIT ( ) NAMED_UNIT ( * ) SI_UNIT ( .MILLI., .METRE. ) );
#258 = VERTEX_POINT ( 'NONE', #446 ) ;
#259 = EDGE_LOOP ( 'NONE', ( #656, #389, #664, #21 ) ) ;
#260 = VERTEX_POINT ( 'NONE', #503 ) ;
#261 = LINE ( 'NONE', #295, #573 ) ;
#262 = CC_DESIGN_APPROVAL ( #224, ( #271 ) ) ;
#263 = FACE_OUTER_BOUND ( 'NONE', #700, .T. ) ;
#264 = EDGE_CURVE ( 'NONE', #288, #480, #341, .T. ) ;
#265 = APPROVAL_STATUS ( 'not_yet_approved' ) ;
#266 = DIRECTION ( 'NONE',  ( -0.000000000000000000, -1.000000000000000000, -0.000000000000000000 ) ) ;
#267 = CARTESIAN_POINT ( 'NONE',  ( -40.50000000000000000, 9.499999999999994671, 0.000000000000000000 ) ) ;
#268 = ORIENTED_EDGE ( 'NONE', *, *, #476, .T. ) ;
#269 = FACE_OUTER_BOUND ( 'NONE', #65, .T. ) ;
#270 = FACE_OUTER_BOUND ( 'NONE', #35, .T. ) ;
#271 = SECURITY_CLASSIFICATION ( '', '', #662 ) ;
#272 = EDGE_CURVE ( 'NONE', #274, #260, #182, .T. ) ;
#273 = ORIENTED_EDGE ( 'NONE', *, *, #376, .F. ) ;
#274 = VERTEX_POINT ( 'NONE', #453 ) ;
#275 = VECTOR ( 'NONE', #559, 1000.000000000000000 ) ;
#276 = FACE_OUTER_BOUND ( 'NONE', #557, .T. ) ;
#277 = CARTESIAN_POINT ( 'NONE',  ( -40.50000000000000000, 40.49999999999998579, 0.000000000000000000 ) ) ;
#278 = AXIS2_PLACEMENT_3D ( 'NONE', #252, #313, #651 ) ;
#279 = CARTESIAN_POINT ( 'NONE',  ( -37.50000000000000000, 95.00000000000000000, 0.000000000000000000 ) ) ;
#280 = APPROVAL_DATE_TIME ( #203, #509 ) ;
#281 = DIRECTION ( 'NONE',  ( -1.000000000000000000, -1.224646799147352961E-16, 0.000000000000000000 ) ) ;
#282 = AXIS2_PLACEMENT_3D ( 'NONE', #660, #718, #202 ) ;
#283 = ORIENTED_EDGE ( 'NONE', *, *, #386, .F. ) ;
#284 = EDGE_CURVE ( 'NONE', #30, #10, #429, .T. ) ;
#285 = ORIENTED_EDGE ( 'NONE', *, *, #132, .T. ) ;
#286 = ORIENTED_EDGE ( 'NONE', *, *, #539, .T. ) ;
#287 = CARTESIAN_POINT ( 'NONE',  ( -9.500000000000001776, 40.49999999999999289, 3.000000000000000000 ) ) ;
#288 = VERTEX_POINT ( 'NONE', #554 ) ;
#289 = VECTOR ( 'NONE', #169, 1000.000000000000000 ) ;
#290 = FACE_OUTER_BOUND ( 'NONE', #515, .T. ) ;
#291 = DIRECTION ( 'NONE',  ( 0.000000000000000000, 0.000000000000000000, 1.000000000000000000 ) ) ;
#292 = EDGE_CURVE ( 'NONE', #10, #665, #15, .T. ) ;
#293 = CARTESIAN_POINT ( 'NONE',  ( -50.00000000000000000, 105.0000000000000000, 3.000000000000000000 ) ) ;
#294 = DATE_AND_TIME ( #154, #451 ) ;
#295 = CARTESIAN_POINT ( 'NONE',  ( -7.500000000000000000, 95.00000000000000000, 3.000000000000000000 ) ) ;
#296 = ORIENTED_EDGE ( 'NONE', *, *, #147, .T. ) ;
#297 = EDGE_LOOP ( 'NONE', ( #490, #426, #268, #612 ) ) ;
#298 = EDGE_LOOP ( 'NONE', ( #285, #308 ) ) ;
#299 = VECTOR ( 'NONE', #401, 1000.000000000000000 ) ;
#300 = DIRECTION ( 'NONE',  ( 1.000000000000000000, 0.000000000000000000, 0.000000000000000000 ) ) ;
#301 = CARTESIAN_POINT ( 'NONE',  ( -40.00000000000000000, 95.00000000000000000, 3.000000000000000000 ) ) ;
#302 = CC_DESIGN_SECURITY_CLASSIFICATION ( #271, ( #433 ) ) ;
#303 = EDGE_CURVE ( 'NONE', #195, #481, #466, .T. ) ;
#304 = APPROVAL_DATE_TIME ( #62, #109 ) ;
#305 = CARTESIAN_POINT ( 'NONE',  ( -9.500000000000001776, 40.49999999999999289, 0.000000000000000000 ) ) ;
#306 = ORIENTED_EDGE ( 'NONE', *, *, #89, .F. ) ;
#307 = CYLINDRICAL_SURFACE ( 'NONE', #687, 1.500000000000001332 ) ;
#308 = ORIENTED_EDGE ( 'NONE', *, *, #335, .T. ) ;
#309 = FACE_OUTER_BOUND ( 'NONE', #243, .T. ) ;
#310 = VECTOR ( 'NONE', #487, 1000.000000000000000 ) ;
#311 = PLANE ( 'NONE',  #555 ) ;
#312 = DIRECTION ( 'NONE',  ( -0.000000000000000000, -0.000000000000000000, -1.000000000000000000 ) ) ;
#313 = DIRECTION ( 'NONE',  ( -0.000000000000000000, -0.000000000000000000, -1.000000000000000000 ) ) ;
#314 = LOCAL_TIME ( 18, 44, 55.00000000000000000, #42 ) ;
#315 = EDGE_CURVE ( 'NONE', #274, #258, #236, .T. ) ;
#316 = ORIENTED_EDGE ( 'NONE', *, *, #347, .F. ) ;
#317 = ORIENTED_EDGE ( 'NONE', *, *, #582, .T. ) ;
#318 = APPLICATION_CONTEXT ( 'configuration controlled 3d designs of mechanical parts and assemblies' ) ;
#319 = ORIENTED_EDGE ( 'NONE', *, *, #272, .F. ) ;
#320 = ORGANIZATION ( 'UNSPECIFIED', 'UNSPECIFIED', '' ) ;
#321 = EDGE_CURVE ( 'NONE', #589, #481, #79, .T. ) ;
#322 = DATE_TIME_ROLE ( 'classification_date' ) ;
#323 = AXIS2_PLACEMENT_3D ( 'NONE', #513, #680, #231 ) ;
#324 = COORDINATED_UNIVERSAL_TIME_OFFSET ( 1, 0, .AHEAD. ) ;
#325 = DIRECTION ( 'NONE',  ( 0.000000000000000000, 0.000000000000000000, 1.000000000000000000 ) ) ;
#326 = CARTESIAN_POINT ( 'NONE',  ( -25.00000000000000000, 24.99999999999998934, 3.000000000000000000 ) ) ;
#327 = ORIENTED_EDGE ( 'NONE', *, *, #176, .T. ) ;
#328 = ORIENTED_EDGE ( 'NONE', *, *, #386, .T. ) ;
#329 = CARTESIAN_POINT ( 'NONE',  ( 0.000000000000000000, 105.0000000000000000, 3.000000000000000000 ) ) ;
#330 = ADVANCED_FACE ( 'NONE', ( #22 ), #67, .F. ) ;
#331 = VECTOR ( 'NONE', #672, 1000.000000000000000 ) ;
#332 = DIRECTION ( 'NONE',  ( -0.000000000000000000, -0.000000000000000000, -1.000000000000000000 ) ) ;
#333 = ADVANCED_FACE ( 'NONE', ( #309 ), #106, .F. ) ;
#334 =( GEOMETRIC_REPRESENTATION_CONTEXT ( 3 ) GLOBAL_UNCERTAINTY_ASSIGNED_CONTEXT ( ( #343 ) ) GLOBAL_UNIT_ASSIGNED_CONTEXT ( ( #257, #493, #668 ) ) REPRESENTATION_CONTEXT ( 'NONE', 'WORKASPACE' ) );
#335 = EDGE_CURVE ( 'NONE', #31, #442, #245, .T. ) ;
#336 = CARTESIAN_POINT ( 'NONE',  ( -42.50000000000000000, 95.00000000000000000, 3.000000000000000000 ) ) ;
#337 = EDGE_LOOP ( 'NONE', ( #600, #512, #306, #116 ) ) ;
#338 = ORIENTED_EDGE ( 'NONE', *, *, #626, .F. ) ;
#339 = CARTESIAN_POINT ( 'NONE',  ( -25.00000000000000000, 24.99999999999998934, 0.000000000000000000 ) ) ;
#340 = AXIS2_PLACEMENT_3D ( 'NONE', #287, #624, #749 ) ;
#341 = CIRCLE ( 'NONE', #534, 2.500000000000000444 ) ;
#342 = VECTOR ( 'NONE', #469, 1000.000000000000000 ) ;
#343 = UNCERTAINTY_MEASURE_WITH_UNIT (LENGTH_MEASURE( 1.000000000000000082E-05 ), #257, 'distance_accuracy_value', 'NONE');
#344 = PERSON ( 'UNSPECIFIED', 'UNSPECIFIED', 'UNSPECIFIED', ('UNSPECIFIED'), ('UNSPECIFIED'), ('UNSPECIFIED') ) ;
#345 = ADVANCED_FACE ( 'NONE', ( #269 ), #403, .F. ) ;
#346 = PRODUCT_RELATED_PRODUCT_CATEGORY ( 'detail', '', ( #685 ) ) ;
#347 = EDGE_CURVE ( 'NONE', #601, #76, #456, .T. ) ;
#348 = CARTESIAN_POINT ( 'NONE',  ( -12.50000000000000000, 95.00000000000000000, 3.000000000000000000 ) ) ;
#349 = EDGE_LOOP ( 'NONE', ( #180, #427, #328, #591 ) ) ;
#350 = EDGE_LOOP ( 'NONE', ( #391, #547 ) ) ;
#351 = LINE ( 'NONE', #70, #447 ) ;
#352 = CARTESIAN_POINT ( 'NONE',  ( 0.000000000000000000, 0.000000000000000000, 0.000000000000000000 ) ) ;
#353 = AXIS2_PLACEMENT_3D ( 'NONE', #682, #511, #744 ) ;
#354 = DIRECTION ( 'NONE',  ( -1.000000000000000000, 0.000000000000000000, 0.000000000000000000 ) ) ;
#355 = CARTESIAN_POINT ( 'NONE',  ( -39.00000000000000000, 40.49999999999998579, 3.000000000000000000 ) ) ;
#356 = ORIENTED_EDGE ( 'NONE', *, *, #576, .T. ) ;
#357 = ORIENTED_EDGE ( 'NONE', *, *, #83, .F. ) ;
#358 = CIRCLE ( 'NONE', #26, 1.500000000000001332 ) ;
#359 = FACE_OUTER_BOUND ( 'NONE', #259, .T. ) ;
#360 = DIRECTION ( 'NONE',  ( -1.000000000000000000, 0.000000000000000000, 0.000000000000000000 ) ) ;
#361 = CC_DESIGN_PERSON_AND_ORGANIZATION_ASSIGNMENT ( #649, #725, ( #685 ) ) ;
#362 = AXIS2_PLACEMENT_3D ( 'NONE', #652, #312, #370 ) ;
#363 = AXIS2_PLACEMENT_3D ( 'NONE', #463, #508, #105 ) ;
#364 = DIRECTION ( 'NONE',  ( -1.000000000000000000, 0.000000000000000000, 0.000000000000000000 ) ) ;
#365 = VERTEX_POINT ( 'NONE', #632 ) ;
#366 = DIRECTION ( 'NONE',  ( -0.000000000000000000, -0.000000000000000000, -1.000000000000000000 ) ) ;
#367 = ORIENTED_EDGE ( 'NONE', *, *, #303, .T. ) ;
#368 = CIRCLE ( 'NONE', #187, 1.500000000000001332 ) ;
#369 = CARTESIAN_POINT ( 'NONE',  ( -40.50000000000000000, 9.499999999999994671, 3.000000000000000000 ) ) ;
#370 = DIRECTION ( 'NONE',  ( -1.000000000000000000, 0.000000000000000000, 0.000000000000000000 ) ) ;
#371 = CARTESIAN_POINT ( 'NONE',  ( -7.500000000000000000, 95.00000000000000000, 0.000000000000000000 ) ) ;
#372 = CARTESIAN_POINT ( 'NONE',  ( -11.00000000000000355, 40.49999999999999289, 3.000000000000000000 ) ) ;
#373 = AXIS2_PLACEMENT_3D ( 'NONE', #608, #82, #542 ) ;
#374 = ORIENTED_EDGE ( 'NONE', *, *, #648, .F. ) ;
#375 = DIRECTION ( 'NONE',  ( 1.000000000000000000, 0.000000000000000000, 0.000000000000000000 ) ) ;
#376 = EDGE_CURVE ( 'NONE', #590, #455, #581, .T. ) ;
#377 = ORIENTED_EDGE ( 'NONE', *, *, #118, .F. ) ;
#378 = EDGE_LOOP ( 'NONE', ( #374, #408 ) ) ;
#379 = FACE_BOUND ( 'NONE', #126, .T. ) ;
#380 = DIRECTION ( 'NONE',  ( 1.000000000000000000, 0.000000000000000000, 0.000000000000000000 ) ) ;
#381 = AXIS2_PLACEMENT_3D ( 'NONE', #183, #697, #360 ) ;
#382 = MECHANICAL_CONTEXT ( 'NONE', #318, 'mechanical' ) ;
#383 = VERTEX_POINT ( 'NONE', #279 ) ;
#384 = ORIENTED_EDGE ( 'NONE', *, *, #563, .F. ) ;
#385 = APPROVAL_ROLE ( '' ) ;
#386 = EDGE_CURVE ( 'NONE', #288, #365, #438, .T. ) ;
#387 = VECTOR ( 'NONE', #519, 1000.000000000000000 ) ;
#388 = CARTESIAN_POINT ( 'NONE',  ( -10.00000000000000000, 95.00000000000000000, 3.000000000000000000 ) ) ;
#389 = ORIENTED_EDGE ( 'NONE', *, *, #83, .T. ) ;
#390 = DIRECTION ( 'NONE',  ( 0.000000000000000000, 0.000000000000000000, 1.000000000000000000 ) ) ;
#391 = ORIENTED_EDGE ( 'NONE', *, *, #436, .T. ) ;
#392 = VECTOR ( 'NONE', #484, 1000.000000000000000 ) ;
#393 = FACE_BOUND ( 'NONE', #710, .T. ) ;
#394 = CARTESIAN_POINT ( 'NONE',  ( -40.00000000000000000, 95.00000000000000000, 0.000000000000000000 ) ) ;
#395 = DIRECTION ( 'NONE',  ( 1.000000000000000000, 0.000000000000000000, 0.000000000000000000 ) ) ;
#396 = ADVANCED_FACE ( 'NONE', ( #741 ), #113, .F. ) ;
#397 = CALENDAR_DATE ( 2021, 3, 2 ) ;
#398 = EDGE_CURVE ( 'NONE', #665, #455, #560, .T. ) ;
#399 = DIRECTION ( 'NONE',  ( -1.000000000000000000, 0.000000000000000000, 0.000000000000000000 ) ) ;
#400 = ORIENTED_EDGE ( 'NONE', *, *, #264, .T. ) ;
#401 = DIRECTION ( 'NONE',  ( -0.000000000000000000, -0.000000000000000000, -1.000000000000000000 ) ) ;
#402 = ORIENTED_EDGE ( 'NONE', *, *, #743, .T. ) ;
#403 = CYLINDRICAL_SURFACE ( 'NONE', #424, 1.500000000000001332 ) ;
#404 = CARTESIAN_POINT ( 'NONE',  ( 0.000000000000000000, 0.000000000000000000, 3.000000000000000000 ) ) ;
#405 = COORDINATED_UNIVERSAL_TIME_OFFSET ( 1, 0, .AHEAD. ) ;
#406 = CARTESIAN_POINT ( 'NONE',  ( -50.00000000000000000, 105.0000000000000000, 3.000000000000000000 ) ) ;
#407 = ORIENTED_EDGE ( 'NONE', *, *, #284, .T. ) ;
#408 = ORIENTED_EDGE ( 'NONE', *, *, #523, .F. ) ;
#409 = CYLINDRICAL_SURFACE ( 'NONE', #496, 2.500000000000000444 ) ;
#410 = DIRECTION ( 'NONE',  ( 1.000000000000000000, 0.000000000000000000, 0.000000000000000000 ) ) ;
#411 = EDGE_CURVE ( 'NONE', #365, #567, #723, .T. ) ;
#412 = DIRECTION ( 'NONE',  ( 1.000000000000000000, 0.000000000000000000, 0.000000000000000000 ) ) ;
#413 = AXIS2_PLACEMENT_3D ( 'NONE', #691, #638, #354 ) ;
#414 = DIRECTION ( 'NONE',  ( -0.000000000000000000, -0.000000000000000000, -1.000000000000000000 ) ) ;
#415 = EDGE_LOOP ( 'NONE', ( #174, #569 ) ) ;
#416 = EDGE_LOOP ( 'NONE', ( #683, #610, #452, #181 ) ) ;
#417 = VECTOR ( 'NONE', #47, 1000.000000000000000 ) ;
#418 = FACE_OUTER_BOUND ( 'NONE', #219, .T. ) ;
#419 = DIRECTION ( 'NONE',  ( -0.000000000000000000, -0.000000000000000000, -1.000000000000000000 ) ) ;
#420 = CARTESIAN_POINT ( 'NONE',  ( -50.00000000000000000, 105.0000000000000000, 0.000000000000000000 ) ) ;
#421 = EDGE_CURVE ( 'NONE', #558, #258, #543, .T. ) ;
#422 = COORDINATED_UNIVERSAL_TIME_OFFSET ( 1, 0, .AHEAD. ) ;
#423 = CARTESIAN_POINT ( 'NONE',  ( -42.00000000000000000, 9.499999999999994671, 3.000000000000000000 ) ) ;
#424 = AXIS2_PLACEMENT_3D ( 'NONE', #740, #41, #399 ) ;
#425 = DIRECTION ( 'NONE',  ( 1.000000000000000000, 0.000000000000000000, -0.000000000000000000 ) ) ;
#426 = ORIENTED_EDGE ( 'NONE', *, *, #663, .T. ) ;
#427 = ORIENTED_EDGE ( 'NONE', *, *, #123, .T. ) ;
#428 = DIRECTION ( 'NONE',  ( 0.000000000000000000, 0.000000000000000000, 1.000000000000000000 ) ) ;
#429 = LINE ( 'NONE', #52, #387 ) ;
#430 = CARTESIAN_POINT ( 'NONE',  ( -10.00000000000000000, 95.00000000000000000, 3.000000000000000000 ) ) ;
#431 = FACE_BOUND ( 'NONE', #378, .T. ) ;
#432 = CARTESIAN_POINT ( 'NONE',  ( -25.00000000000000000, 24.99999999999998934, 3.000000000000000000 ) ) ;
#433 = PRODUCT_DEFINITION_FORMATION_WITH_SPECIFIED_SOURCE ( 'ANY', '', #685, .NOT_KNOWN. ) ;
#434 = CARTESIAN_POINT ( 'NONE',  ( -9.500000000000001776, 9.499999999999994671, 3.000000000000000000 ) ) ;
#435 = ORIENTED_EDGE ( 'NONE', *, *, #582, .F. ) ;
#436 = EDGE_CURVE ( 'NONE', #481, #589, #110, .T. ) ;
#437 = ORIENTED_EDGE ( 'NONE', *, *, #50, .F. ) ;
#438 = LINE ( 'NONE', #348, #299 ) ;
#439 = CIRCLE ( 'NONE', #454, 1.500000000000001332 ) ;
#440 = DIRECTION ( 'NONE',  ( -1.000000000000000000, 0.000000000000000000, 0.000000000000000000 ) ) ;
#441 = CARTESIAN_POINT ( 'NONE',  ( -39.00000000000000000, 9.499999999999994671, 3.000000000000000000 ) ) ;
#442 = VERTEX_POINT ( 'NONE', #458 ) ;
#443 = ORIENTED_EDGE ( 'NONE', *, *, #179, .F. ) ;
#444 = EDGE_LOOP ( 'NONE', ( #745, #286, #528, #125 ) ) ;
#445 = VERTEX_POINT ( 'NONE', #129 ) ;
#446 = CARTESIAN_POINT ( 'NONE',  ( -11.00000000000000355, 9.499999999999994671, 0.000000000000000000 ) ) ;
#447 = VECTOR ( 'NONE', #11, 1000.000000000000000 ) ;
#448 = CYLINDRICAL_SURFACE ( 'NONE', #502, 1.500000000000001332 ) ;
#449 = PLANE ( 'NONE',  #226 ) ;
#450 = EDGE_CURVE ( 'NONE', #480, #567, #261, .T. ) ;
#451 = LOCAL_TIME ( 18, 44, 55.00000000000000000, #324 ) ;
#452 = ORIENTED_EDGE ( 'NONE', *, *, #50, .T. ) ;
#453 = CARTESIAN_POINT ( 'NONE',  ( -11.00000000000000355, 9.499999999999994671, 3.000000000000000000 ) ) ;
#454 = AXIS2_PLACEMENT_3D ( 'NONE', #249, #64, #380 ) ;
#455 = VERTEX_POINT ( 'NONE', #468 ) ;
#456 = LINE ( 'NONE', #406, #128 ) ;
#457 = CYLINDRICAL_SURFACE ( 'NONE', #580, 15.50000000000000711 ) ;
#458 = CARTESIAN_POINT ( 'NONE',  ( -11.00000000000000355, 40.49999999999999289, 0.000000000000000000 ) ) ;
#459 = CALENDAR_DATE ( 2021, 3, 2 ) ;
#460 = AXIS2_PLACEMENT_3D ( 'NONE', #100, #670, #550 ) ;
#461 = ORIENTED_EDGE ( 'NONE', *, *, #176, .F. ) ;
#462 = ORIENTED_EDGE ( 'NONE', *, *, #118, .T. ) ;
#463 = CARTESIAN_POINT ( 'NONE',  ( -9.500000000000001776, 9.499999999999994671, 3.000000000000000000 ) ) ;
#464 = ORIENTED_EDGE ( 'NONE', *, *, #12, .T. ) ;
#465 = AXIS2_PLACEMENT_3D ( 'NONE', #5, #184, #412 ) ;
#466 = LINE ( 'NONE', #518, #289 ) ;
#467 = LINE ( 'NONE', #707, #310 ) ;
#468 = CARTESIAN_POINT ( 'NONE',  ( 0.000000000000000000, 105.0000000000000000, 0.000000000000000000 ) ) ;
#469 = DIRECTION ( 'NONE',  ( -0.000000000000000000, -0.000000000000000000, -1.000000000000000000 ) ) ;
#470 = ORIENTED_EDGE ( 'NONE', *, *, #303, .F. ) ;
#471 = ORIENTED_EDGE ( 'NONE', *, *, #284, .F. ) ;
#472 = VECTOR ( 'NONE', #618, 1000.000000000000000 ) ;
#473 = CC_DESIGN_PERSON_AND_ORGANIZATION_ASSIGNMENT ( #545, #495, ( #271 ) ) ;
#474 = FACE_BOUND ( 'NONE', #708, .T. ) ;
#475 = CARTESIAN_POINT ( 'NONE',  ( 0.000000000000000000, 0.000000000000000000, 3.000000000000000000 ) ) ;
#476 = EDGE_CURVE ( 'NONE', #127, #44, #152, .T. ) ;
#477 = CARTESIAN_POINT ( 'NONE',  ( -9.500000000000001776, 9.499999999999994671, 0.000000000000000000 ) ) ;
#478 = CARTESIAN_POINT ( 'NONE',  ( -25.00000000000000000, 24.99999999999998934, 0.000000000000000000 ) ) ;
#479 = DIRECTION ( 'NONE',  ( 0.000000000000000000, 0.000000000000000000, 1.000000000000000000 ) ) ;
#480 = VERTEX_POINT ( 'NONE', #238 ) ;
#481 = VERTEX_POINT ( 'NONE', #695 ) ;
#482 = FACE_BOUND ( 'NONE', #87, .T. ) ;
#483 = CARTESIAN_POINT ( 'NONE',  ( 0.000000000000000000, 105.0000000000000000, 3.000000000000000000 ) ) ;
#484 = DIRECTION ( 'NONE',  ( -0.000000000000000000, -1.000000000000000000, -0.000000000000000000 ) ) ;
#485 = CARTESIAN_POINT ( 'NONE',  ( 0.000000000000000000, 105.0000000000000000, 3.000000000000000000 ) ) ;
#486 = DIRECTION ( 'NONE',  ( 1.000000000000000000, 0.000000000000000000, 0.000000000000000000 ) ) ;
#487 = DIRECTION ( 'NONE',  ( -0.000000000000000000, -0.000000000000000000, -1.000000000000000000 ) ) ;
#488 = AXIS2_PLACEMENT_3D ( 'NONE', #525, #121, #575 ) ;
#489 = ORIENTED_EDGE ( 'NONE', *, *, #111, .T. ) ;
#490 = ORIENTED_EDGE ( 'NONE', *, *, #551, .F. ) ;
#491 = VECTOR ( 'NONE', #332, 1000.000000000000000 ) ;
#492 = CYLINDRICAL_SURFACE ( 'NONE', #413, 2.500000000000002220 ) ;
#493 =( NAMED_UNIT ( * ) PLANE_ANGLE_UNIT ( ) SI_UNIT ( $, .RADIAN. ) );
#494 = DIRECTION ( 'NONE',  ( 1.000000000000000000, 0.000000000000000000, 0.000000000000000000 ) ) ;
#495 = PERSON_AND_ORGANIZATION_ROLE ( 'classification_officer' ) ;
#496 = AXIS2_PLACEMENT_3D ( 'NONE', #430, #588, #586 ) ;
#497 = EDGE_LOOP ( 'NONE', ( #614, #316, #435, #628 ) ) ;
#498 = CARTESIAN_POINT ( 'NONE',  ( -39.00000000000000000, 9.499999999999994671, 0.000000000000000000 ) ) ;
#499 = FACE_BOUND ( 'NONE', #719, .T. ) ;
#500 = CARTESIAN_POINT ( 'NONE',  ( -11.00000000000000355, 9.499999999999994671, 3.000000000000000000 ) ) ;
#501 = ADVANCED_FACE ( 'NONE', ( #276 ), #578, .F. ) ;
#502 = AXIS2_PLACEMENT_3D ( 'NONE', #702, #55, #364 ) ;
#503 = CARTESIAN_POINT ( 'NONE',  ( -8.000000000000000000, 9.499999999999994671, 3.000000000000000000 ) ) ;
#504 = LINE ( 'NONE', #423, #3 ) ;
#505 = ORIENTED_EDGE ( 'NONE', *, *, #347, .T. ) ;
#506 = ORIENTED_EDGE ( 'NONE', *, *, #18, .F. ) ;
#507 = LINE ( 'NONE', #485, #561 ) ;
#508 = DIRECTION ( 'NONE',  ( 0.000000000000000000, 0.000000000000000000, 1.000000000000000000 ) ) ;
#509 = APPROVAL ( #265, 'UNSPECIFIED' ) ;
#510 = EDGE_CURVE ( 'NONE', #188, #537, #91, .T. ) ;
#511 = DIRECTION ( 'NONE',  ( 0.000000000000000000, 0.000000000000000000, 1.000000000000000000 ) ) ;
#512 = ORIENTED_EDGE ( 'NONE', *, *, #292, .F. ) ;
#513 = CARTESIAN_POINT ( 'NONE',  ( 0.000000000000000000, 0.000000000000000000, 3.000000000000000000 ) ) ;
#514 = ORIENTED_EDGE ( 'NONE', *, *, #321, .F. ) ;
#515 = EDGE_LOOP ( 'NONE', ( #210, #402, #28, #437 ) ) ;
#516 = ADVANCED_FACE ( 'NONE', ( #290 ), #246, .F. ) ;
#517 = VECTOR ( 'NONE', #654, 1000.000000000000000 ) ;
#518 = CARTESIAN_POINT ( 'NONE',  ( -42.00000000000000000, 40.49999999999998579, 3.000000000000000000 ) ) ;
#519 = DIRECTION ( 'NONE',  ( -0.000000000000000000, -0.000000000000000000, -1.000000000000000000 ) ) ;
#520 = DIRECTION ( 'NONE',  ( 1.000000000000000000, 0.000000000000000000, 0.000000000000000000 ) ) ;
#521 = CARTESIAN_POINT ( 'NONE',  ( -50.00000000000000000, -6.123233995736764507E-15, 0.000000000000000000 ) ) ;
#522 = ORIENTED_EDGE ( 'NONE', *, *, #576, .F. ) ;
#523 = EDGE_CURVE ( 'NONE', #732, #629, #595, .T. ) ;
#524 = LINE ( 'NONE', #583, #199 ) ;
#525 = CARTESIAN_POINT ( 'NONE',  ( -40.50000000000000000, 40.49999999999998579, 3.000000000000000000 ) ) ;
#526 = AXIS2_PLACEMENT_3D ( 'NONE', #585, #19, #148 ) ;
#527 = ORIENTED_EDGE ( 'NONE', *, *, #436, .F. ) ;
#528 = ORIENTED_EDGE ( 'NONE', *, *, #234, .F. ) ;
#529 = DIRECTION ( 'NONE',  ( -0.000000000000000000, -0.000000000000000000, -1.000000000000000000 ) ) ;
#530 = AXIS2_PLACEMENT_3D ( 'NONE', #434, #325, #494 ) ;
#531 = CIRCLE ( 'NONE', #460, 2.500000000000002220 ) ;
#532 = CARTESIAN_POINT ( 'NONE',  ( -25.00000000000000000, 24.99999999999998934, 3.000000000000000000 ) ) ;
#533 = PERSON_AND_ORGANIZATION ( #344, #320 ) ;
#534 = AXIS2_PLACEMENT_3D ( 'NONE', #388, #166, #164 ) ;
#535 = DIRECTION ( 'NONE',  ( 1.000000000000000000, 0.000000000000000000, 0.000000000000000000 ) ) ;
#536 = CARTESIAN_POINT ( 'NONE',  ( -10.00000000000000000, 95.00000000000000000, 3.000000000000000000 ) ) ;
#537 = VERTEX_POINT ( 'NONE', #122 ) ;
#538 = CARTESIAN_POINT ( 'NONE',  ( -39.00000000000000000, 9.499999999999994671, 3.000000000000000000 ) ) ;
#539 = EDGE_CURVE ( 'NONE', #636, #383, #524, .T. ) ;
#540 = EDGE_LOOP ( 'NONE', ( #357, #190, #729, #232 ) ) ;
#541 = ADVANCED_BREP_SHAPE_REPRESENTATION ( 'Motoraufhalterung x-y Koord', ( #92, #373 ), #334 ) ;
#542 = DIRECTION ( 'NONE',  ( 1.000000000000000000, 0.000000000000000000, 0.000000000000000000 ) ) ;
#543 = CIRCLE ( 'NONE', #736, 1.500000000000001332 ) ;
#544 = CARTESIAN_POINT ( 'NONE',  ( -9.500000000000001776, 40.49999999999999289, 3.000000000000000000 ) ) ;
#545 = PERSON_AND_ORGANIZATION ( #344, #320 ) ;
#546 = ADVANCED_FACE ( 'NONE', ( #603 ), #686, .F. ) ;
#547 = ORIENTED_EDGE ( 'NONE', *, *, #321, .T. ) ;
#548 = ADVANCED_FACE ( 'NONE', ( #703 ), #448, .F. ) ;
#549 = FACE_OUTER_BOUND ( 'NONE', #349, .T. ) ;
#550 = DIRECTION ( 'NONE',  ( 1.000000000000000000, 0.000000000000000000, 0.000000000000000000 ) ) ;
#551 = EDGE_CURVE ( 'NONE', #633, #57, #39, .T. ) ;
#552 = ADVANCED_FACE ( 'NONE', ( #263 ), #492, .F. ) ;
#553 = DIRECTION ( 'NONE',  ( 1.000000000000000000, 0.000000000000000000, 0.000000000000000000 ) ) ;
#554 = CARTESIAN_POINT ( 'NONE',  ( -12.50000000000000000, 95.00000000000000000, 3.000000000000000000 ) ) ;
#555 = AXIS2_PLACEMENT_3D ( 'NONE', #145, #9, #425 ) ;
#556 = EDGE_LOOP ( 'NONE', ( #384, #377 ) ) ;
#557 = EDGE_LOOP ( 'NONE', ( #117, #471, #66, #505 ) ) ;
#558 = VERTEX_POINT ( 'NONE', #237 ) ;
#559 = DIRECTION ( 'NONE',  ( -0.000000000000000000, -0.000000000000000000, -1.000000000000000000 ) ) ;
#560 = LINE ( 'NONE', #352, #417 ) ;
#561 = VECTOR ( 'NONE', #650, 1000.000000000000000 ) ;
#562 = DIRECTION ( 'NONE',  ( -1.224646799147352961E-16, 1.000000000000000000, 0.000000000000000000 ) ) ;
#563 = EDGE_CURVE ( 'NONE', #445, #636, #144, .T. ) ;
#564 = ORIENTED_EDGE ( 'NONE', *, *, #264, .F. ) ;
#565 = CARTESIAN_POINT ( 'NONE',  ( 0.000000000000000000, 0.000000000000000000, 0.000000000000000000 ) ) ;
#566 = AXIS2_PLACEMENT_3D ( 'NONE', #713, #653, #535 ) ;
#567 = VERTEX_POINT ( 'NONE', #371 ) ;
#568 = VERTEX_POINT ( 'NONE', #1 ) ;
#569 = ORIENTED_EDGE ( 'NONE', *, *, #38, .T. ) ;
#570 = DESIGN_CONTEXT ( 'detailed design', #604, 'design' ) ;
#571 = FACE_BOUND ( 'NONE', #208, .T. ) ;
#572 = CARTESIAN_POINT ( 'NONE',  ( -40.50000000000000000, 40.49999999999998579, 0.000000000000000000 ) ) ;
#573 = VECTOR ( 'NONE', #6, 1000.000000000000000 ) ;
#574 = CARTESIAN_POINT ( 'NONE',  ( -9.499999999999996447, 24.99999999999999289, 3.000000000000000000 ) ) ;
#575 = DIRECTION ( 'NONE',  ( 1.000000000000000000, 0.000000000000000000, 0.000000000000000000 ) ) ;
#576 = EDGE_CURVE ( 'NONE', #90, #158, #439, .T. ) ;
#577 = CYLINDRICAL_SURFACE ( 'NONE', #362, 1.500000000000001332 ) ;
#578 = PLANE ( 'NONE',  #204 ) ;
#579 = ORIENTED_EDGE ( 'NONE', *, *, #476, .F. ) ;
#580 = AXIS2_PLACEMENT_3D ( 'NONE', #432, #529, #247 ) ;
#581 = LINE ( 'NONE', #688, #275 ) ;
#582 = EDGE_CURVE ( 'NONE', #590, #601, #507, .T. ) ;
#583 = CARTESIAN_POINT ( 'NONE',  ( -37.50000000000000000, 95.00000000000000000, 3.000000000000000000 ) ) ;
#584 = DIRECTION ( 'NONE',  ( 0.000000000000000000, 0.000000000000000000, 1.000000000000000000 ) ) ;
#585 = CARTESIAN_POINT ( 'NONE',  ( -25.00000000000000000, 24.99999999999998934, 3.000000000000000000 ) ) ;
#586 = DIRECTION ( 'NONE',  ( -1.000000000000000000, 0.000000000000000000, 0.000000000000000000 ) ) ;
#587 = CARTESIAN_POINT ( 'NONE',  ( -37.50000000000000000, 95.00000000000000000, 3.000000000000000000 ) ) ;
#588 = DIRECTION ( 'NONE',  ( -0.000000000000000000, -0.000000000000000000, -1.000000000000000000 ) ) ;
#589 = VERTEX_POINT ( 'NONE', #644 ) ;
#590 = VERTEX_POINT ( 'NONE', #483 ) ;
#591 = ORIENTED_EDGE ( 'NONE', *, *, #38, .F. ) ;
#592 = DIRECTION ( 'NONE',  ( 0.000000000000000000, 0.000000000000000000, 1.000000000000000000 ) ) ;
#593 = FACE_OUTER_BOUND ( 'NONE', #497, .T. ) ;
#594 = CARTESIAN_POINT ( 'NONE',  ( -40.50000000000000000, 40.49999999999998579, 3.000000000000000000 ) ) ;
#595 = CIRCLE ( 'NONE', #465, 1.500000000000001332 ) ;
#596 = CARTESIAN_POINT ( 'NONE',  ( -10.00000000000000000, 95.00000000000000000, 0.000000000000000000 ) ) ;
#597 = PERSON_AND_ORGANIZATION ( #344, #320 ) ;
#598 = EDGE_CURVE ( 'NONE', #44, #57, #724, .T. ) ;
#599 = DATE_TIME_ROLE ( 'creation_date' ) ;
#600 = ORIENTED_EDGE ( 'NONE', *, *, #398, .F. ) ;
#601 = VERTEX_POINT ( 'NONE', #293 ) ;
#602 = VECTOR ( 'NONE', #194, 1000.000000000000000 ) ;
#603 = FACE_OUTER_BOUND ( 'NONE', #444, .T. ) ;
#604 = APPLICATION_CONTEXT ( 'configuration controlled 3d designs of mechanical parts and assemblies' ) ;
#605 = APPROVAL_STATUS ( 'not_yet_approved' ) ;
#606 = PERSON_AND_ORGANIZATION ( #344, #320 ) ;
#607 = AXIS2_PLACEMENT_3D ( 'NONE', #326, #86, #150 ) ;
#608 = CARTESIAN_POINT ( 'NONE',  ( 0.000000000000000000, 0.000000000000000000, 0.000000000000000000 ) ) ;
#609 = EDGE_CURVE ( 'NONE', #258, #558, #616, .T. ) ;
#610 = ORIENTED_EDGE ( 'NONE', *, *, #523, .T. ) ;
#611 = FACE_OUTER_BOUND ( 'NONE', #107, .T. ) ;
#612 = ORIENTED_EDGE ( 'NONE', *, *, #254, .F. ) ;
#613 = APPLICATION_PROTOCOL_DEFINITION ( 'international standard', 'config_control_design', 1994, #318 ) ;
#614 = ORIENTED_EDGE ( 'NONE', *, *, #63, .T. ) ;
#615 = VECTOR ( 'NONE', #230, 1000.000000000000000 ) ;
#616 = CIRCLE ( 'NONE', #103, 1.500000000000001332 ) ;
#617 = DIRECTION ( 'NONE',  ( 0.000000000000000000, -1.000000000000000000, 0.000000000000000000 ) ) ;
#618 = DIRECTION ( 'NONE',  ( 0.000000000000000000, 1.000000000000000000, 0.000000000000000000 ) ) ;
#619 = ADVANCED_FACE ( 'NONE', ( #130, #393, #255, #270, #431, #379, #119, #474 ), #311, .T. ) ;
#620 = CARTESIAN_POINT ( 'NONE',  ( 0.000000000000000000, 0.000000000000000000, 0.000000000000000000 ) ) ;
#621 = ORIENTED_EDGE ( 'NONE', *, *, #239, .T. ) ;
#622 = CIRCLE ( 'NONE', #716, 2.500000000000002220 ) ;
#623 = ADVANCED_FACE ( 'NONE', ( #418 ), #750, .F. ) ;
#624 = DIRECTION ( 'NONE',  ( -0.000000000000000000, -0.000000000000000000, -1.000000000000000000 ) ) ;
#625 = AXIS2_PLACEMENT_3D ( 'NONE', #532, #14, #71 ) ;
#626 = EDGE_CURVE ( 'NONE', #127, #633, #61, .T. ) ;
#627 = ADVANCED_FACE ( 'NONE', ( #80 ), #457, .F. ) ;
#628 = ORIENTED_EDGE ( 'NONE', *, *, #376, .T. ) ;
#629 = VERTEX_POINT ( 'NONE', #77 ) ;
#630 = ORIENTED_EDGE ( 'NONE', *, *, #634, .F. ) ;
#631 = ORIENTED_EDGE ( 'NONE', *, *, #598, .F. ) ;
#632 = CARTESIAN_POINT ( 'NONE',  ( -12.50000000000000000, 95.00000000000000000, 0.000000000000000000 ) ) ;
#633 = VERTEX_POINT ( 'NONE', #73 ) ;
#634 = EDGE_CURVE ( 'NONE', #158, #31, #467, .T. ) ;
#635 = ORIENTED_EDGE ( 'NONE', *, *, #147, .F. ) ;
#636 = VERTEX_POINT ( 'NONE', #587 ) ;
#637 = VECTOR ( 'NONE', #266, 1000.000000000000000 ) ;
#638 = DIRECTION ( 'NONE',  ( -0.000000000000000000, -0.000000000000000000, -1.000000000000000000 ) ) ;
#639 = CIRCLE ( 'NONE', #282, 1.500000000000001332 ) ;
#640 = DIRECTION ( 'NONE',  ( 1.000000000000000000, 0.000000000000000000, 0.000000000000000000 ) ) ;
#641 = APPROVAL_DATE_TIME ( #294, #224 ) ;
#642 = CARTESIAN_POINT ( 'NONE',  ( -40.50000000000000711, 24.99999999999998934, 3.000000000000000000 ) ) ;
#643 = CARTESIAN_POINT ( 'NONE',  ( -40.00000000000000000, 95.00000000000000000, 3.000000000000000000 ) ) ;
#644 = CARTESIAN_POINT ( 'NONE',  ( -39.00000000000000000, 40.49999999999998579, 0.000000000000000000 ) ) ;
#645 = ORIENTED_EDGE ( 'NONE', *, *, #201, .T. ) ;
#646 = CARTESIAN_POINT ( 'NONE',  ( -42.50000000000000000, 95.00000000000000000, 0.000000000000000000 ) ) ;
#647 = ORIENTED_EDGE ( 'NONE', *, *, #539, .F. ) ;
#648 = EDGE_CURVE ( 'NONE', #629, #732, #677, .T. ) ;
#649 = PERSON_AND_ORGANIZATION ( #344, #320 ) ;
#650 = DIRECTION ( 'NONE',  ( -1.000000000000000000, 0.000000000000000000, 0.000000000000000000 ) ) ;
#651 = DIRECTION ( 'NONE',  ( -1.000000000000000000, 0.000000000000000000, 0.000000000000000000 ) ) ;
#652 = CARTESIAN_POINT ( 'NONE',  ( -40.50000000000000000, 9.499999999999994671, 3.000000000000000000 ) ) ;
#653 = DIRECTION ( 'NONE',  ( 0.000000000000000000, 0.000000000000000000, 1.000000000000000000 ) ) ;
#654 = DIRECTION ( 'NONE',  ( -0.000000000000000000, -0.000000000000000000, -1.000000000000000000 ) ) ;
#655 = LINE ( 'NONE', #355, #673 ) ;
#656 = ORIENTED_EDGE ( 'NONE', *, *, #272, .T. ) ;
#657 = CARTESIAN_POINT ( 'NONE',  ( -9.500000000000001776, 9.499999999999994671, 0.000000000000000000 ) ) ;
#658 = CIRCLE ( 'NONE', #95, 2.500000000000000444 ) ;
#659 = VECTOR ( 'NONE', #419, 1000.000000000000000 ) ;
#660 = CARTESIAN_POINT ( 'NONE',  ( -40.50000000000000000, 40.49999999999998579, 3.000000000000000000 ) ) ;
#661 = COORDINATED_UNIVERSAL_TIME_OFFSET ( 1, 0, .AHEAD. ) ;
#662 = SECURITY_CLASSIFICATION_LEVEL ( 'unclassified' ) ;
#663 = EDGE_CURVE ( 'NONE', #633, #127, #112, .T. ) ;
#664 = ORIENTED_EDGE ( 'NONE', *, *, #609, .F. ) ;
#665 = VERTEX_POINT ( 'NONE', #248 ) ;
#666 = ORIENTED_EDGE ( 'NONE', *, *, #626, .T. ) ;
#667 = FACE_BOUND ( 'NONE', #350, .T. ) ;
#668 =( NAMED_UNIT ( * ) SI_UNIT ( $, .STERADIAN. ) SOLID_ANGLE_UNIT ( ) );
#669 = DIRECTION ( 'NONE',  ( 1.000000000000000000, 0.000000000000000000, 0.000000000000000000 ) ) ;
#670 = DIRECTION ( 'NONE',  ( 0.000000000000000000, 0.000000000000000000, 1.000000000000000000 ) ) ;
#671 = PRODUCT_DEFINITION_SHAPE ( 'NONE', 'NONE',  #698 ) ;
#672 = DIRECTION ( 'NONE',  ( -0.000000000000000000, -0.000000000000000000, -1.000000000000000000 ) ) ;
#673 = VECTOR ( 'NONE', #690, 1000.000000000000000 ) ;
#674 = DIRECTION ( 'NONE',  ( 0.000000000000000000, -0.000000000000000000, -1.000000000000000000 ) ) ;
#675 = LINE ( 'NONE', #33, #637 ) ;
#676 = CC_DESIGN_PERSON_AND_ORGANIZATION_ASSIGNMENT ( #256, #25, ( #698 ) ) ;
#677 = CIRCLE ( 'NONE', #153, 1.500000000000001332 ) ;
#678 = AXIS2_PLACEMENT_3D ( 'NONE', #596, #479, #27 ) ;
#679 = CARTESIAN_POINT ( 'NONE',  ( -42.00000000000000000, 40.49999999999998579, 3.000000000000000000 ) ) ;
#680 = DIRECTION ( 'NONE',  ( -1.000000000000000000, 0.000000000000000000, 0.000000000000000000 ) ) ;
#681 = EDGE_LOOP ( 'NONE', ( #356, #88, #227, #747 ) ) ;
#682 = CARTESIAN_POINT ( 'NONE',  ( -9.500000000000001776, 40.49999999999999289, 0.000000000000000000 ) ) ;
#683 = ORIENTED_EDGE ( 'NONE', *, *, #743, .F. ) ;
#684 = ORIENTED_EDGE ( 'NONE', *, *, #292, .T. ) ;
#685 = PRODUCT ( 'Motoraufhalterung x-y Koord', 'Motoraufhalterung x-y Koord', '', ( #382 ) ) ;
#686 = CYLINDRICAL_SURFACE ( 'NONE', #20, 2.500000000000002220 ) ;
#687 = AXIS2_PLACEMENT_3D ( 'NONE', #594, #137, #440 ) ;
#688 = CARTESIAN_POINT ( 'NONE',  ( 0.000000000000000000, 105.0000000000000000, 3.000000000000000000 ) ) ;
#689 = CALENDAR_DATE ( 2021, 3, 2 ) ;
#690 = DIRECTION ( 'NONE',  ( -0.000000000000000000, -0.000000000000000000, -1.000000000000000000 ) ) ;
#691 = CARTESIAN_POINT ( 'NONE',  ( -40.00000000000000000, 95.00000000000000000, 3.000000000000000000 ) ) ;
#692 = ORIENTED_EDGE ( 'NONE', *, *, #551, .T. ) ;
#693 = LINE ( 'NONE', #97, #491 ) ;
#694 = CIRCLE ( 'NONE', #530, 1.500000000000001332 ) ;
#695 = CARTESIAN_POINT ( 'NONE',  ( -42.00000000000000000, 40.49999999999998579, 0.000000000000000000 ) ) ;
#696 = DIRECTION ( 'NONE',  ( 0.000000000000000000, 0.000000000000000000, -1.000000000000000000 ) ) ;
#697 = DIRECTION ( 'NONE',  ( -0.000000000000000000, -0.000000000000000000, -1.000000000000000000 ) ) ;
#698 = PRODUCT_DEFINITION ( 'UNKNOWN', '', #433, #570 ) ;
#699 = EDGE_CURVE ( 'NONE', #260, #274, #694, .T. ) ;
#700 = EDGE_LOOP ( 'NONE', ( #647, #462, #621, #443 ) ) ;
#701 = PERSON_AND_ORGANIZATION ( #344, #320 ) ;
#702 = CARTESIAN_POINT ( 'NONE',  ( -9.500000000000001776, 9.499999999999994671, 3.000000000000000000 ) ) ;
#703 = FACE_OUTER_BOUND ( 'NONE', #540, .T. ) ;
#704 = DIRECTION ( 'NONE',  ( -1.000000000000000000, 0.000000000000000000, 0.000000000000000000 ) ) ;
#705 = DIRECTION ( 'NONE',  ( 0.000000000000000000, 0.000000000000000000, 1.000000000000000000 ) ) ;
#706 = DIRECTION ( 'NONE',  ( 0.000000000000000000, 0.000000000000000000, 1.000000000000000000 ) ) ;
#707 = CARTESIAN_POINT ( 'NONE',  ( -8.000000000000000000, 40.49999999999999289, 3.000000000000000000 ) ) ;
#708 = EDGE_LOOP ( 'NONE', ( #564, #233 ) ) ;
#709 = ORIENTED_EDGE ( 'NONE', *, *, #213, .T. ) ;
#710 = EDGE_LOOP ( 'NONE', ( #319, #731 ) ) ;
#711 = LINE ( 'NONE', #72, #392 ) ;
#712 = VECTOR ( 'NONE', #200, 1000.000000000000000 ) ;
#713 = CARTESIAN_POINT ( 'NONE',  ( -40.00000000000000000, 95.00000000000000000, 3.000000000000000000 ) ) ;
#714 = CC_DESIGN_DATE_AND_TIME_ASSIGNMENT ( #165, #599, ( #698 ) ) ;
#715 = DIRECTION ( 'NONE',  ( 1.000000000000000000, 0.000000000000000000, 0.000000000000000000 ) ) ;
#716 = AXIS2_PLACEMENT_3D ( 'NONE', #643, #584, #486 ) ;
#717 = SHAPE_DEFINITION_REPRESENTATION ( #671, #541 ) ;
#718 = DIRECTION ( 'NONE',  ( 0.000000000000000000, 0.000000000000000000, 1.000000000000000000 ) ) ;
#719 = EDGE_LOOP ( 'NONE', ( #173, #251 ) ) ;
#720 = ORIENTED_EDGE ( 'NONE', *, *, #18, .T. ) ;
#721 = EDGE_LOOP ( 'NONE', ( #630, #196, #489, #244 ) ) ;
#722 = PERSON_AND_ORGANIZATION_ROLE ( 'design_supplier' ) ;
#723 = CIRCLE ( 'NONE', #68, 2.500000000000000444 ) ;
#724 = CIRCLE ( 'NONE', #58, 15.50000000000000533 ) ;
#725 = PERSON_AND_ORGANIZATION_ROLE ( 'design_owner' ) ;
#726 = DATE_AND_TIME ( #752, #171 ) ;
#727 = AXIS2_PLACEMENT_3D ( 'NONE', #134, #192, #704 ) ;
#728 = APPROVAL_ROLE ( '' ) ;
#729 = ORIENTED_EDGE ( 'NONE', *, *, #315, .T. ) ;
#730 = ADVANCED_FACE ( 'NONE', ( #359 ), #735, .F. ) ;
#731 = ORIENTED_EDGE ( 'NONE', *, *, #699, .F. ) ;
#732 = VERTEX_POINT ( 'NONE', #441 ) ;
#733 = ORIENTED_EDGE ( 'NONE', *, *, #450, .T. ) ;
#734 = LINE ( 'NONE', #336, #331 ) ;
#735 = CYLINDRICAL_SURFACE ( 'NONE', #48, 1.500000000000001332 ) ;
#736 = AXIS2_PLACEMENT_3D ( 'NONE', #477, #60, #640 ) ;
#737 = APPROVAL_PERSON_ORGANIZATION ( #597, #224, #728 ) ;
#738 = ADVANCED_FACE ( 'NONE', ( #742 ), #23, .F. ) ;
#739 = DIRECTION ( 'NONE',  ( 1.000000000000000000, 0.000000000000000000, -0.000000000000000000 ) ) ;
#740 = CARTESIAN_POINT ( 'NONE',  ( -40.50000000000000000, 40.49999999999998579, 3.000000000000000000 ) ) ;
#741 = FACE_OUTER_BOUND ( 'NONE', #45, .T. ) ;
#742 = FACE_OUTER_BOUND ( 'NONE', #139, .T. ) ;
#743 = EDGE_CURVE ( 'NONE', #732, #188, #163, .T. ) ;
#744 = DIRECTION ( 'NONE',  ( 1.000000000000000000, 0.000000000000000000, 0.000000000000000000 ) ) ;
#745 = ORIENTED_EDGE ( 'NONE', *, *, #563, .T. ) ;
#746 = ORIENTED_EDGE ( 'NONE', *, *, #510, .T. ) ;
#747 = ORIENTED_EDGE ( 'NONE', *, *, #111, .F. ) ;
#748 = FACE_OUTER_BOUND ( 'NONE', #337, .T. ) ;
#749 = DIRECTION ( 'NONE',  ( -1.000000000000000000, 0.000000000000000000, 0.000000000000000000 ) ) ;
#750 = CYLINDRICAL_SURFACE ( 'NONE', #278, 2.500000000000000444 ) ;
#751 = DIRECTION ( 'NONE',  ( 0.000000000000000000, 0.000000000000000000, 1.000000000000000000 ) ) ;
#752 = CALENDAR_DATE ( 2021, 3, 2 ) ;
#753 = CARTESIAN_POINT ( 'NONE',  ( -40.50000000000000000, 9.499999999999994671, 0.000000000000000000 ) ) ;
#754 = EDGE_CURVE ( 'NONE', #195, #568, #639, .T. ) ;
#755 = ORIENTED_EDGE ( 'NONE', *, *, #12, .F. ) ;
ENDSEC;
END-ISO-10303-21;
