ISO-10303-21;
HEADER;
FILE_DESCRIPTION (( 'STEP AP203' ),
    '1' );
FILE_NAME ('Halterriemen1.STEP',
    '2021-02-03T17:42:52',
    ( '' ),
    ( '' ),
    'SwSTEP 2.0',
    'SolidWorks 2018',
    '' );
FILE_SCHEMA (( 'CONFIG_CONTROL_DESIGN' ));
ENDSEC;

DATA;
#1 = ADVANCED_FACE ( 'NONE', ( #110 ), #58, .F. ) ;
#2 = AXIS2_PLACEMENT_3D ( 'NONE', #626, #431, #364 ) ;
#3 = ADVANCED_FACE ( 'NONE', ( #759 ), #457, .F. ) ;
#4 = EDGE_LOOP ( 'NONE', ( #198, #797, #824, #707 ) ) ;
#5 = CIRCLE ( 'NONE', #684, 2.999999999999999112 ) ;
#6 = VERTEX_POINT ( 'NONE', #164 ) ;
#7 = EDGE_CURVE ( 'NONE', #290, #415, #102, .T. ) ;
#8 = VECTOR ( 'NONE', #746, 1000.000000000000000 ) ;
#9 = PRODUCT_RELATED_PRODUCT_CATEGORY ( 'detail', '', ( #263 ) ) ;
#10 = EDGE_CURVE ( 'NONE', #565, #86, #298, .T. ) ;
#11 = ORIENTED_EDGE ( 'NONE', *, *, #336, .F. ) ;
#12 = VECTOR ( 'NONE', #761, 1000.000000000000000 ) ;
#13 = DIRECTION ( 'NONE',  ( 0.000000000000000000, 0.000000000000000000, 1.000000000000000000 ) ) ;
#14 = DIRECTION ( 'NONE',  ( 0.000000000000000000, 0.000000000000000000, -1.000000000000000000 ) ) ;
#15 = CYLINDRICAL_SURFACE ( 'NONE', #643, 4.500000000000000000 ) ;
#16 = AXIS2_PLACEMENT_3D ( 'NONE', #380, #771, #697 ) ;
#17 = ORIENTED_EDGE ( 'NONE', *, *, #807, .T. ) ;
#18 = DIRECTION ( 'NONE',  ( 1.000000000000000000, 0.000000000000000000, 0.000000000000000000 ) ) ;
#19 = PLANE ( 'NONE',  #153 ) ;
#20 = DIRECTION ( 'NONE',  ( 1.000000000000000000, 0.000000000000000000, 0.000000000000000000 ) ) ;
#21 = CARTESIAN_POINT ( 'NONE',  ( -54.00000000000000000, 8.500000000000000000, 7.500000000000000888 ) ) ;
#22 = VERTEX_POINT ( 'NONE', #353 ) ;
#23 = VECTOR ( 'NONE', #190, 1000.000000000000000 ) ;
#24 = PERSON_AND_ORGANIZATION ( #594, #232 ) ;
#25 = FACE_OUTER_BOUND ( 'NONE', #130, .T. ) ;
#26 = CARTESIAN_POINT ( 'NONE',  ( -39.00000000000000000, 34.99999999999999289, 12.00000000000000000 ) ) ;
#27 = CARTESIAN_POINT ( 'NONE',  ( -42.00000000000000000, 34.99999999999999289, 0.000000000000000000 ) ) ;
#28 = ADVANCED_FACE ( 'NONE', ( #120 ), #586, .F. ) ;
#29 = DIRECTION ( 'NONE',  ( 1.000000000000000000, 0.000000000000000000, 0.000000000000000000 ) ) ;
#30 = CARTESIAN_POINT ( 'NONE',  ( -52.00000000000000000, 0.000000000000000000, 0.000000000000000000 ) ) ;
#31 = VERTEX_POINT ( 'NONE', #738 ) ;
#32 = EDGE_CURVE ( 'NONE', #781, #349, #414, .T. ) ;
#33 = ORIENTED_EDGE ( 'NONE', *, *, #423, .T. ) ;
#34 = FACE_OUTER_BOUND ( 'NONE', #426, .T. ) ;
#35 = CARTESIAN_POINT ( 'NONE',  ( -42.00000000000000000, 20.50000000000000000, 12.00000000000000000 ) ) ;
#36 = LINE ( 'NONE', #652, #140 ) ;
#37 =( LENGTH_UNIT ( ) NAMED_UNIT ( * ) SI_UNIT ( .MILLI., .METRE. ) );
#38 = ORIENTED_EDGE ( 'NONE', *, *, #530, .T. ) ;
#39 = SECURITY_CLASSIFICATION ( '', '', #173 ) ;
#40 = ORIENTED_EDGE ( 'NONE', *, *, #357, .F. ) ;
#41 = ORIENTED_EDGE ( 'NONE', *, *, #401, .F. ) ;
#42 = CYLINDRICAL_SURFACE ( 'NONE', #736, 2.999999999999999112 ) ;
#43 = ORIENTED_EDGE ( 'NONE', *, *, #90, .F. ) ;
#44 = APPROVAL_PERSON_ORGANIZATION ( #160, #582, #316 ) ;
#45 = FACE_OUTER_BOUND ( 'NONE', #323, .T. ) ;
#46 = DIRECTION ( 'NONE',  ( 0.000000000000000000, 0.000000000000000000, -1.000000000000000000 ) ) ;
#47 = EDGE_CURVE ( 'NONE', #767, #820, #741, .T. ) ;
#48 =( NAMED_UNIT ( * ) SI_UNIT ( $, .STERADIAN. ) SOLID_ANGLE_UNIT ( ) );
#49 = CARTESIAN_POINT ( 'NONE',  ( -10.49999999999999822, 34.99999999999999289, 12.00000000000000000 ) ) ;
#50 = DIRECTION ( 'NONE',  ( 0.000000000000000000, 0.000000000000000000, 1.000000000000000000 ) ) ;
#51 = ORIENTED_EDGE ( 'NONE', *, *, #379, .T. ) ;
#52 = CIRCLE ( 'NONE', #211, 4.500000000000000000 ) ;
#53 = VERTEX_POINT ( 'NONE', #282 ) ;
#54 = EDGE_CURVE ( 'NONE', #22, #553, #574, .T. ) ;
#55 = ORIENTED_EDGE ( 'NONE', *, *, #221, .T. ) ;
#56 = DIRECTION ( 'NONE',  ( 1.000000000000000000, 0.000000000000000000, 0.000000000000000000 ) ) ;
#57 = ORIENTED_EDGE ( 'NONE', *, *, #439, .F. ) ;
#58 = PLANE ( 'NONE',  #466 ) ;
#59 = DIRECTION ( 'NONE',  ( 1.000000000000000000, -0.000000000000000000, -0.000000000000000000 ) ) ;
#60 = AXIS2_PLACEMENT_3D ( 'NONE', #176, #695, #114 ) ;
#61 = DIRECTION ( 'NONE',  ( 0.000000000000000000, 0.000000000000000000, -1.000000000000000000 ) ) ;
#62 = DIRECTION ( 'NONE',  ( -0.000000000000000000, -0.000000000000000000, -1.000000000000000000 ) ) ;
#63 = VECTOR ( 'NONE', #786, 1000.000000000000000 ) ;
#64 = APPROVAL_PERSON_ORGANIZATION ( #731, #474, #234 ) ;
#65 = DIRECTION ( 'NONE',  ( -1.000000000000000000, 0.000000000000000000, 0.000000000000000000 ) ) ;
#66 = ADVANCED_FACE ( 'NONE', ( #111 ), #289, .F. ) ;
#67 = VECTOR ( 'NONE', #476, 1000.000000000000000 ) ;
#68 = MANIFOLD_SOLID_BREP ( 'Schnitt-Linear austragen2', #250 ) ;
#69 = EDGE_CURVE ( 'NONE', #383, #53, #243, .T. ) ;
#70 = AXIS2_PLACEMENT_3D ( 'NONE', #425, #792, #215 ) ;
#71 = ORIENTED_EDGE ( 'NONE', *, *, #403, .F. ) ;
#72 = LINE ( 'NONE', #279, #63 ) ;
#73 = EDGE_LOOP ( 'NONE', ( #712, #287, #17, #261, #836, #75, #817, #159 ) ) ;
#74 = EDGE_CURVE ( 'NONE', #468, #667, #309, .T. ) ;
#75 = ORIENTED_EDGE ( 'NONE', *, *, #720, .T. ) ;
#76 = ORIENTED_EDGE ( 'NONE', *, *, #699, .T. ) ;
#77 = APPROVAL ( #444, 'UNSPECIFIED' ) ;
#78 = DIRECTION ( 'NONE',  ( 0.000000000000000000, 0.000000000000000000, -1.000000000000000000 ) ) ;
#79 = LINE ( 'NONE', #509, #339 ) ;
#80 = ORIENTED_EDGE ( 'NONE', *, *, #117, .T. ) ;
#81 = DIRECTION ( 'NONE',  ( 1.000000000000000000, 0.000000000000000000, 0.000000000000000000 ) ) ;
#82 = DIRECTION ( 'NONE',  ( -0.000000000000000000, -0.000000000000000000, -1.000000000000000000 ) ) ;
#83 = DIRECTION ( 'NONE',  ( -1.000000000000000000, 0.000000000000000000, 0.000000000000000000 ) ) ;
#84 = VECTOR ( 'NONE', #422, 1000.000000000000000 ) ;
#85 =( GEOMETRIC_REPRESENTATION_CONTEXT ( 3 ) GLOBAL_UNCERTAINTY_ASSIGNED_CONTEXT ( ( #237 ) ) GLOBAL_UNIT_ASSIGNED_CONTEXT ( ( #37, #756, #48 ) ) REPRESENTATION_CONTEXT ( 'NONE', 'WORKASPACE' ) );
#86 = VERTEX_POINT ( 'NONE', #785 ) ;
#87 = DIRECTION ( 'NONE',  ( -0.000000000000000000, -0.000000000000000000, -1.000000000000000000 ) ) ;
#88 = CARTESIAN_POINT ( 'NONE',  ( 0.000000000000000000, 0.000000000000000000, 12.00000000000000000 ) ) ;
#89 = ORIENTED_EDGE ( 'NONE', *, *, #47, .F. ) ;
#90 = EDGE_CURVE ( 'NONE', #86, #565, #729, .T. ) ;
#91 = CARTESIAN_POINT ( 'NONE',  ( -54.00000000000000000, 8.500000000000000000, 4.500000000000000888 ) ) ;
#92 = ORIENTED_EDGE ( 'NONE', *, *, #423, .F. ) ;
#93 = CIRCLE ( 'NONE', #567, 3.000000000000000888 ) ;
#94 = ORIENTED_EDGE ( 'NONE', *, *, #117, .F. ) ;
#95 = DIRECTION ( 'NONE',  ( 0.000000000000000000, 0.000000000000000000, 1.000000000000000000 ) ) ;
#96 = CARTESIAN_POINT ( 'NONE',  ( -36.00000000000000000, 20.50000000000000000, 12.00000000000000000 ) ) ;
#97 = EDGE_CURVE ( 'NONE', #737, #406, #93, .T. ) ;
#98 = ORIENTED_EDGE ( 'NONE', *, *, #97, .F. ) ;
#99 = CARTESIAN_POINT ( 'NONE',  ( 0.000000000000000000, 66.00000000000000000, 12.00000000000000000 ) ) ;
#100 = DIRECTION ( 'NONE',  ( 1.000000000000000000, 0.000000000000000000, -0.000000000000000000 ) ) ;
#101 = AXIS2_PLACEMENT_3D ( 'NONE', #392, #458, #563 ) ;
#102 = LINE ( 'NONE', #273, #787 ) ;
#103 = CALENDAR_DATE ( 2021, 3, 2 ) ;
#104 = VECTOR ( 'NONE', #358, 1000.000000000000000 ) ;
#105 = ORIENTED_EDGE ( 'NONE', *, *, #175, .T. ) ;
#106 = PERSON_AND_ORGANIZATION_ROLE ( 'design_supplier' ) ;
#107 = APPLICATION_PROTOCOL_DEFINITION ( 'international standard', 'config_control_design', 1994, #236 ) ;
#108 = VERTEX_POINT ( 'NONE', #539 ) ;
#109 = CARTESIAN_POINT ( 'NONE',  ( -13.00000000000000178, 20.50000000000000711, 12.00000000000000000 ) ) ;
#110 = FACE_OUTER_BOUND ( 'NONE', #653, .T. ) ;
#111 = FACE_OUTER_BOUND ( 'NONE', #345, .T. ) ;
#112 = EDGE_CURVE ( 'NONE', #365, #820, #533, .T. ) ;
#113 = LINE ( 'NONE', #839, #772 ) ;
#114 = DIRECTION ( 'NONE',  ( 0.000000000000000000, 0.000000000000000000, -1.000000000000000000 ) ) ;
#115 = DIRECTION ( 'NONE',  ( 0.000000000000000000, 0.000000000000000000, 1.000000000000000000 ) ) ;
#116 = DIRECTION ( 'NONE',  ( 1.000000000000000000, -0.000000000000000000, -0.000000000000000000 ) ) ;
#117 = EDGE_CURVE ( 'NONE', #406, #737, #147, .T. ) ;
#118 = DIRECTION ( 'NONE',  ( 0.000000000000000000, 0.000000000000000000, -1.000000000000000000 ) ) ;
#119 = CARTESIAN_POINT ( 'NONE',  ( 0.000000000000000000, 13.00000000000000178, 12.00000000000000000 ) ) ;
#120 = FACE_OUTER_BOUND ( 'NONE', #799, .T. ) ;
#121 = CARTESIAN_POINT ( 'NONE',  ( -10.00000000000000000, 20.50000000000000711, 0.000000000000000000 ) ) ;
#122 = VERTEX_POINT ( 'NONE', #613 ) ;
#123 = CALENDAR_DATE ( 2021, 3, 2 ) ;
#124 = CARTESIAN_POINT ( 'NONE',  ( -39.00000000000000000, 34.99999999999999289, 0.000000000000000000 ) ) ;
#125 = CIRCLE ( 'NONE', #226, 2.999999999999999112 ) ;
#126 = AXIS2_PLACEMENT_3D ( 'NONE', #26, #796, #29 ) ;
#127 = ORIENTED_EDGE ( 'NONE', *, *, #262, .F. ) ;
#128 = FACE_OUTER_BOUND ( 'NONE', #743, .T. ) ;
#129 = EDGE_CURVE ( 'NONE', #822, #22, #72, .T. ) ;
#130 = EDGE_LOOP ( 'NONE', ( #41, #388, #368, #127 ) ) ;
#131 = COORDINATED_UNIVERSAL_TIME_OFFSET ( 1, 0, .AHEAD. ) ;
#132 = FACE_BOUND ( 'NONE', #351, .T. ) ;
#133 = CARTESIAN_POINT ( 'NONE',  ( 0.000000000000000000, 0.000000000000000000, 12.00000000000000000 ) ) ;
#134 = EDGE_CURVE ( 'NONE', #166, #769, #760, .T. ) ;
#135 = ORIENTED_EDGE ( 'NONE', *, *, #216, .T. ) ;
#136 = ORIENTED_EDGE ( 'NONE', *, *, #448, .F. ) ;
#137 = PERSON_AND_ORGANIZATION ( #594, #232 ) ;
#138 = CARTESIAN_POINT ( 'NONE',  ( -1.000000000000000888, 8.500000000000000000, 12.00000000000000000 ) ) ;
#139 = AXIS2_PLACEMENT_3D ( 'NONE', #144, #611, #206 ) ;
#140 = VECTOR ( 'NONE', #391, 1000.000000000000000 ) ;
#141 = CARTESIAN_POINT ( 'NONE',  ( -13.00000000000000178, 20.50000000000000711, 0.000000000000000000 ) ) ;
#142 = VERTEX_POINT ( 'NONE', #469 ) ;
#143 = DIRECTION ( 'NONE',  ( -0.000000000000000000, -0.000000000000000000, -1.000000000000000000 ) ) ;
#144 = CARTESIAN_POINT ( 'NONE',  ( 0.000000000000000000, 0.000000000000000000, 12.00000000000000000 ) ) ;
#145 = DIRECTION ( 'NONE',  ( 1.000000000000000000, -0.000000000000000000, -0.000000000000000000 ) ) ;
#146 = VERTEX_POINT ( 'NONE', #346 ) ;
#147 = CIRCLE ( 'NONE', #413, 3.000000000000000888 ) ;
#148 = EDGE_LOOP ( 'NONE', ( #370, #621, #165, #231 ) ) ;
#149 = DIRECTION ( 'NONE',  ( 1.000000000000000000, -0.000000000000000000, -0.000000000000000000 ) ) ;
#150 = DIRECTION ( 'NONE',  ( -1.000000000000000000, 0.000000000000000000, 0.000000000000000000 ) ) ;
#151 = LINE ( 'NONE', #757, #258 ) ;
#152 = EDGE_CURVE ( 'NONE', #31, #406, #463, .T. ) ;
#153 = AXIS2_PLACEMENT_3D ( 'NONE', #739, #472, #735 ) ;
#154 = CARTESIAN_POINT ( 'NONE',  ( 0.000000000000000000, 0.000000000000000000, 0.000000000000000000 ) ) ;
#155 = DIRECTION ( 'NONE',  ( 1.000000000000000000, 0.000000000000000000, 0.000000000000000000 ) ) ;
#156 = ORIENTED_EDGE ( 'NONE', *, *, #551, .T. ) ;
#157 = CIRCLE ( 'NONE', #60, 7.500000000000000000 ) ;
#158 = CARTESIAN_POINT ( 'NONE',  ( -52.00000000000000000, 0.000000000000000000, 12.00000000000000000 ) ) ;
#159 = ORIENTED_EDGE ( 'NONE', *, *, #336, .T. ) ;
#160 = PERSON_AND_ORGANIZATION ( #594, #232 ) ;
#161 = LINE ( 'NONE', #88, #104 ) ;
#162 = DIRECTION ( 'NONE',  ( 1.000000000000000000, -0.000000000000000000, -0.000000000000000000 ) ) ;
#163 = PRODUCT_DEFINITION_FORMATION_WITH_SPECIFIED_SOURCE ( 'ANY', '', #263, .NOT_KNOWN. ) ;
#164 = CARTESIAN_POINT ( 'NONE',  ( -52.00000000000000000, 13.00000000000000178, 12.00000000000000000 ) ) ;
#165 = ORIENTED_EDGE ( 'NONE', *, *, #487, .T. ) ;
#166 = VERTEX_POINT ( 'NONE', #602 ) ;
#167 = EDGE_CURVE ( 'NONE', #53, #833, #5, .T. ) ;
#168 = DATE_TIME_ROLE ( 'classification_date' ) ;
#169 = AXIS2_PLACEMENT_3D ( 'NONE', #109, #765, #445 ) ;
#170 = ORIENTED_EDGE ( 'NONE', *, *, #293, .F. ) ;
#171 = CIRCLE ( 'NONE', #278, 3.000000000000002665 ) ;
#172 = ORIENTED_EDGE ( 'NONE', *, *, #571, .F. ) ;
#173 = SECURITY_CLASSIFICATION_LEVEL ( 'unclassified' ) ;
#174 = VECTOR ( 'NONE', #809, 1000.000000000000000 ) ;
#175 = EDGE_CURVE ( 'NONE', #228, #833, #713, .T. ) ;
#176 = CARTESIAN_POINT ( 'NONE',  ( -1.000000000000000888, 8.500000000000000000, 12.00000000000000000 ) ) ;
#177 = CC_DESIGN_PERSON_AND_ORGANIZATION_ASSIGNMENT ( #546, #106, ( #163 ) ) ;
#178 = DIRECTION ( 'NONE',  ( -1.000000000000000000, 0.000000000000000000, 0.000000000000000000 ) ) ;
#179 = DIRECTION ( 'NONE',  ( 1.000000000000000000, 0.000000000000000000, 0.000000000000000000 ) ) ;
#180 = ORIENTED_EDGE ( 'NONE', *, *, #196, .F. ) ;
#181 = LINE ( 'NONE', #617, #219 ) ;
#182 = EDGE_CURVE ( 'NONE', #565, #468, #350, .T. ) ;
#183 = DIRECTION ( 'NONE',  ( 0.000000000000000000, 0.000000000000000000, -1.000000000000000000 ) ) ;
#184 = VECTOR ( 'NONE', #326, 1000.000000000000000 ) ;
#185 = DIRECTION ( 'NONE',  ( 0.000000000000000000, 0.000000000000000000, -1.000000000000000000 ) ) ;
#186 = ORIENTED_EDGE ( 'NONE', *, *, #599, .F. ) ;
#187 = AXIS2_PLACEMENT_3D ( 'NONE', #214, #475, #18 ) ;
#188 = CARTESIAN_POINT ( 'NONE',  ( -1.000000000000000000, 16.00000000000000000, 12.00000000000000000 ) ) ;
#189 = DIRECTION ( 'NONE',  ( 1.000000000000000000, -0.000000000000000000, -0.000000000000000000 ) ) ;
#190 = DIRECTION ( 'NONE',  ( 0.000000000000000000, -1.000000000000000000, 0.000000000000000000 ) ) ;
#191 = ORIENTED_EDGE ( 'NONE', *, *, #216, .F. ) ;
#192 = CIRCLE ( 'NONE', #645, 4.500000000000000000 ) ;
#193 = ORIENTED_EDGE ( 'NONE', *, *, #112, .T. ) ;
#194 = APPROVAL_PERSON_ORGANIZATION ( #505, #77, #507 ) ;
#195 = VECTOR ( 'NONE', #618, 1000.000000000000000 ) ;
#196 = EDGE_CURVE ( 'NONE', #415, #721, #181, .T. ) ;
#197 = ORIENTED_EDGE ( 'NONE', *, *, #293, .T. ) ;
#198 = ORIENTED_EDGE ( 'NONE', *, *, #262, .T. ) ;
#199 = CIRCLE ( 'NONE', #722, 7.500000000000000000 ) ;
#200 = DIRECTION ( 'NONE',  ( 0.000000000000000000, 0.000000000000000000, 1.000000000000000000 ) ) ;
#201 = CARTESIAN_POINT ( 'NONE',  ( -10.49999999999999822, 34.99999999999999289, 12.00000000000000000 ) ) ;
#202 = LINE ( 'NONE', #247, #184 ) ;
#203 = ORIENTED_EDGE ( 'NONE', *, *, #764, .F. ) ;
#204 = CARTESIAN_POINT ( 'NONE',  ( 0.000000000000000000, 0.000000000000000000, 0.000000000000000000 ) ) ;
#205 = CARTESIAN_POINT ( 'NONE',  ( -16.49999999999999645, 34.99999999999999289, 12.00000000000000000 ) ) ;
#206 = DIRECTION ( 'NONE',  ( 0.000000000000000000, 0.000000000000000000, 1.000000000000000000 ) ) ;
#207 = ORIENTED_EDGE ( 'NONE', *, *, #7, .F. ) ;
#208 = VECTOR ( 'NONE', #590, 1000.000000000000000 ) ;
#209 = COORDINATED_UNIVERSAL_TIME_OFFSET ( 1, 0, .AHEAD. ) ;
#210 = EDGE_CURVE ( 'NONE', #122, #31, #554, .T. ) ;
#211 = AXIS2_PLACEMENT_3D ( 'NONE', #639, #56, #647 ) ;
#212 = FACE_OUTER_BOUND ( 'NONE', #532, .T. ) ;
#213 = ADVANCED_FACE ( 'NONE', ( #823 ), #604, .F. ) ;
#214 = CARTESIAN_POINT ( 'NONE',  ( -39.00000000000000000, 34.99999999999999289, 12.00000000000000000 ) ) ;
#215 = DIRECTION ( 'NONE',  ( 1.000000000000000000, 0.000000000000000000, 0.000000000000000000 ) ) ;
#216 = EDGE_CURVE ( 'NONE', #349, #290, #435, .T. ) ;
#217 = CARTESIAN_POINT ( 'NONE',  ( -54.00000000000000000, 16.00000000000000000, 12.00000000000000000 ) ) ;
#218 = ORIENTED_EDGE ( 'NONE', *, *, #551, .F. ) ;
#219 = VECTOR ( 'NONE', #411, 1000.000000000000000 ) ;
#220 = ORIENTED_EDGE ( 'NONE', *, *, #74, .F. ) ;
#221 = EDGE_CURVE ( 'NONE', #605, #166, #52, .T. ) ;
#222 = ORIENTED_EDGE ( 'NONE', *, *, #74, .T. ) ;
#223 = PLANE ( 'NONE',  #793 ) ;
#224 = ORIENTED_EDGE ( 'NONE', *, *, #379, .F. ) ;
#225 = CARTESIAN_POINT ( 'NONE',  ( -51.00000000000000000, 16.00000000000000000, 12.00000000000000000 ) ) ;
#226 = AXIS2_PLACEMENT_3D ( 'NONE', #412, #804, #488 ) ;
#227 = ADVANCED_FACE ( 'NONE', ( #620 ), #310, .F. ) ;
#228 = VERTEX_POINT ( 'NONE', #49 ) ;
#229 = DIRECTION ( 'NONE',  ( 0.000000000000000000, 0.000000000000000000, -1.000000000000000000 ) ) ;
#230 = VECTOR ( 'NONE', #663, 1000.000000000000000 ) ;
#231 = ORIENTED_EDGE ( 'NONE', *, *, #286, .T. ) ;
#232 = ORGANIZATION ( 'UNSPECIFIED', 'UNSPECIFIED', '' ) ;
#233 = LINE ( 'NONE', #96, #666 ) ;
#234 = APPROVAL_ROLE ( '' ) ;
#235 = DIRECTION ( 'NONE',  ( 0.000000000000000000, 0.000000000000000000, 1.000000000000000000 ) ) ;
#236 = APPLICATION_CONTEXT ( 'configuration controlled 3d designs of mechanical parts and assemblies' ) ;
#237 = UNCERTAINTY_MEASURE_WITH_UNIT (LENGTH_MEASURE( 1.000000000000000082E-05 ), #37, 'distance_accuracy_value', 'NONE');
#238 = CARTESIAN_POINT ( 'NONE',  ( -13.49999999999999822, 34.99999999999999289, 0.000000000000000000 ) ) ;
#239 = EDGE_CURVE ( 'NONE', #491, #767, #199, .T. ) ;
#240 = CARTESIAN_POINT ( 'NONE',  ( -52.00000000000000000, 0.000000000000000000, 12.00000000000000000 ) ) ;
#241 = AXIS2_PLACEMENT_3D ( 'NONE', #124, #584, #775 ) ;
#242 = EDGE_LOOP ( 'NONE', ( #601, #408, #321, #220 ) ) ;
#243 = LINE ( 'NONE', #205, #230 ) ;
#244 = ORIENTED_EDGE ( 'NONE', *, *, #69, .F. ) ;
#245 = CARTESIAN_POINT ( 'NONE',  ( -39.00000000000000000, 20.50000000000000000, 0.000000000000000000 ) ) ;
#246 = CARTESIAN_POINT ( 'NONE',  ( -13.00000000000000178, 20.50000000000000711, 12.00000000000000000 ) ) ;
#247 = CARTESIAN_POINT ( 'NONE',  ( -52.00000000000000000, 0.000000000000000000, 12.00000000000000000 ) ) ;
#248 = ORIENTED_EDGE ( 'NONE', *, *, #319, .F. ) ;
#249 = DIRECTION ( 'NONE',  ( 0.000000000000000000, 0.000000000000000000, 1.000000000000000000 ) ) ;
#250 = CLOSED_SHELL ( 'NONE', ( #751, #66, #213, #734, #330, #550, #616, #776, #256, #496, #838, #592, #795, #227, #1, #421, #399, #3, #28, #802, #675, #288, #478 ) ) ;
#251 = DIRECTION ( 'NONE',  ( -0.000000000000000000, -1.000000000000000000, -0.000000000000000000 ) ) ;
#252 = CARTESIAN_POINT ( 'NONE',  ( -16.00000000000000000, 20.50000000000000711, 12.00000000000000000 ) ) ;
#253 = CARTESIAN_POINT ( 'NONE',  ( -1.000000000000000888, 8.500000000000000000, 12.00000000000000000 ) ) ;
#254 = LINE ( 'NONE', #578, #12 ) ;
#255 = EDGE_LOOP ( 'NONE', ( #224, #559, #135, #625 ) ) ;
#256 = ADVANCED_FACE ( 'NONE', ( #265 ), #502, .F. ) ;
#257 = CARTESIAN_POINT ( 'NONE',  ( -36.00000000000000000, 34.99999999999999289, 0.000000000000000000 ) ) ;
#258 = VECTOR ( 'NONE', #382, 1000.000000000000000 ) ;
#259 = EDGE_CURVE ( 'NONE', #747, #605, #254, .T. ) ;
#260 = AXIS2_PLACEMENT_3D ( 'NONE', #245, #235, #450 ) ;
#261 = ORIENTED_EDGE ( 'NONE', *, *, #313, .T. ) ;
#262 = EDGE_CURVE ( 'NONE', #721, #142, #369, .T. ) ;
#263 = PRODUCT ( 'Halterriemen1', 'Halterriemen1', '', ( #440 ) ) ;
#264 = ORIENTED_EDGE ( 'NONE', *, *, #830, .F. ) ;
#265 = FACE_OUTER_BOUND ( 'NONE', #758, .T. ) ;
#266 = ORIENTED_EDGE ( 'NONE', *, *, #270, .F. ) ;
#267 = ORIENTED_EDGE ( 'NONE', *, *, #10, .F. ) ;
#268 = DIRECTION ( 'NONE',  ( 1.000000000000000000, 0.000000000000000000, 0.000000000000000000 ) ) ;
#269 = EDGE_LOOP ( 'NONE', ( #655, #482, #197, #331, #686, #333, #304 ) ) ;
#270 = EDGE_CURVE ( 'NONE', #146, #605, #774, .T. ) ;
#271 = CYLINDRICAL_SURFACE ( 'NONE', #460, 3.000000000000002665 ) ;
#272 = CARTESIAN_POINT ( 'NONE',  ( -36.00000000000000000, 34.99999999999999289, 12.00000000000000000 ) ) ;
#273 = CARTESIAN_POINT ( 'NONE',  ( 0.000000000000000000, 0.000000000000000000, 12.00000000000000000 ) ) ;
#274 = CARTESIAN_POINT ( 'NONE',  ( -51.00000000000000000, 4.000000000000001776, 12.00000000000000000 ) ) ;
#275 = ORIENTED_EDGE ( 'NONE', *, *, #742, .T. ) ;
#276 = EDGE_LOOP ( 'NONE', ( #432, #275, #593, #598 ) ) ;
#277 = LOCAL_TIME ( 18, 42, 52.00000000000000000, #398 ) ;
#278 = AXIS2_PLACEMENT_3D ( 'NONE', #638, #50, #443 ) ;
#279 = CARTESIAN_POINT ( 'NONE',  ( -52.00000000000000000, 0.000000000000000000, 12.00000000000000000 ) ) ;
#280 = CARTESIAN_POINT ( 'NONE',  ( -54.00000000000000000, 8.500000000000000000, 12.00000000000000000 ) ) ;
#281 = FACE_BOUND ( 'NONE', #360, .T. ) ;
#282 = CARTESIAN_POINT ( 'NONE',  ( -16.49999999999999645, 34.99999999999999289, 0.000000000000000000 ) ) ;
#283 = DIRECTION ( 'NONE',  ( 1.000000000000000000, -0.000000000000000000, -0.000000000000000000 ) ) ;
#284 = DIRECTION ( 'NONE',  ( -1.000000000000000000, 0.000000000000000000, 0.000000000000000000 ) ) ;
#285 = CARTESIAN_POINT ( 'NONE',  ( -42.00000000000000000, 20.50000000000000000, 0.000000000000000000 ) ) ;
#286 = EDGE_CURVE ( 'NONE', #723, #349, #597, .T. ) ;
#287 = ORIENTED_EDGE ( 'NONE', *, *, #7, .T. ) ;
#288 = ADVANCED_FACE ( 'NONE', ( #544 ), #396, .F. ) ;
#289 = CYLINDRICAL_SURFACE ( 'NONE', #808, 4.500000000000000000 ) ;
#290 = VERTEX_POINT ( 'NONE', #119 ) ;
#291 = CARTESIAN_POINT ( 'NONE',  ( -54.00000000000000000, 8.500000000000000000, 7.500000000000000888 ) ) ;
#292 = DIRECTION ( 'NONE',  ( 1.000000000000000000, 0.000000000000000000, 0.000000000000000000 ) ) ;
#293 = EDGE_CURVE ( 'NONE', #648, #6, #427, .T. ) ;
#294 = CYLINDRICAL_SURFACE ( 'NONE', #337, 3.000000000000002665 ) ;
#295 = CARTESIAN_POINT ( 'NONE',  ( -1.000000000000000000, 0.000000000000000000, 0.000000000000000000 ) ) ;
#296 = CARTESIAN_POINT ( 'NONE',  ( -36.00000000000000000, 20.50000000000000000, 12.00000000000000000 ) ) ;
#297 = CARTESIAN_POINT ( 'NONE',  ( -10.49999999999999822, 34.99999999999999289, 0.000000000000000000 ) ) ;
#298 = CIRCLE ( 'NONE', #126, 3.000000000000002665 ) ;
#299 = CALENDAR_DATE ( 2021, 3, 2 ) ;
#300 = DIRECTION ( 'NONE',  ( 1.000000000000000000, -0.000000000000000000, -0.000000000000000000 ) ) ;
#301 = FACE_OUTER_BOUND ( 'NONE', #654, .T. ) ;
#302 = CARTESIAN_POINT ( 'NONE',  ( -16.00000000000000355, 20.50000000000000711, 0.000000000000000000 ) ) ;
#303 = EDGE_CURVE ( 'NONE', #573, #781, #192, .T. ) ;
#304 = ORIENTED_EDGE ( 'NONE', *, *, #129, .F. ) ;
#305 = AXIS2_PLACEMENT_3D ( 'NONE', #724, #534, #268 ) ;
#306 = DIRECTION ( 'NONE',  ( 1.000000000000000000, 0.000000000000000000, 0.000000000000000000 ) ) ;
#307 = ORIENTED_EDGE ( 'NONE', *, *, #167, .T. ) ;
#308 = PERSON_AND_ORGANIZATION_ROLE ( 'creator' ) ;
#309 = CIRCLE ( 'NONE', #305, 3.000000000000002665 ) ;
#310 = PLANE ( 'NONE',  #726 ) ;
#311 = ORIENTED_EDGE ( 'NONE', *, *, #259, .T. ) ;
#312 = LOCAL_TIME ( 18, 42, 52.00000000000000000, #209 ) ;
#313 = EDGE_CURVE ( 'NONE', #429, #6, #703, .T. ) ;
#314 = DIRECTION ( 'NONE',  ( -1.000000000000000000, 0.000000000000000000, 0.000000000000000000 ) ) ;
#315 = FACE_BOUND ( 'NONE', #612, .T. ) ;
#316 = APPROVAL_ROLE ( '' ) ;
#317 = DIRECTION ( 'NONE',  ( -1.000000000000000000, 0.000000000000000000, 0.000000000000000000 ) ) ;
#318 = CARTESIAN_POINT ( 'NONE',  ( -13.49999999999999822, 34.99999999999999289, 12.00000000000000000 ) ) ;
#319 = EDGE_CURVE ( 'NONE', #667, #468, #361, .T. ) ;
#320 = DIRECTION ( 'NONE',  ( 0.000000000000000000, 0.000000000000000000, -1.000000000000000000 ) ) ;
#321 = ORIENTED_EDGE ( 'NONE', *, *, #599, .T. ) ;
#322 = FACE_OUTER_BOUND ( 'NONE', #242, .T. ) ;
#323 = EDGE_LOOP ( 'NONE', ( #633, #527, #71, #690, #730, #693 ) ) ;
#324 = DIRECTION ( 'NONE',  ( 1.000000000000000000, -0.000000000000000000, -0.000000000000000000 ) ) ;
#325 = CIRCLE ( 'NONE', #499, 3.000000000000000888 ) ;
#326 = DIRECTION ( 'NONE',  ( -0.000000000000000000, -1.000000000000000000, -0.000000000000000000 ) ) ;
#327 = AXIS2_PLACEMENT_3D ( 'NONE', #705, #829, #118 ) ;
#328 = ORIENTED_EDGE ( 'NONE', *, *, #448, .T. ) ;
#329 = PLANE ( 'NONE',  #101 ) ;
#330 = ADVANCED_FACE ( 'NONE', ( #34 ), #42, .F. ) ;
#331 = ORIENTED_EDGE ( 'NONE', *, *, #313, .F. ) ;
#332 = CIRCLE ( 'NONE', #260, 3.000000000000002665 ) ;
#333 = ORIENTED_EDGE ( 'NONE', *, *, #510, .T. ) ;
#334 = EDGE_CURVE ( 'NONE', #464, #553, #752, .T. ) ;
#335 = FACE_BOUND ( 'NONE', #596, .T. ) ;
#336 = EDGE_CURVE ( 'NONE', #365, #108, #656, .T. ) ;
#337 = AXIS2_PLACEMENT_3D ( 'NONE', #343, #674, #83 ) ;
#338 = ORIENTED_EDGE ( 'NONE', *, *, #334, .T. ) ;
#339 = VECTOR ( 'NONE', #577, 1000.000000000000000 ) ;
#340 = CARTESIAN_POINT ( 'NONE',  ( -13.00000000000000178, 20.50000000000000711, 0.000000000000000000 ) ) ;
#341 = FACE_OUTER_BOUND ( 'NONE', #672, .T. ) ;
#342 = DIRECTION ( 'NONE',  ( 1.000000000000000000, -0.000000000000000000, -0.000000000000000000 ) ) ;
#343 = CARTESIAN_POINT ( 'NONE',  ( -39.00000000000000000, 34.99999999999999289, 12.00000000000000000 ) ) ;
#344 = ORIENTED_EDGE ( 'NONE', *, *, #764, .T. ) ;
#345 = EDGE_LOOP ( 'NONE', ( #170, #682, #462, #38 ) ) ;
#346 = CARTESIAN_POINT ( 'NONE',  ( -52.00000000000000000, 4.000000000000000888, 12.00000000000000000 ) ) ;
#347 = CARTESIAN_POINT ( 'NONE',  ( -54.00000000000000000, 13.00000000000000178, 12.00000000000000000 ) ) ;
#348 = EDGE_CURVE ( 'NONE', #670, #628, #332, .T. ) ;
#349 = VERTEX_POINT ( 'NONE', #825 ) ;
#350 = LINE ( 'NONE', #272, #405 ) ;
#351 = EDGE_LOOP ( 'NONE', ( #43, #267 ) ) ;
#352 = AXIS2_PLACEMENT_3D ( 'NONE', #791, #81, #14 ) ;
#353 = CARTESIAN_POINT ( 'NONE',  ( -52.00000000000000000, 0.000000000000000000, 0.000000000000000000 ) ) ;
#354 = CARTESIAN_POINT ( 'NONE',  ( -54.00000000000000000, 13.00000000000000178, 12.00000000000000000 ) ) ;
#355 = PRODUCT_DEFINITION_SHAPE ( 'NONE', 'NONE',  #576 ) ;
#356 = FACE_OUTER_BOUND ( 'NONE', #480, .T. ) ;
#357 = EDGE_CURVE ( 'NONE', #146, #648, #526, .T. ) ;
#358 = DIRECTION ( 'NONE',  ( 0.000000000000000000, 1.000000000000000000, 0.000000000000000000 ) ) ;
#359 = CARTESIAN_POINT ( 'NONE',  ( -1.000000000000000888, 8.500000000000000000, 4.500000000000000888 ) ) ;
#360 = EDGE_LOOP ( 'NONE', ( #520, #687 ) ) ;
#361 = CIRCLE ( 'NONE', #241, 3.000000000000002665 ) ;
#362 = EDGE_CURVE ( 'NONE', #833, #53, #481, .T. ) ;
#363 = CIRCLE ( 'NONE', #600, 3.000000000000002665 ) ;
#364 = DIRECTION ( 'NONE',  ( 0.000000000000000000, -0.000000000000000000, -1.000000000000000000 ) ) ;
#365 = VERTEX_POINT ( 'NONE', #513 ) ;
#366 = AXIS2_PLACEMENT_3D ( 'NONE', #832, #455, #185 ) ;
#367 = DIRECTION ( 'NONE',  ( -0.000000000000000000, -0.000000000000000000, -1.000000000000000000 ) ) ;
#368 = ORIENTED_EDGE ( 'NONE', *, *, #510, .F. ) ;
#369 = LINE ( 'NONE', #376, #782 ) ;
#370 = ORIENTED_EDGE ( 'NONE', *, *, #32, .F. ) ;
#371 = COORDINATED_UNIVERSAL_TIME_OFFSET ( 1, 0, .AHEAD. ) ;
#372 = PERSON_AND_ORGANIZATION_ROLE ( 'design_owner' ) ;
#373 = FACE_OUTER_BOUND ( 'NONE', #73, .T. ) ;
#374 = EDGE_CURVE ( 'NONE', #753, #725, #171, .T. ) ;
#375 = APPROVAL_STATUS ( 'not_yet_approved' ) ;
#376 = CARTESIAN_POINT ( 'NONE',  ( 0.000000000000000000, 66.00000000000000000, 0.000000000000000000 ) ) ;
#377 = DIRECTION ( 'NONE',  ( -0.000000000000000000, -0.000000000000000000, -1.000000000000000000 ) ) ;
#378 = CARTESIAN_POINT ( 'NONE',  ( 0.000000000000000000, 0.000000000000000000, 0.000000000000000000 ) ) ;
#379 = EDGE_CURVE ( 'NONE', #781, #108, #798, .T. ) ;
#380 = CARTESIAN_POINT ( 'NONE',  ( 0.000000000000000000, 8.500000000000000000, 12.00000000000000000 ) ) ;
#381 = AXIS2_PLACEMENT_3D ( 'NONE', #433, #162, #556 ) ;
#382 = DIRECTION ( 'NONE',  ( -0.000000000000000000, -0.000000000000000000, -1.000000000000000000 ) ) ;
#383 = VERTEX_POINT ( 'NONE', #640 ) ;
#384 = VECTOR ( 'NONE', #570, 1000.000000000000000 ) ;
#385 = CARTESIAN_POINT ( 'NONE',  ( 0.000000000000000000, 8.500000000000000000, 12.00000000000000000 ) ) ;
#386 = LOCAL_TIME ( 18, 42, 52.00000000000000000, #371 ) ;
#387 = DIRECTION ( 'NONE',  ( 0.000000000000000000, 0.000000000000000000, -1.000000000000000000 ) ) ;
#388 = ORIENTED_EDGE ( 'NONE', *, *, #54, .F. ) ;
#389 = CARTESIAN_POINT ( 'NONE',  ( -1.000000000000000000, 16.00000000000000000, 12.00000000000000000 ) ) ;
#390 = ORIENTED_EDGE ( 'NONE', *, *, #69, .T. ) ;
#391 = DIRECTION ( 'NONE',  ( 1.000000000000000000, -0.000000000000000000, -0.000000000000000000 ) ) ;
#392 = CARTESIAN_POINT ( 'NONE',  ( 0.000000000000000000, 0.000000000000000000, 12.00000000000000000 ) ) ;
#393 = ORIENTED_EDGE ( 'NONE', *, *, #90, .T. ) ;
#394 = DIRECTION ( 'NONE',  ( 0.000000000000000000, 0.000000000000000000, 1.000000000000000000 ) ) ;
#395 = ORIENTED_EDGE ( 'NONE', *, *, #660, .F. ) ;
#396 = CYLINDRICAL_SURFACE ( 'NONE', #442, 4.500000000000000000 ) ;
#397 = ORIENTED_EDGE ( 'NONE', *, *, #112, .F. ) ;
#398 = COORDINATED_UNIVERSAL_TIME_OFFSET ( 1, 0, .AHEAD. ) ;
#399 = ADVANCED_FACE ( 'NONE', ( #128 ), #492, .F. ) ;
#400 = FACE_BOUND ( 'NONE', #454, .T. ) ;
#401 = EDGE_CURVE ( 'NONE', #553, #721, #79, .T. ) ;
#402 = AXIS2_PLACEMENT_3D ( 'NONE', #503, #116, #516 ) ;
#403 = EDGE_CURVE ( 'NONE', #767, #747, #662, .T. ) ;
#404 = ORIENTED_EDGE ( 'NONE', *, *, #493, .T. ) ;
#405 = VECTOR ( 'NONE', #536, 1000.000000000000000 ) ;
#406 = VERTEX_POINT ( 'NONE', #121 ) ;
#407 = DIRECTION ( 'NONE',  ( 0.000000000000000000, 0.000000000000000000, 1.000000000000000000 ) ) ;
#408 = ORIENTED_EDGE ( 'NONE', *, *, #10, .T. ) ;
#409 = EDGE_CURVE ( 'NONE', #820, #762, #157, .T. ) ;
#410 = ORIENTED_EDGE ( 'NONE', *, *, #334, .F. ) ;
#411 = DIRECTION ( 'NONE',  ( -0.000000000000000000, -0.000000000000000000, -1.000000000000000000 ) ) ;
#412 = CARTESIAN_POINT ( 'NONE',  ( -13.49999999999999822, 34.99999999999999289, 12.00000000000000000 ) ) ;
#413 = AXIS2_PLACEMENT_3D ( 'NONE', #340, #407, #20 ) ;
#414 = LINE ( 'NONE', #291, #671 ) ;
#415 = VERTEX_POINT ( 'NONE', #644 ) ;
#416 = APPROVAL_DATE_TIME ( #664, #582 ) ;
#417 = CARTESIAN_POINT ( 'NONE',  ( -39.00000000000000000, 20.50000000000000000, 12.00000000000000000 ) ) ;
#418 = CARTESIAN_POINT ( 'NONE',  ( -1.000000000000000888, 4.000000000000000888, 12.00000000000000000 ) ) ;
#419 = FACE_OUTER_BOUND ( 'NONE', #783, .T. ) ;
#420 = CARTESIAN_POINT ( 'NONE',  ( -36.00000000000000000, 20.50000000000000000, 0.000000000000000000 ) ) ;
#421 = ADVANCED_FACE ( 'NONE', ( #322 ), #271, .F. ) ;
#422 = DIRECTION ( 'NONE',  ( -0.000000000000000000, -1.000000000000000000, -0.000000000000000000 ) ) ;
#423 = EDGE_CURVE ( 'NONE', #573, #762, #834, .T. ) ;
#424 = DIRECTION ( 'NONE',  ( 0.000000000000000000, 1.000000000000000000, 0.000000000000000000 ) ) ;
#425 = CARTESIAN_POINT ( 'NONE',  ( -39.00000000000000000, 20.50000000000000000, 12.00000000000000000 ) ) ;
#426 = EDGE_LOOP ( 'NONE', ( #635, #105, #661, #244 ) ) ;
#427 = CIRCLE ( 'NONE', #615, 4.500000000000000000 ) ;
#428 = CC_DESIGN_PERSON_AND_ORGANIZATION_ASSIGNMENT ( #515, #372, ( #263 ) ) ;
#429 = VERTEX_POINT ( 'NONE', #763 ) ;
#430 = EDGE_LOOP ( 'NONE', ( #595, #436, #446, #136 ) ) ;
#431 = DIRECTION ( 'NONE',  ( 0.000000000000000000, -1.000000000000000000, 0.000000000000000000 ) ) ;
#432 = ORIENTED_EDGE ( 'NONE', *, *, #374, .T. ) ;
#433 = CARTESIAN_POINT ( 'NONE',  ( -54.00000000000000000, 8.500000000000000000, 12.00000000000000000 ) ) ;
#434 = CARTESIAN_POINT ( 'NONE',  ( -1.000000000000000888, 8.500000000000000000, 7.500000000000000888 ) ) ;
#435 = CIRCLE ( 'NONE', #16, 4.500000000000000000 ) ;
#436 = ORIENTED_EDGE ( 'NONE', *, *, #622, .T. ) ;
#437 = VECTOR ( 'NONE', #732, 1000.000000000000000 ) ;
#438 = CARTESIAN_POINT ( 'NONE',  ( -51.00000000000000000, 13.00000000000000000, 12.00000000000000000 ) ) ;
#439 = EDGE_CURVE ( 'NONE', #822, #464, #113, .T. ) ;
#440 = MECHANICAL_CONTEXT ( 'NONE', #236, 'mechanical' ) ;
#441 = CARTESIAN_POINT ( 'NONE',  ( -54.00000000000000000, 4.000000000000000888, 12.00000000000000000 ) ) ;
#442 = AXIS2_PLACEMENT_3D ( 'NONE', #706, #324, #770 ) ;
#443 = DIRECTION ( 'NONE',  ( 1.000000000000000000, 0.000000000000000000, 0.000000000000000000 ) ) ;
#444 = APPROVAL_STATUS ( 'not_yet_approved' ) ;
#445 = DIRECTION ( 'NONE',  ( -1.000000000000000000, 0.000000000000000000, 0.000000000000000000 ) ) ;
#446 = ORIENTED_EDGE ( 'NONE', *, *, #784, .T. ) ;
#447 = VECTOR ( 'NONE', #149, 1000.000000000000000 ) ;
#448 = EDGE_CURVE ( 'NONE', #628, #670, #363, .T. ) ;
#449 = ORIENTED_EDGE ( 'NONE', *, *, #699, .F. ) ;
#450 = DIRECTION ( 'NONE',  ( 1.000000000000000000, 0.000000000000000000, 0.000000000000000000 ) ) ;
#451 = CARTESIAN_POINT ( 'NONE',  ( -52.00000000000000000, 0.000000000000000000, 12.00000000000000000 ) ) ;
#452 = CC_DESIGN_APPROVAL ( #77, ( #39 ) ) ;
#453 = ORIENTED_EDGE ( 'NONE', *, *, #362, .T. ) ;
#454 = EDGE_LOOP ( 'NONE', ( #395, #218 ) ) ;
#455 = DIRECTION ( 'NONE',  ( -1.000000000000000000, -0.000000000000000000, -0.000000000000000000 ) ) ;
#456 = EDGE_CURVE ( 'NONE', #429, #142, #151, .T. ) ;
#457 = CYLINDRICAL_SURFACE ( 'NONE', #814, 3.000000000000002665 ) ;
#458 = DIRECTION ( 'NONE',  ( 0.000000000000000000, -0.000000000000000000, 1.000000000000000000 ) ) ;
#459 = DATE_AND_TIME ( #813, #386 ) ;
#460 = AXIS2_PLACEMENT_3D ( 'NONE', #572, #377, #178 ) ;
#461 = CYLINDRICAL_SURFACE ( 'NONE', #381, 4.500000000000000000 ) ;
#462 = ORIENTED_EDGE ( 'NONE', *, *, #134, .T. ) ;
#463 = LINE ( 'NONE', #794, #564 ) ;
#464 = VERTEX_POINT ( 'NONE', #521 ) ;
#465 = VECTOR ( 'NONE', #708, 1000.000000000000000 ) ;
#466 = AXIS2_PLACEMENT_3D ( 'NONE', #133, #659, #200 ) ;
#467 = DIRECTION ( 'NONE',  ( 1.000000000000000000, 0.000000000000000000, 0.000000000000000000 ) ) ;
#468 = VERTEX_POINT ( 'NONE', #257 ) ;
#469 = CARTESIAN_POINT ( 'NONE',  ( -52.00000000000000000, 66.00000000000000000, 0.000000000000000000 ) ) ;
#470 = ORIENTED_EDGE ( 'NONE', *, *, #348, .T. ) ;
#471 = CALENDAR_DATE ( 2021, 3, 2 ) ;
#472 = DIRECTION ( 'NONE',  ( 1.000000000000000000, 0.000000000000000000, 0.000000000000000000 ) ) ;
#473 = FACE_OUTER_BOUND ( 'NONE', #148, .T. ) ;
#474 = APPROVAL ( #375, 'UNSPECIFIED' ) ;
#475 = DIRECTION ( 'NONE',  ( 0.000000000000000000, 0.000000000000000000, 1.000000000000000000 ) ) ;
#476 = DIRECTION ( 'NONE',  ( -1.000000000000000000, 0.000000000000000000, 0.000000000000000000 ) ) ;
#477 = EDGE_CURVE ( 'NONE', #146, #822, #202, .T. ) ;
#478 = ADVANCED_FACE ( 'NONE', ( #473 ), #15, .F. ) ;
#479 = AXIS2_PLACEMENT_3D ( 'NONE', #238, #568, #179 ) ;
#480 = EDGE_LOOP ( 'NONE', ( #92, #579, #51, #11, #193, #750 ) ) ;
#481 = CIRCLE ( 'NONE', #479, 2.999999999999999112 ) ;
#482 = ORIENTED_EDGE ( 'NONE', *, *, #357, .T. ) ;
#483 = LOCAL_TIME ( 18, 42, 52.00000000000000000, #557 ) ;
#484 = DIRECTION ( 'NONE',  ( 1.000000000000000000, -0.000000000000000000, -0.000000000000000000 ) ) ;
#485 = CARTESIAN_POINT ( 'NONE',  ( 0.000000000000000000, 66.00000000000000000, 0.000000000000000000 ) ) ;
#486 = FACE_BOUND ( 'NONE', #543, .T. ) ;
#487 = EDGE_CURVE ( 'NONE', #573, #723, #36, .T. ) ;
#488 = DIRECTION ( 'NONE',  ( 1.000000000000000000, 0.000000000000000000, 0.000000000000000000 ) ) ;
#489 = CARTESIAN_POINT ( 'NONE',  ( 0.000000000000000000, 0.000000000000000000, 12.00000000000000000 ) ) ;
#490 = CC_DESIGN_PERSON_AND_ORGANIZATION_ASSIGNMENT ( #629, #566, ( #39 ) ) ;
#491 = VERTEX_POINT ( 'NONE', #710 ) ;
#492 = CYLINDRICAL_SURFACE ( 'NONE', #552, 2.999999999999999112 ) ;
#493 = EDGE_CURVE ( 'NONE', #122, #737, #651, .T. ) ;
#494 = DIRECTION ( 'NONE',  ( 0.000000000000000000, -0.000000000000000000, 1.000000000000000000 ) ) ;
#495 = VECTOR ( 'NONE', #537, 1000.000000000000000 ) ;
#496 = ADVANCED_FACE ( 'NONE', ( #373, #281, #132, #400, #506 ), #329, .T. ) ;
#497 = DIRECTION ( 'NONE',  ( -0.000000000000000000, 1.000000000000000000, -0.000000000000000000 ) ) ;
#498 = ORIENTED_EDGE ( 'NONE', *, *, #175, .F. ) ;
#499 = AXIS2_PLACEMENT_3D ( 'NONE', #806, #95, #155 ) ;
#500 = APPLICATION_CONTEXT ( 'configuration controlled 3d designs of mechanical parts and assemblies' ) ;
#501 = EDGE_LOOP ( 'NONE', ( #172, #40, #717, #55 ) ) ;
#502 = CYLINDRICAL_SURFACE ( 'NONE', #402, 7.500000000000000000 ) ;
#503 = CARTESIAN_POINT ( 'NONE',  ( -54.00000000000000000, 8.500000000000000000, 12.00000000000000000 ) ) ;
#504 = ORIENTED_EDGE ( 'NONE', *, *, #403, .T. ) ;
#505 = PERSON_AND_ORGANIZATION ( #594, #232 ) ;
#506 = FACE_BOUND ( 'NONE', #702, .T. ) ;
#507 = APPROVAL_ROLE ( '' ) ;
#508 = CARTESIAN_POINT ( 'NONE',  ( -51.00000000000000000, 8.500000000000000000, 12.00000000000000000 ) ) ;
#509 = CARTESIAN_POINT ( 'NONE',  ( 0.000000000000000000, 0.000000000000000000, 0.000000000000000000 ) ) ;
#510 = EDGE_CURVE ( 'NONE', #142, #22, #777, .T. ) ;
#511 = DIRECTION ( 'NONE',  ( 1.000000000000000000, 0.000000000000000000, 0.000000000000000000 ) ) ;
#512 = AXIS2_PLACEMENT_3D ( 'NONE', #378, #115, #634 ) ;
#513 = CARTESIAN_POINT ( 'NONE',  ( -1.000000000000000888, 16.00000000000000000, 12.00000000000000000 ) ) ;
#514 = ORIENTED_EDGE ( 'NONE', *, *, #362, .F. ) ;
#515 = PERSON_AND_ORGANIZATION ( #594, #232 ) ;
#516 = DIRECTION ( 'NONE',  ( 0.000000000000000000, 0.000000000000000000, -1.000000000000000000 ) ) ;
#517 = LINE ( 'NONE', #217, #535 ) ;
#518 = CARTESIAN_POINT ( 'NONE',  ( -39.00000000000000000, 20.50000000000000000, 0.000000000000000000 ) ) ;
#519 = EDGE_LOOP ( 'NONE', ( #581, #222 ) ) ;
#520 = ORIENTED_EDGE ( 'NONE', *, *, #374, .F. ) ;
#521 = CARTESIAN_POINT ( 'NONE',  ( 0.000000000000000000, 0.000000000000000000, 12.00000000000000000 ) ) ;
#522 = CC_DESIGN_PERSON_AND_ORGANIZATION_ASSIGNMENT ( #24, #308, ( #163 ) ) ;
#523 = DIRECTION ( 'NONE',  ( -1.000000000000000000, 0.000000000000000000, 0.000000000000000000 ) ) ;
#524 = ADVANCED_BREP_SHAPE_REPRESENTATION ( 'Halterriemen1', ( #68, #512 ), #85 ) ;
#525 = ORIENTED_EDGE ( 'NONE', *, *, #54, .T. ) ;
#526 = CIRCLE ( 'NONE', #327, 4.500000000000000000 ) ;
#527 = ORIENTED_EDGE ( 'NONE', *, *, #259, .F. ) ;
#528 = APPROVAL_DATE_TIME ( #837, #77 ) ;
#529 = FACE_OUTER_BOUND ( 'NONE', #4, .T. ) ;
#530 = EDGE_CURVE ( 'NONE', #769, #6, #805, .T. ) ;
#531 = CC_DESIGN_DATE_AND_TIME_ASSIGNMENT ( #459, #168, ( #39 ) ) ;
#532 = EDGE_LOOP ( 'NONE', ( #637, #646, #397, #810 ) ) ;
#533 = CIRCLE ( 'NONE', #754, 7.500000000000000000 ) ;
#534 = DIRECTION ( 'NONE',  ( 0.000000000000000000, 0.000000000000000000, 1.000000000000000000 ) ) ;
#535 = VECTOR ( 'NONE', #150, 1000.000000000000000 ) ;
#536 = DIRECTION ( 'NONE',  ( -0.000000000000000000, -0.000000000000000000, -1.000000000000000000 ) ) ;
#537 = DIRECTION ( 'NONE',  ( 1.000000000000000000, -0.000000000000000000, -0.000000000000000000 ) ) ;
#538 = ORIENTED_EDGE ( 'NONE', *, *, #409, .F. ) ;
#539 = CARTESIAN_POINT ( 'NONE',  ( -1.000000000000000888, 13.00000000000000178, 12.00000000000000000 ) ) ;
#540 = CARTESIAN_POINT ( 'NONE',  ( -42.00000000000000000, 34.99999999999999289, 12.00000000000000000 ) ) ;
#541 = AXIS2_PLACEMENT_3D ( 'NONE', #280, #283, #549 ) ;
#542 = PLANE ( 'NONE',  #139 ) ;
#543 = EDGE_LOOP ( 'NONE', ( #470, #328 ) ) ;
#544 = FACE_OUTER_BOUND ( 'NONE', #501, .T. ) ;
#545 = ORIENTED_EDGE ( 'NONE', *, *, #401, .T. ) ;
#546 = PERSON_AND_ORGANIZATION ( #594, #232 ) ;
#547 = CARTESIAN_POINT ( 'NONE',  ( -13.49999999999999822, 34.99999999999999289, 0.000000000000000000 ) ) ;
#548 = VECTOR ( 'NONE', #497, 1000.000000000000000 ) ;
#549 = DIRECTION ( 'NONE',  ( 0.000000000000000000, 0.000000000000000000, -1.000000000000000000 ) ) ;
#550 = ADVANCED_FACE ( 'NONE', ( #301 ), #294, .F. ) ;
#551 = EDGE_CURVE ( 'NONE', #228, #383, #609, .T. ) ;
#552 = AXIS2_PLACEMENT_3D ( 'NONE', #318, #768, #314 ) ;
#553 = VERTEX_POINT ( 'NONE', #204 ) ;
#554 = CIRCLE ( 'NONE', #780, 3.000000000000000888 ) ;
#555 = ORIENTED_EDGE ( 'NONE', *, *, #439, .T. ) ;
#556 = DIRECTION ( 'NONE',  ( 0.000000000000000000, 0.000000000000000000, -1.000000000000000000 ) ) ;
#557 = COORDINATED_UNIVERSAL_TIME_OFFSET ( 1, 0, .AHEAD. ) ;
#558 = CARTESIAN_POINT ( 'NONE',  ( 0.000000000000000000, 4.000000000000000888, 12.00000000000000000 ) ) ;
#559 = ORIENTED_EDGE ( 'NONE', *, *, #32, .T. ) ;
#560 = DIRECTION ( 'NONE',  ( -0.000000000000000000, -0.000000000000000000, -1.000000000000000000 ) ) ;
#561 = CARTESIAN_POINT ( 'NONE',  ( -51.00000000000000000, 1.000000000000000888, 12.00000000000000000 ) ) ;
#562 = CC_DESIGN_SECURITY_CLASSIFICATION ( #39, ( #163 ) ) ;
#563 = DIRECTION ( 'NONE',  ( 1.000000000000000000, 0.000000000000000000, -0.000000000000000000 ) ) ;
#564 = VECTOR ( 'NONE', #87, 1000.000000000000000 ) ;
#565 = VERTEX_POINT ( 'NONE', #669 ) ;
#566 = PERSON_AND_ORGANIZATION_ROLE ( 'classification_officer' ) ;
#567 = AXIS2_PLACEMENT_3D ( 'NONE', #141, #728, #467 ) ;
#568 = DIRECTION ( 'NONE',  ( 0.000000000000000000, 0.000000000000000000, 1.000000000000000000 ) ) ;
#569 = DATE_TIME_ROLE ( 'creation_date' ) ;
#570 = DIRECTION ( 'NONE',  ( 1.000000000000000000, -0.000000000000000000, -0.000000000000000000 ) ) ;
#571 = EDGE_CURVE ( 'NONE', #648, #166, #685, .T. ) ;
#572 = CARTESIAN_POINT ( 'NONE',  ( -39.00000000000000000, 34.99999999999999289, 12.00000000000000000 ) ) ;
#573 = VERTEX_POINT ( 'NONE', #418 ) ;
#574 = LINE ( 'NONE', #677, #719 ) ;
#575 = ORIENTED_EDGE ( 'NONE', *, *, #129, .T. ) ;
#576 = PRODUCT_DEFINITION ( 'UNKNOWN', '', #163, #716 ) ;
#577 = DIRECTION ( 'NONE',  ( 0.000000000000000000, 1.000000000000000000, 0.000000000000000000 ) ) ;
#578 = CARTESIAN_POINT ( 'NONE',  ( -51.00000000000000000, 16.00000000000000000, 12.00000000000000000 ) ) ;
#579 = ORIENTED_EDGE ( 'NONE', *, *, #303, .T. ) ;
#580 = CARTESIAN_POINT ( 'NONE',  ( -1.000000000000000888, 8.500000000000000000, 12.00000000000000000 ) ) ;
#581 = ORIENTED_EDGE ( 'NONE', *, *, #319, .T. ) ;
#582 = APPROVAL ( #691, 'UNSPECIFIED' ) ;
#583 = DIRECTION ( 'NONE',  ( 1.000000000000000000, 0.000000000000000000, 0.000000000000000000 ) ) ;
#584 = DIRECTION ( 'NONE',  ( 0.000000000000000000, 0.000000000000000000, 1.000000000000000000 ) ) ;
#585 = CARTESIAN_POINT ( 'NONE',  ( -54.00000000000000000, 8.500000000000000000, 12.00000000000000000 ) ) ;
#586 = CYLINDRICAL_SURFACE ( 'NONE', #680, 2.999999999999999112 ) ;
#587 = ORIENTED_EDGE ( 'NONE', *, *, #493, .F. ) ;
#588 = APPROVAL_DATE_TIME ( #649, #474 ) ;
#589 = AXIS2_PLACEMENT_3D ( 'NONE', #614, #603, #292 ) ;
#590 = DIRECTION ( 'NONE',  ( -0.000000000000000000, -0.000000000000000000, -1.000000000000000000 ) ) ;
#591 = CIRCLE ( 'NONE', #70, 3.000000000000002665 ) ;
#592 = ADVANCED_FACE ( 'NONE', ( #419 ), #542, .F. ) ;
#593 = ORIENTED_EDGE ( 'NONE', *, *, #348, .F. ) ;
#594 = PERSON ( 'UNSPECIFIED', 'UNSPECIFIED', 'UNSPECIFIED', ('UNSPECIFIED'), ('UNSPECIFIED'), ('UNSPECIFIED') ) ;
#595 = ORIENTED_EDGE ( 'NONE', *, *, #742, .F. ) ;
#596 = EDGE_LOOP ( 'NONE', ( #307, #453 ) ) ;
#597 = CIRCLE ( 'NONE', #766, 4.500000000000000000 ) ;
#598 = ORIENTED_EDGE ( 'NONE', *, *, #784, .F. ) ;
#599 = EDGE_CURVE ( 'NONE', #86, #667, #815, .T. ) ;
#600 = AXIS2_PLACEMENT_3D ( 'NONE', #518, #394, #773 ) ;
#601 = ORIENTED_EDGE ( 'NONE', *, *, #182, .F. ) ;
#602 = CARTESIAN_POINT ( 'NONE',  ( -51.00000000000000000, 8.500000000000000000, 7.500000000000000888 ) ) ;
#603 = DIRECTION ( 'NONE',  ( 0.000000000000000000, 0.000000000000000000, 1.000000000000000000 ) ) ;
#604 = CYLINDRICAL_SURFACE ( 'NONE', #169, 2.999999999999999112 ) ;
#605 = VERTEX_POINT ( 'NONE', #274 ) ;
#606 = CARTESIAN_POINT ( 'NONE',  ( -54.00000000000000000, 8.500000000000000000, 12.00000000000000000 ) ) ;
#607 = CARTESIAN_POINT ( 'NONE',  ( -52.00000000000000000, 8.500000000000000000, 7.500000000000000888 ) ) ;
#608 = CC_DESIGN_APPROVAL ( #582, ( #163 ) ) ;
#609 = CIRCLE ( 'NONE', #589, 2.999999999999999112 ) ;
#610 = DIRECTION ( 'NONE',  ( -1.000000000000000000, -0.000000000000000000, -0.000000000000000000 ) ) ;
#611 = DIRECTION ( 'NONE',  ( -1.000000000000000000, 0.000000000000000000, 0.000000000000000000 ) ) ;
#612 = EDGE_LOOP ( 'NONE', ( #745, #80 ) ) ;
#613 = CARTESIAN_POINT ( 'NONE',  ( -16.00000000000000355, 20.50000000000000711, 12.00000000000000000 ) ) ;
#614 = CARTESIAN_POINT ( 'NONE',  ( -13.49999999999999822, 34.99999999999999289, 12.00000000000000000 ) ) ;
#615 = AXIS2_PLACEMENT_3D ( 'NONE', #835, #583, #183 ) ;
#616 = ADVANCED_FACE ( 'NONE', ( #212 ), #755, .F. ) ;
#617 = CARTESIAN_POINT ( 'NONE',  ( 0.000000000000000000, 66.00000000000000000, 12.00000000000000000 ) ) ;
#618 = DIRECTION ( 'NONE',  ( -1.000000000000000000, 0.000000000000000000, 0.000000000000000000 ) ) ;
#619 = ORIENTED_EDGE ( 'NONE', *, *, #830, .T. ) ;
#620 = FACE_OUTER_BOUND ( 'NONE', #269, .T. ) ;
#621 = ORIENTED_EDGE ( 'NONE', *, *, #303, .F. ) ;
#622 = EDGE_CURVE ( 'NONE', #725, #753, #591, .T. ) ;
#623 = ORIENTED_EDGE ( 'NONE', *, *, #477, .T. ) ;
#624 = DIRECTION ( 'NONE',  ( 0.000000000000000000, -0.000000000000000000, 1.000000000000000000 ) ) ;
#625 = ORIENTED_EDGE ( 'NONE', *, *, #679, .T. ) ;
#626 = CARTESIAN_POINT ( 'NONE',  ( 0.000000000000000000, 66.00000000000000000, 12.00000000000000000 ) ) ;
#627 = VECTOR ( 'NONE', #700, 1000.000000000000000 ) ;
#628 = VERTEX_POINT ( 'NONE', #420 ) ;
#629 = PERSON_AND_ORGANIZATION ( #594, #232 ) ;
#630 = LINE ( 'NONE', #225, #548 ) ;
#631 = CARTESIAN_POINT ( 'NONE',  ( -1.000000000000000888, 1.000000000000000888, 12.00000000000000000 ) ) ;
#632 = AXIS2_PLACEMENT_3D ( 'NONE', #580, #306, #387 ) ;
#633 = ORIENTED_EDGE ( 'NONE', *, *, #221, .F. ) ;
#634 = DIRECTION ( 'NONE',  ( 1.000000000000000000, 0.000000000000000000, 0.000000000000000000 ) ) ;
#635 = ORIENTED_EDGE ( 'NONE', *, *, #660, .T. ) ;
#636 = VECTOR ( 'NONE', #143, 1000.000000000000000 ) ;
#637 = ORIENTED_EDGE ( 'NONE', *, *, #239, .T. ) ;
#638 = CARTESIAN_POINT ( 'NONE',  ( -39.00000000000000000, 20.50000000000000000, 12.00000000000000000 ) ) ;
#639 = CARTESIAN_POINT ( 'NONE',  ( -51.00000000000000000, 8.500000000000000000, 12.00000000000000000 ) ) ;
#640 = CARTESIAN_POINT ( 'NONE',  ( -16.49999999999999645, 34.99999999999999289, 12.00000000000000000 ) ) ;
#641 = EDGE_CURVE ( 'NONE', #365, #491, #517, .T. ) ;
#642 = DIRECTION ( 'NONE',  ( 1.000000000000000000, 0.000000000000000000, 0.000000000000000000 ) ) ;
#643 = AXIS2_PLACEMENT_3D ( 'NONE', #585, #189, #778 ) ;
#644 = CARTESIAN_POINT ( 'NONE',  ( 0.000000000000000000, 66.00000000000000000, 12.00000000000000000 ) ) ;
#645 = AXIS2_PLACEMENT_3D ( 'NONE', #253, #709, #61 ) ;
#646 = ORIENTED_EDGE ( 'NONE', *, *, #47, .T. ) ;
#647 = DIRECTION ( 'NONE',  ( 0.000000000000000000, 0.000000000000000000, -1.000000000000000000 ) ) ;
#648 = VERTEX_POINT ( 'NONE', #607 ) ;
#649 = DATE_AND_TIME ( #299, #277 ) ;
#650 = CARTESIAN_POINT ( 'NONE',  ( 0.000000000000000000, 0.000000000000000000, 12.00000000000000000 ) ) ;
#651 = LINE ( 'NONE', #252, #465 ) ;
#652 = CARTESIAN_POINT ( 'NONE',  ( -54.00000000000000000, 4.000000000000000888, 12.00000000000000000 ) ) ;
#653 = EDGE_LOOP ( 'NONE', ( #525, #410, #57, #575 ) ) ;
#654 = EDGE_LOOP ( 'NONE', ( #393, #779, #248, #186 ) ) ;
#655 = ORIENTED_EDGE ( 'NONE', *, *, #477, .F. ) ;
#656 = LINE ( 'NONE', #188, #23 ) ;
#657 = AXIS2_PLACEMENT_3D ( 'NONE', #489, #624, #681 ) ;
#658 = VECTOR ( 'NONE', #300, 1000.000000000000000 ) ;
#659 = DIRECTION ( 'NONE',  ( 0.000000000000000000, 1.000000000000000000, -0.000000000000000000 ) ) ;
#660 = EDGE_CURVE ( 'NONE', #383, #228, #125, .T. ) ;
#661 = ORIENTED_EDGE ( 'NONE', *, *, #167, .F. ) ;
#662 = CIRCLE ( 'NONE', #366, 7.500000000000000000 ) ;
#663 = DIRECTION ( 'NONE',  ( -0.000000000000000000, -0.000000000000000000, -1.000000000000000000 ) ) ;
#664 = DATE_AND_TIME ( #471, #483 ) ;
#665 = DIRECTION ( 'NONE',  ( 1.000000000000000000, 0.000000000000000000, 0.000000000000000000 ) ) ;
#666 = VECTOR ( 'NONE', #560, 1000.000000000000000 ) ;
#667 = VERTEX_POINT ( 'NONE', #27 ) ;
#668 = DIRECTION ( 'NONE',  ( 0.000000000000000000, 0.000000000000000000, -1.000000000000000000 ) ) ;
#669 = CARTESIAN_POINT ( 'NONE',  ( -36.00000000000000000, 34.99999999999999289, 12.00000000000000000 ) ) ;
#670 = VERTEX_POINT ( 'NONE', #285 ) ;
#671 = VECTOR ( 'NONE', #484, 1000.000000000000000 ) ;
#672 = EDGE_LOOP ( 'NONE', ( #266, #623, #555, #76, #718, #33, #264, #311 ) ) ;
#673 = CARTESIAN_POINT ( 'NONE',  ( -13.00000000000000178, 20.50000000000000711, 12.00000000000000000 ) ) ;
#674 = DIRECTION ( 'NONE',  ( -0.000000000000000000, -0.000000000000000000, -1.000000000000000000 ) ) ;
#675 = ADVANCED_FACE ( 'NONE', ( #45 ), #19, .T. ) ;
#676 = LINE ( 'NONE', #354, #195 ) ;
#677 = CARTESIAN_POINT ( 'NONE',  ( 0.000000000000000000, 0.000000000000000000, 0.000000000000000000 ) ) ;
#678 = PLANE ( 'NONE',  #2 ) ;
#679 = EDGE_CURVE ( 'NONE', #290, #108, #676, .T. ) ;
#680 = AXIS2_PLACEMENT_3D ( 'NONE', #673, #803, #284 ) ;
#681 = DIRECTION ( 'NONE',  ( 1.000000000000000000, 0.000000000000000000, -0.000000000000000000 ) ) ;
#682 = ORIENTED_EDGE ( 'NONE', *, *, #571, .T. ) ;
#683 = DIRECTION ( 'NONE',  ( 1.000000000000000000, 0.000000000000000000, 0.000000000000000000 ) ) ;
#684 = AXIS2_PLACEMENT_3D ( 'NONE', #547, #13, #665 ) ;
#685 = LINE ( 'NONE', #21, #495 ) ;
#686 = ORIENTED_EDGE ( 'NONE', *, *, #456, .T. ) ;
#687 = ORIENTED_EDGE ( 'NONE', *, *, #622, .F. ) ;
#688 = PLANE ( 'NONE',  #698 ) ;
#689 = CC_DESIGN_APPROVAL ( #474, ( #576 ) ) ;
#690 = ORIENTED_EDGE ( 'NONE', *, *, #239, .F. ) ;
#691 = APPROVAL_STATUS ( 'not_yet_approved' ) ;
#692 = VECTOR ( 'NONE', #251, 1000.000000000000000 ) ;
#693 = ORIENTED_EDGE ( 'NONE', *, *, #134, .F. ) ;
#694 = LOCAL_TIME ( 18, 42, 52.00000000000000000, #131 ) ;
#695 = DIRECTION ( 'NONE',  ( -1.000000000000000000, -0.000000000000000000, -0.000000000000000000 ) ) ;
#696 = FACE_OUTER_BOUND ( 'NONE', #276, .T. ) ;
#697 = DIRECTION ( 'NONE',  ( 0.000000000000000000, 0.000000000000000000, -1.000000000000000000 ) ) ;
#698 = AXIS2_PLACEMENT_3D ( 'NONE', #154, #494, #100 ) ;
#699 = EDGE_CURVE ( 'NONE', #464, #723, #161, .T. ) ;
#700 = DIRECTION ( 'NONE',  ( 0.000000000000000000, -1.000000000000000000, 0.000000000000000000 ) ) ;
#701 = DIRECTION ( 'NONE',  ( 1.000000000000000000, 0.000000000000000000, 0.000000000000000000 ) ) ;
#702 = EDGE_LOOP ( 'NONE', ( #788, #203 ) ) ;
#703 = LINE ( 'NONE', #451, #692 ) ;
#704 = FACE_OUTER_BOUND ( 'NONE', #255, .T. ) ;
#705 = CARTESIAN_POINT ( 'NONE',  ( -52.00000000000000000, 8.500000000000000000, 12.00000000000000000 ) ) ;
#706 = CARTESIAN_POINT ( 'NONE',  ( -54.00000000000000000, 8.500000000000000000, 12.00000000000000000 ) ) ;
#707 = ORIENTED_EDGE ( 'NONE', *, *, #196, .T. ) ;
#708 = DIRECTION ( 'NONE',  ( -0.000000000000000000, -0.000000000000000000, -1.000000000000000000 ) ) ;
#709 = DIRECTION ( 'NONE',  ( 1.000000000000000000, 0.000000000000000000, 0.000000000000000000 ) ) ;
#710 = CARTESIAN_POINT ( 'NONE',  ( -51.00000000000000000, 16.00000000000000000, 12.00000000000000000 ) ) ;
#711 = AXIS2_PLACEMENT_3D ( 'NONE', #727, #367, #744 ) ;
#712 = ORIENTED_EDGE ( 'NONE', *, *, #679, .F. ) ;
#713 = LINE ( 'NONE', #201, #636 ) ;
#714 = ORIENTED_EDGE ( 'NONE', *, *, #152, .F. ) ;
#715 = LINE ( 'NONE', #748, #174 ) ;
#716 = DESIGN_CONTEXT ( 'detailed design', #500, 'design' ) ;
#717 = ORIENTED_EDGE ( 'NONE', *, *, #270, .T. ) ;
#718 = ORIENTED_EDGE ( 'NONE', *, *, #487, .F. ) ;
#719 = VECTOR ( 'NONE', #145, 1000.000000000000000 ) ;
#720 = EDGE_CURVE ( 'NONE', #769, #491, #630, .T. ) ;
#721 = VERTEX_POINT ( 'NONE', #485 ) ;
#722 = AXIS2_PLACEMENT_3D ( 'NONE', #508, #827, #46 ) ;
#723 = VERTEX_POINT ( 'NONE', #558 ) ;
#724 = CARTESIAN_POINT ( 'NONE',  ( -39.00000000000000000, 34.99999999999999289, 0.000000000000000000 ) ) ;
#725 = VERTEX_POINT ( 'NONE', #296 ) ;
#726 = AXIS2_PLACEMENT_3D ( 'NONE', #240, #701, #320 ) ;
#727 = CARTESIAN_POINT ( 'NONE',  ( -39.00000000000000000, 20.50000000000000000, 12.00000000000000000 ) ) ;
#728 = DIRECTION ( 'NONE',  ( 0.000000000000000000, 0.000000000000000000, 1.000000000000000000 ) ) ;
#729 = CIRCLE ( 'NONE', #187, 3.000000000000002665 ) ;
#730 = ORIENTED_EDGE ( 'NONE', *, *, #720, .F. ) ;
#731 = PERSON_AND_ORGANIZATION ( #594, #232 ) ;
#732 = DIRECTION ( 'NONE',  ( -0.000000000000000000, -0.000000000000000000, -1.000000000000000000 ) ) ;
#733 = FACE_BOUND ( 'NONE', #519, .T. ) ;
#734 = ADVANCED_FACE ( 'NONE', ( #696 ), #841, .F. ) ;
#735 = DIRECTION ( 'NONE',  ( 0.000000000000000000, 0.000000000000000000, -1.000000000000000000 ) ) ;
#736 = AXIS2_PLACEMENT_3D ( 'NONE', #840, #62, #523 ) ;
#737 = VERTEX_POINT ( 'NONE', #302 ) ;
#738 = CARTESIAN_POINT ( 'NONE',  ( -10.00000000000000000, 20.50000000000000711, 12.00000000000000000 ) ) ;
#739 = CARTESIAN_POINT ( 'NONE',  ( -51.00000000000000000, 0.000000000000000000, 0.000000000000000000 ) ) ;
#740 = ORIENTED_EDGE ( 'NONE', *, *, #210, .T. ) ;
#741 = LINE ( 'NONE', #91, #447 ) ;
#742 = EDGE_CURVE ( 'NONE', #725, #628, #233, .T. ) ;
#743 = EDGE_LOOP ( 'NONE', ( #498, #156, #390, #514 ) ) ;
#744 = DIRECTION ( 'NONE',  ( -1.000000000000000000, 0.000000000000000000, 0.000000000000000000 ) ) ;
#745 = ORIENTED_EDGE ( 'NONE', *, *, #97, .T. ) ;
#746 = DIRECTION ( 'NONE',  ( -1.000000000000000000, 0.000000000000000000, 0.000000000000000000 ) ) ;
#747 = VERTEX_POINT ( 'NONE', #561 ) ;
#748 = CARTESIAN_POINT ( 'NONE',  ( -42.00000000000000000, 20.50000000000000000, 12.00000000000000000 ) ) ;
#749 = CC_DESIGN_PERSON_AND_ORGANIZATION_ASSIGNMENT ( #137, #826, ( #576 ) ) ;
#750 = ORIENTED_EDGE ( 'NONE', *, *, #409, .T. ) ;
#751 = ADVANCED_FACE ( 'NONE', ( #704 ), #461, .F. ) ;
#752 = LINE ( 'NONE', #650, #208 ) ;
#753 = VERTEX_POINT ( 'NONE', #35 ) ;
#754 = AXIS2_PLACEMENT_3D ( 'NONE', #138, #610, #668 ) ;
#755 = CYLINDRICAL_SURFACE ( 'NONE', #541, 7.500000000000000000 ) ;
#756 =( NAMED_UNIT ( * ) PLANE_ANGLE_UNIT ( ) SI_UNIT ( $, .RADIAN. ) );
#757 = CARTESIAN_POINT ( 'NONE',  ( -52.00000000000000000, 66.00000000000000000, 12.00000000000000000 ) ) ;
#758 = EDGE_LOOP ( 'NONE', ( #89, #504, #619, #538 ) ) ;
#759 = FACE_OUTER_BOUND ( 'NONE', #430, .T. ) ;
#760 = CIRCLE ( 'NONE', #352, 4.500000000000000000 ) ;
#761 = DIRECTION ( 'NONE',  ( -0.000000000000000000, 1.000000000000000000, -0.000000000000000000 ) ) ;
#762 = VERTEX_POINT ( 'NONE', #631 ) ;
#763 = CARTESIAN_POINT ( 'NONE',  ( -52.00000000000000000, 66.00000000000000000, 12.00000000000000000 ) ) ;
#764 = EDGE_CURVE ( 'NONE', #31, #122, #325, .T. ) ;
#765 = DIRECTION ( 'NONE',  ( -0.000000000000000000, -0.000000000000000000, -1.000000000000000000 ) ) ;
#766 = AXIS2_PLACEMENT_3D ( 'NONE', #385, #511, #831 ) ;
#767 = VERTEX_POINT ( 'NONE', #819 ) ;
#768 = DIRECTION ( 'NONE',  ( -0.000000000000000000, -0.000000000000000000, -1.000000000000000000 ) ) ;
#769 = VERTEX_POINT ( 'NONE', #438 ) ;
#770 = DIRECTION ( 'NONE',  ( 0.000000000000000000, 0.000000000000000000, -1.000000000000000000 ) ) ;
#771 = DIRECTION ( 'NONE',  ( 1.000000000000000000, 0.000000000000000000, 0.000000000000000000 ) ) ;
#772 = VECTOR ( 'NONE', #59, 1000.000000000000000 ) ;
#773 = DIRECTION ( 'NONE',  ( 1.000000000000000000, 0.000000000000000000, 0.000000000000000000 ) ) ;
#774 = LINE ( 'NONE', #441, #384 ) ;
#775 = DIRECTION ( 'NONE',  ( 1.000000000000000000, 0.000000000000000000, 0.000000000000000000 ) ) ;
#776 = ADVANCED_FACE ( 'NONE', ( #341 ), #816, .T. ) ;
#777 = LINE ( 'NONE', #30, #84 ) ;
#778 = DIRECTION ( 'NONE',  ( 0.000000000000000000, 0.000000000000000000, -1.000000000000000000 ) ) ;
#779 = ORIENTED_EDGE ( 'NONE', *, *, #182, .T. ) ;
#780 = AXIS2_PLACEMENT_3D ( 'NONE', #246, #249, #642 ) ;
#781 = VERTEX_POINT ( 'NONE', #434 ) ;
#782 = VECTOR ( 'NONE', #317, 1000.000000000000000 ) ;
#783 = EDGE_LOOP ( 'NONE', ( #207, #191, #818, #449, #338, #545, #180 ) ) ;
#784 = EDGE_CURVE ( 'NONE', #753, #670, #715, .T. ) ;
#785 = CARTESIAN_POINT ( 'NONE',  ( -42.00000000000000000, 34.99999999999999289, 12.00000000000000000 ) ) ;
#786 = DIRECTION ( 'NONE',  ( -0.000000000000000000, -0.000000000000000000, -1.000000000000000000 ) ) ;
#787 = VECTOR ( 'NONE', #424, 1000.000000000000000 ) ;
#788 = ORIENTED_EDGE ( 'NONE', *, *, #210, .F. ) ;
#789 = DATE_AND_TIME ( #123, #312 ) ;
#790 = LINE ( 'NONE', #99, #8 ) ;
#791 = CARTESIAN_POINT ( 'NONE',  ( -51.00000000000000000, 8.500000000000000000, 12.00000000000000000 ) ) ;
#792 = DIRECTION ( 'NONE',  ( 0.000000000000000000, 0.000000000000000000, 1.000000000000000000 ) ) ;
#793 = AXIS2_PLACEMENT_3D ( 'NONE', #295, #683, #229 ) ;
#794 = CARTESIAN_POINT ( 'NONE',  ( -10.00000000000000000, 20.50000000000000711, 12.00000000000000000 ) ) ;
#795 = ADVANCED_FACE ( 'NONE', ( #529 ), #678, .F. ) ;
#796 = DIRECTION ( 'NONE',  ( 0.000000000000000000, 0.000000000000000000, 1.000000000000000000 ) ) ;
#797 = ORIENTED_EDGE ( 'NONE', *, *, #456, .F. ) ;
#798 = CIRCLE ( 'NONE', #632, 4.500000000000000000 ) ;
#799 = EDGE_LOOP ( 'NONE', ( #714, #344, #404, #94 ) ) ;
#800 = SHAPE_DEFINITION_REPRESENTATION ( #355, #524 ) ;
#801 = CC_DESIGN_DATE_AND_TIME_ASSIGNMENT ( #789, #569, ( #576 ) ) ;
#802 = ADVANCED_FACE ( 'NONE', ( #356 ), #223, .F. ) ;
#803 = DIRECTION ( 'NONE',  ( -0.000000000000000000, -0.000000000000000000, -1.000000000000000000 ) ) ;
#804 = DIRECTION ( 'NONE',  ( 0.000000000000000000, 0.000000000000000000, 1.000000000000000000 ) ) ;
#805 = LINE ( 'NONE', #347, #67 ) ;
#806 = CARTESIAN_POINT ( 'NONE',  ( -13.00000000000000178, 20.50000000000000711, 12.00000000000000000 ) ) ;
#807 = EDGE_CURVE ( 'NONE', #415, #429, #790, .T. ) ;
#808 = AXIS2_PLACEMENT_3D ( 'NONE', #606, #342, #78 ) ;
#809 = DIRECTION ( 'NONE',  ( -0.000000000000000000, -0.000000000000000000, -1.000000000000000000 ) ) ;
#810 = ORIENTED_EDGE ( 'NONE', *, *, #641, .T. ) ;
#811 = CARTESIAN_POINT ( 'NONE',  ( -54.00000000000000000, 1.000000000000000888, 12.00000000000000000 ) ) ;
#812 = ORIENTED_EDGE ( 'NONE', *, *, #152, .T. ) ;
#813 = CALENDAR_DATE ( 2021, 3, 2 ) ;
#814 = AXIS2_PLACEMENT_3D ( 'NONE', #417, #82, #65 ) ;
#815 = LINE ( 'NONE', #540, #437 ) ;
#816 = PLANE ( 'NONE',  #657 ) ;
#817 = ORIENTED_EDGE ( 'NONE', *, *, #641, .F. ) ;
#818 = ORIENTED_EDGE ( 'NONE', *, *, #286, .F. ) ;
#819 = CARTESIAN_POINT ( 'NONE',  ( -51.00000000000000000, 8.500000000000000000, 4.500000000000000888 ) ) ;
#820 = VERTEX_POINT ( 'NONE', #359 ) ;
#821 = APPLICATION_PROTOCOL_DEFINITION ( 'international standard', 'config_control_design', 1994, #500 ) ;
#822 = VERTEX_POINT ( 'NONE', #158 ) ;
#823 = FACE_OUTER_BOUND ( 'NONE', #842, .T. ) ;
#824 = ORIENTED_EDGE ( 'NONE', *, *, #807, .F. ) ;
#825 = CARTESIAN_POINT ( 'NONE',  ( 0.000000000000000000, 8.500000000000000000, 7.500000000000000888 ) ) ;
#826 = PERSON_AND_ORGANIZATION_ROLE ( 'creator' ) ;
#827 = DIRECTION ( 'NONE',  ( -1.000000000000000000, -0.000000000000000000, -0.000000000000000000 ) ) ;
#828 = LINE ( 'NONE', #811, #658 ) ;
#829 = DIRECTION ( 'NONE',  ( 1.000000000000000000, 0.000000000000000000, 0.000000000000000000 ) ) ;
#830 = EDGE_CURVE ( 'NONE', #747, #762, #828, .T. ) ;
#831 = DIRECTION ( 'NONE',  ( 0.000000000000000000, 0.000000000000000000, -1.000000000000000000 ) ) ;
#832 = CARTESIAN_POINT ( 'NONE',  ( -51.00000000000000000, 8.500000000000000000, 12.00000000000000000 ) ) ;
#833 = VERTEX_POINT ( 'NONE', #297 ) ;
#834 = LINE ( 'NONE', #389, #627 ) ;
#835 = CARTESIAN_POINT ( 'NONE',  ( -52.00000000000000000, 8.500000000000000000, 12.00000000000000000 ) ) ;
#836 = ORIENTED_EDGE ( 'NONE', *, *, #530, .F. ) ;
#837 = DATE_AND_TIME ( #103, #694 ) ;
#838 = ADVANCED_FACE ( 'NONE', ( #25, #733, #335, #486, #315 ), #688, .F. ) ;
#839 = CARTESIAN_POINT ( 'NONE',  ( 0.000000000000000000, 0.000000000000000000, 12.00000000000000000 ) ) ;
#840 = CARTESIAN_POINT ( 'NONE',  ( -13.49999999999999822, 34.99999999999999289, 12.00000000000000000 ) ) ;
#841 = CYLINDRICAL_SURFACE ( 'NONE', #711, 3.000000000000002665 ) ;
#842 = EDGE_LOOP ( 'NONE', ( #740, #812, #98, #587 ) ) ;
ENDSEC;
END-ISO-10303-21;
