{
  "   Description - Game   ": "",
  "quarterLength": "90",
  "allowedRoomsToBuyCount": "100",
  "numberRoomsDeluxBecomeAvailable": "5",
  "   Description - Hotel   ": "",
  "MoneySuburbs": "75000",
  "MonthlyPaymentsSuburbs": "7500",
  "PopularitySuburbs": "80",
  "CompetitorCostDeluxSuburbs": "90",
  "CompetitorCostStandardSuburbs": "50",
  "MoneyMiddleCity": "50000",
  "MonthlyPaymentsMiddleCity": "10000",
  "PopularityMiddleCity": "100",
  "CompetitorCostDeluxMiddleCity": "110",
  "CompetitorCostStandardMiddleCity": "70",
  "MoneyCenter": "33000",
  "MonthlyPaymentsCenter": "15000",
  "PopularityCenter": "120",
  "CompetitorCostDeluxCenter": "160",
  "CompetitorCostStandardCenter": "100",
  "   Description - Bank   ": "",
  "AdditionalCreditPerRound": "5000",
  "InterestRate": "0,1",
  "InterestRateIncrease": "0,02",
  "MaxCredit": "50000",
  "   Description - RoomStandard   ": "",
  "RoomStandardIncomePerDay": "100",
  "RoomStandardCostPerDay": "50",
  "RoomStandardBuyCost": "12000",
  "   Description - RoomDelux   ": "",
  "RoomDeluxIncomePerDay": "200",
  "RoomDeluxCostPerDay": "75",
  "RoomDeluxBuyCost": "30000",
  "   Description - Workers   ": "",
  "minimumWage": "3000",
  "averageWage": "5000",
  "defaultMonthlyPayment": "5000",
  "defaultHappiness": "100"
}