Place,Name,Sex,BirthDate,Equipment,Division,BodyweightKg,WeightClassKg,Squat1Kg,Squat2Kg,Squat3Kg,Best3SquatKg,Bench1Kg,Bench2Kg,Bench3Kg,Best3BenchKg,Deadlift1Kg,Deadlift2Kg,Deadlift3Kg,Best3DeadliftKg,TotalKg,Event
NS,Angie Clark,F,1969-06-21,Raw,Open,,,,,,,,,,,,,,,,SBD
1,Anouk Wandeler,F,1998-06-12,Raw,Open,53.8,57,112.5,117.5,120,120,60,62.5,65,65,140,145,150.5,150.5,335.5,SBD
1,Anna Henzi,F,1992-12-27,Raw,Open,61.1,63,122.5,130,137.5,137.5,92.5,97.5,100,100,145,155,-160,155,392.5,SBD
2,Noémi Weiss,F,1995-09-23,Raw,Open,60.3,63,112.5,117.5,122.5,122.5,60,62.5,65,65,147.5,155,-162.5,155,342.5,SBD
1,Chiara Luraschi,F,1997-12-20,Raw,Open,64,69,130,137.5,145,145,77.5,82.5,85,85,170,180,-190.5,180,410,SBD
2,Laura Rettig,F,1992-06-02,Raw,Open,65.7,69,125,132.5,137.5,137.5,65,67.5,70,70,160,170,175,175,382.5,SBD
3,Deborah Pungitore,F,1990-07-27,Raw,Open,66.1,69,130,137.5,142.5,142.5,80,85,87.5,87.5,140,150,-157.5,150,380,SBD
4,Verónica Gattuso,F,1999-08-03,Raw,Open,65.3,69,110,117.5,125,125,65,70,75,75,140,150,160,160,360,SBD
5,Daniela Niklaus,F,1986-01-22,Raw,Open,65.7,69,100,105,110,110,70,75,80,80,140,150,155,155,345,SBD
6,Anja Buchmann,F,2003-08-01,Raw,Open,65.3,69,97.5,105,-110,105,62.5,67.5,70,70,145,155,162.5,162.5,337.5,SBD
7,Iryna Kupryienka,F,1981-01-15,Raw,Open,63.2,69,97.5,102.5,105,105,60,65,67.5,67.5,107.5,115,120,120,292.5,SBD
1,Riccarda Küng,F,1999-12-20,Raw,Open,74.9,76,155,163,-165.5,163,77.5,80,-82.5,80,180,190,195.5,195.5,438.5,SBD
2,Andrea Marx,F,1993-03-27,Raw,Open,74.3,76,145,152.5,160,160,87.5,92.5,-95.5,92.5,167.5,180,-192.5,180,432.5,SBD
3,Malgorzata Becker,F,1989-11-26,Raw,Open,75.2,76,135,140,145,145,80,85,87.5,87.5,170,180,190,190,422.5,SBD
4,Nadine Schöb,F,1999-02-12,Raw,Open,75.1,76,147.5,157.5,165,165,-70,-70,70,70,165,175,-185,175,410,SBD
1,Mary Ekiru,F,1987-06-02,Raw,Open,99.9,84+,130,135,140,140,82.5,90,-95.5,90,165,175,182.5,182.5,412.5,SBD
2,Debora Fischer,F,1991-08-24,Raw,Open,93,84+,105,115,-117.5,115,82.5,87.5,90,90,130,140,150,150,355,SBD
NS,Aljosha Friedländer,M,1986-12-10,Raw,Open,,,,,,,,,,,,,,,,SBD
NS,Tom Thoma,M,1988-02-25,Raw,Open,,,,,,,,,,,,,,,,SBD
1,Janis Brunner,M,1993-09-29,Raw,Open,58.4,59,125,132.5,-140,132.5,-87.5,95,-100,95,175,190,200,200,427.5,SBD
1,Lars Willi,M,2000-11-22,Raw,Open,73.7,74,140,150,160,160,92.5,97.5,102.5,102.5,155,170,185,185,447.5,SBD
1,Adrian van Schie,M,1993-07-23,Raw,Open,80.7,83,210,220,230,230,112.5,117.5,-120,117.5,220,232.5,240,240,587.5,SBD
2,Mathias Braun,M,1977-10-21,Raw,Open,82.7,83,210,225,-235,225,120,130,-135,130,200,220,-232.5,220,575,SBD
3,David Ochsner,M,1993-06-29,Raw,Open,80.7,83,170,177.5,185,185,130,135,140,140,200,215,225,225,550,SBD
4,Kevin von Niederhäusern,M,1992-06-22,Raw,Open,82.5,83,167.5,175,182.5,182.5,-127.5,130,-132.5,130,195,205,210,210,522.5,SBD
5,Sandro Trottmann,M,1988-02-22,Raw,Open,82.1,83,175,185,192.5,192.5,115,122.5,125,125,182.5,195,202.5,202.5,520,SBD
6,Lukas Tannheimer,M,2002-03-25,Raw,Open,81.8,83,180,190,195,195,100,105,110,110,205,210,212.5,212.5,517.5,SBD
7,Livio Strahm,M,2003-04-15,Raw,Open,82,83,140,155,165,165,100,-110,-115,100,200,-215,-215,200,465,SBD
8,Daniel Foltz-Morrison,M,1987-07-28,Raw,Open,76.7,83,135,-142.5,,135,82.5,87.5,90,90,167.5,177.5,182.5,182.5,407.5,SBD
1,Raphael Sauta,M,1994-11-18,Raw,Open,89.2,93,215,230,240,240,145,155,165,165,260,280,-290,280,685,SBD
2,Dennis Goodtzov,M,1996-11-22,Raw,Open,90.3,93,227.5,240,247.5,247.5,137.5,145,-150,145,270,-285,-295,270,662.5,SBD
3,Tim Hardegger,M,1999-04-29,Raw,Open,89.3,93,210,225,-232.5,225,130,-142.5,-142.5,130,250,260,-265,260,615,SBD
4,Maximilian Becker,M,1993-01-12,Raw,Open,88.4,93,202.5,215,-225,215,140,145,150,150,207.5,220,230,230,595,SBD
5,Thomas Zurfluh,M,1986-04-26,Raw,Open,91.9,93,200,205,-210,205,130,-135,-135,130,240,252.5,-262.5,252.5,587.5,SBD
6,Jonas Wyss,M,1998-02-01,Raw,Open,85.4,93,200,210,215,215,112.5,117.5,125,125,210,225,235,235,575,SBD
7,Benjamin Hostettler,M,2004-02-28,Raw,Open,89.8,93,190,200,210,210,107.5,115,120,120,207.5,220,227.5,227.5,557.5,SBD
8,Zejdul Hajr Supuk,M,2000-10-27,Raw,Open,88,93,170,182.5,190,190,-125,130,-140,130,210,220,225,225,545,SBD
9,Nico Coppola,M,1995-01-27,Raw,Open,91.1,93,175,180,-190,180,130,135,-140,135,210,220,230,230,545,SBD
10,Peter Hofer,M,1963-08-22,Raw,Open,86.9,93,170,180,-185,180,110,-115,115,115,210,220,227.5,227.5,522.5,SBD
11,Andreas Messmer,M,1984-12-24,Raw,Open,88.4,93,175,187.5,192.5,192.5,107.5,112.5,115,115,190,205,215,215,522.5,SBD
12,Cédric Schöni,M,1998-05-11,Raw,Open,87.7,93,170,185,190,190,115,130,-135,130,200,-225,-225,200,520,SBD
13,Luigi De Rosa,M,1977-10-11,Raw,Open,87.7,93,157.5,165,170,170,107.5,115,117.5,117.5,180,190,200,200,487.5,SBD
14,Manuel Meyer,M,1979-04-06,Raw,Open,91.5,93,150,160,-165,160,100,107.5,-112.5,107.5,175,180,187.5,187.5,455,SBD
15,Manuel Scherzinger,M,1982-04-20,Raw,Open,87,93,110,120,130,130,100,105,107.5,107.5,170,180,195,195,432.5,SBD
16,Nils Rubitschon,M,2005-08-01,Raw,Open,85.2,93,117.5,127.5,-135,127.5,80,85,90,90,175,185,195,195,412.5,SBD
1,Benjamin Brög,M,1990-06-30,Raw,Open,104.6,105,260,280,,280,175,190,195,195,250,270,-280,270,745,SBD
2,Luca Cirone,M,1986-12-14,Raw,Open,103.6,105,215,230,242.5,242.5,150,155,157.5,157.5,275,290,-300,290,690,SBD
3,Fabian Baumgartner,M,1993-07-23,Raw,Open,104.2,105,230,242.5,247.5,247.5,140,-152.5,152.5,152.5,235,-250,255,255,655,SBD
4,Sebastian Traub,M,1994-04-20,Raw,Open,99.5,105,195,210,220,220,-145,150,-155,150,220,230,240,240,610,SBD
5,Peter Schönenberger,M,1970-12-30,Raw,Open,103.9,105,180,-190,-195,180,147.5,155,160,160,195,210,220,220,560,SBD
6,Philipp Kupper,M,1984-07-27,Raw,Open,103.6,105,180,190,195,195,115,122.5,-127.5,122.5,185,195,-200,195,512.5,SBD
1,Daniele Pola,M,1997-10-10,Raw,Open,113.4,120,255,276,285,285,165,175,182.5,182.5,255,275,290,290,757.5,SBD
2,Pascal Imhof,M,1982-05-06,Raw,Open,118.7,120,240,250,-260,250,185,-195,-195,185,290,305,-310,305,740,SBD
3,Georgi Kostadinov,M,1984-08-08,Raw,Open,108.4,120,225,240,245,245,150,155,-160,155,230,242.5,250,250,650,SBD
4,Claas Lemkemeier,M,1989-09-05,Raw,Open,111.5,120,225,235,240,240,140,150,-155,150,220,230,235,235,625,SBD
5,Mario Wanger,M,1989-06-21,Raw,Open,110.3,120,190,200,210,210,132.5,140,145,145,215,230,245,245,600,SBD
6,Silvano Senn,M,1984-03-20,Raw,Open,106.9,120,190,205,210,210,120,-130,-130,120,220,240,255,255,585,SBD
1,Christoph Buechi,M,1975-04-09,Raw,Open,137.8,120+,270,290,300,300,180,195,202.5,202.5,270,300,,300,802.5,SBD
