Division,WeightClassKg,Place,Name,Team,BodyweightKg,Best3SquatKg,Best3BenchKg,Best3DeadliftKg,TotalKg,Equipment,Event,Sex
Boys,51.71,1,George Garcia,San Antonio Memorial,49.9,83.91,56.7,108.86,249.48,Single-ply,SBD,M
Boys,51.71,2,Brandon Fernandez,Poteet,44.36,92.99,52.16,102.06,247.21,Single-ply,SBD,M
Boys,51.71,3,Domingo Flores,San Antonio Kennedy,47.99,65.77,38.56,70.31,174.63,Single-ply,SBD,M
Boys,55.79,1,Michael Mitchell,San Antonio Southside,55.57,165.56,97.52,183.7,446.79,Single-ply,SBD,M
Boys,55.79,2,Joey Garcia,Marion,54.43,113.4,65.77,136.08,315.25,Single-ply,SBD,M
Boys,55.79,3,Michael Gonzales,San Antonio Memorial,54.43,43.09,45.36,102.06,190.51,Single-ply,SBD,M
Boys,59.87,1,Jose Trevino,San Antonio Southside,59.15,206.38,111.13,195.04,512.56,Single-ply,SBD,M
Boys,59.87,2,Elijah Gonzales,San Antonio East Central,59.87,183.7,120.2,208.65,512.56,Single-ply,SBD,M
Boys,59.87,3,Nicholas Garcia,San Antonio Southside,59.15,145.15,92.99,172.37,410.5,Single-ply,SBD,M
Boys,59.87,4,Adrian Garcia,Pearsall,58.6,147.42,92.99,167.83,408.23,Single-ply,SBD,M
Boys,59.87,5,Ulysses Solis,San Antonio East Central,59.65,145.15,70.31,163.29,378.75,Single-ply,SBD,M
Boys,59.87,6,Matthew Gautier,Marion,59.87,115.67,88.45,170.1,374.21,Single-ply,SBD,M
Boys,67.13,1,AJ Salas,San Antonio Southside,66.22,213.19,124.74,195.04,532.97,Single-ply,SBD,M
Boys,67.13,2,Raul Guerra,Poteet,64.5,163.29,106.59,188.24,458.13,Single-ply,SBD,M
Boys,67.13,3,Aaron Realme,Pearsall,67.13,172.37,102.06,183.7,458.13,Single-ply,SBD,M
Boys,67.13,4,Hunter Long,San Antonio Brooks Academy,62.14,149.69,86.18,165.56,401.43,Single-ply,SBD,M
Boys,67.13,5,Joel Huerta,San Antonio East Central,65.32,158.76,83.91,149.69,392.36,Single-ply,SBD,M
Boys,67.13,6,Guillermo Campos,San Antonio Southwest,66.04,140.61,83.91,161.03,385.55,Single-ply,SBD,M
Boys,67.13,7,Aaron Sanchez,Poteet,66,117.93,83.91,140.61,342.46,Single-ply,SBD,M
Boys,67.13,8,Jacob Youngblood,Pearsall,67.13,117.93,88.45,133.81,340.19,Single-ply,SBD,M
Boys,67.13,9,Joe Anthony Oliva,Poteet,63.5,106.59,72.57,149.69,328.85,Single-ply,SBD,M
Boys,67.13,10,Josh Pawlik,Pearsall,63.78,106.59,79.38,142.88,328.85,Single-ply,SBD,M
Boys,67.13,11,Blake Bentley,Pearsall,66.04,102.06,61.23,92.99,256.28,Single-ply,SBD,M
Boys,74.84,1,Matthew Collier,San Antonio Southside,72.76,217.72,115.67,219.99,553.38,Single-ply,SBD,M
Boys,74.84,2,Edward Luna,San Antonio East Central,74.84,183.7,102.06,219.99,505.76,Single-ply,SBD,M
Boys,74.84,3,Ivan Fernandez,Castroville Medina Valley,72.35,170.1,111.13,192.78,474,Single-ply,SBD,M
Boys,74.84,4,Jacob Meis,Castroville Medina Valley,70.76,167.83,111.13,183.7,462.66,Single-ply,SBD,M
Boys,74.84,5,Christian Rodriguez #7,San Antonio Southside,73.26,158.76,115.67,172.37,446.79,Single-ply,SBD,M
Boys,74.84,6,Gilibaldo Garcia,San Antonio Brooks Academy,72.8,165.56,90.72,188.24,444.52,Single-ply,SBD,M
Boys,74.84,7,Jon Daigle,Marion,71.21,158.76,97.52,158.76,415.04,Single-ply,SBD,M
Boys,74.84,8,Sol Rodriguez,Pearsall,73.48,151.95,102.06,147.42,401.43,Single-ply,SBD,M
Boys,74.84,9,Abel Carrasco,San Antonio Southwest,74.84,156.49,70.31,163.29,390.09,Single-ply,SBD,M
Boys,74.84,10,Cristino Garcia,San Antonio Kennedy,70.4,133.81,92.99,142.88,369.68,Single-ply,SBD,M
Boys,74.84,11,Jarrett Wallen,Marion,72.57,92.99,65.77,136.08,294.84,Single-ply,SBD,M
Boys,74.84,DQ,Sergio Villarreal,Castroville Medina Valley,73.03,,,,,Single-ply,SBD,M
Boys,74.84,DQ,Timothy Carrasco,Poteet,73.48,,,,,Single-ply,SBD,M
Boys,82.1,1,Robert Llanas,San Antonio East Central,81.65,210.92,124.74,217.72,553.38,Single-ply,SBD,M
Boys,82.1,2,Adrian Sustaita,Castroville Medina Valley,80.97,188.24,108.86,201.85,498.95,Single-ply,SBD,M
Boys,82.1,3,Elliot Ramirez,San Antonio Memorial,78.93,183.7,108.86,188.24,480.81,Single-ply,SBD,M
Boys,82.1,4,Kenton Spriggs,Marion,80.51,158.76,111.13,179.17,449.06,Single-ply,SBD,M
Boys,82.1,5,Nick Talamantez,San Antonio Southwest,82.1,156.49,117.93,165.56,439.98,Single-ply,SBD,M
Boys,82.1,6,Isaac Corral,San Antonio Southwest,80.74,165.56,81.65,174.63,421.84,Single-ply,SBD,M
Boys,82.1,7,Bradley Tate,San Antonio East Central,80.92,142.88,106.59,158.76,408.23,Single-ply,SBD,M
Boys,82.1,8,Nathan Zanbrana,San Antonio Southwest,76.93,142.88,92.99,170.1,405.97,Single-ply,SBD,M
Boys,82.1,9,Darwin Naguit,San Antonio Southwest,77.2,142.88,92.99,156.49,392.36,Single-ply,SBD,M
Boys,82.1,10,Demetrius Brown,San Antonio Memorial,82.1,142.88,79.38,167.83,390.09,Single-ply,SBD,M
Boys,82.1,11,Victor Galvan,San Antonio Memorial,80.74,138.35,77.11,127.01,342.46,Single-ply,SBD,M
Boys,82.1,12,Richard Andrade,Castroville Medina Valley,80.01,104.33,79.38,133.81,317.51,Single-ply,SBD,M
Boys,82.1,13,Francisco Salinas,San Antonio Memorial,80.74,138.35,61.23,106.59,306.17,Single-ply,SBD,M
Boys,82.1,14,Noah Leal,Pearsall,82.1,122.47,61.23,122.47,306.17,Single-ply,SBD,M
Boys,82.1,DQ,Michael Gomez #1,Poteet,80.01,,,,,Single-ply,SBD,M
Boys,82.1,DQ,Ruben Pimentel,San Antonio Memorial,81.65,,,,,Single-ply,SBD,M
Boys,89.81,1,Ashton Williams,San Antonio East Central,88.22,222.26,145.15,219.99,587.4,Single-ply,SBD,M
Boys,89.81,2,Nathon Cantu,San Antonio Brooks Academy,89.36,226.8,156.49,204.12,587.4,Single-ply,SBD,M
Boys,89.81,3,Adam Garcia #2,San Antonio Southside,86.36,213.19,145.15,215.46,573.79,Single-ply,SBD,M
Boys,89.81,4,Mateo Garcia,San Antonio Memorial,89.81,201.85,120.2,201.85,523.9,Single-ply,SBD,M
Boys,89.81,5,Tristan Rodriguez,San Antonio East Central,86.86,204.12,122.47,195.04,521.63,Single-ply,SBD,M
Boys,89.81,6,Samuel Castillo,San Antonio East Central,83.91,197.31,136.08,183.7,517.1,Single-ply,SBD,M
Boys,89.81,7,Efrain Sanchez,San Antonio Southwest,86.82,210.92,104.33,188.24,503.49,Single-ply,SBD,M
Boys,89.81,8,Miguel Cedillo,San Antonio Southside,84.82,190.51,120.2,185.97,496.68,Single-ply,SBD,M
Boys,89.81,9,Houston Crawford,Castroville Medina Valley,89.36,179.17,104.33,170.1,453.59,Single-ply,SBD,M
Boys,89.81,10,Josh Montez,San Antonio Southwest,85.28,161.03,90.72,185.97,437.72,Single-ply,SBD,M
Boys,89.81,11,Kage Armstrong,Marion,86.64,147.42,83.91,176.9,408.23,Single-ply,SBD,M
Boys,89.81,12,Jacob Doerr,Marion,86.91,145.15,90.72,156.49,392.36,Single-ply,SBD,M
Boys,89.81,13,Jose Perez #10,San Antonio Kennedy,83.14,145.15,92.99,145.15,383.29,Single-ply,SBD,M
Boys,89.81,14,Myles Riggs,Marion,83.23,113.4,68.04,136.08,317.51,Single-ply,SBD,M
Boys,89.81,15,Adriel Tovar,Poteet,88.45,92.99,77.11,142.88,312.98,Single-ply,SBD,M
Boys,89.81,16,Michael Vriegas,San Antonio Kennedy,87.91,83.91,77.11,136.08,297.1,Single-ply,SBD,M
Boys,99.79,1,Patrick Zaiontz,San Antonio Brooks Academy,97.75,179.17,170.1,224.53,573.79,Single-ply,SBD,M
Boys,99.79,2,Mark Sustaita,Castroville Medina Valley,92.35,204.12,136.08,219.99,560.19,Single-ply,SBD,M
Boys,99.79,3,Roy Trevino,Poteet,95.03,204.12,124.74,215.46,544.31,Single-ply,SBD,M
Boys,99.79,4,Brandon Cotton,San Antonio Southwest,90.45,192.78,117.93,192.78,503.49,Single-ply,SBD,M
Boys,99.79,5,Cole Doerr,Marion,93.89,174.63,111.13,195.04,480.81,Single-ply,SBD,M
Boys,99.79,6,Manny Valverde,San Antonio Memorial,95.71,185.97,124.74,170.1,480.81,Single-ply,SBD,M
Boys,99.79,7,Ryan Bechtel,Marion,99.79,188.24,90.72,199.58,478.54,Single-ply,SBD,M
Boys,99.79,8,Zach Zamarripa,San Antonio Memorial,96.16,183.7,106.59,172.37,462.66,Single-ply,SBD,M
Boys,99.79,9,Josh Duran,Marion,94.57,154.22,106.59,199.58,460.4,Single-ply,SBD,M
Boys,99.79,10,Joshua Cuevas,Pearsall,92.76,161.03,104.33,188.24,453.59,Single-ply,SBD,M
Boys,99.79,11,Martinez Christopher,Castroville Medina Valley,97.34,149.69,90.72,185.97,426.38,Single-ply,SBD,M
Boys,99.79,12,Netting Bridger,Castroville Medina Valley,97.75,142.88,65.77,183.7,392.36,Single-ply,SBD,M
Boys,99.79,13,Manuel Cruz,San Antonio Kennedy,97.79,142.88,72.57,149.69,365.14,Single-ply,SBD,M
Boys,99.79,DQ,Demetris Lino,San Antonio East Central,93.08,,,,,Single-ply,SBD,M
Boys,99.79,DQ,Moises Garcia,San Antonio Southside,90.54,,,,,Single-ply,SBD,M
Boys,109.77,1,Anthony Cantu,San Antonio East Central,109.77,263.08,131.54,231.33,625.96,Single-ply,SBD,M
Boys,109.77,2,Jorge Flores,San Antonio Memorial,109.77,204.12,113.4,192.78,510.29,Single-ply,SBD,M
Boys,109.77,3,Bernard Aguilar,Poteet,106.37,192.78,90.72,158.76,442.25,Single-ply,SBD,M
Boys,109.77,4,James Durano,San Antonio Southwest,108.05,163.29,95.25,176.9,435.45,Single-ply,SBD,M
Boys,109.77,5,Fermin Cruz,San Antonio Memorial,103.87,142.88,83.91,156.49,383.29,Single-ply,SBD,M
Boys,109.77,6,Jose Garcia #14,San Antonio Kennedy,105.69,124.74,83.91,154.22,362.87,Single-ply,SBD,M
Boys,109.77,DQ,Ethan Rodriguez,Pearsall,109.77,,,,,Single-ply,SBD,M
Boys,124.74,1,Roland Deluna,Castroville Medina Valley,122.92,238.14,136.08,208.65,582.87,Single-ply,SBD,M
Boys,124.74,2,Xavier Coronado,San Antonio Southwest,117.21,176.9,113.4,197.31,487.61,Single-ply,SBD,M
Boys,124.74,3,Elijah Amaro,San Antonio Southwest,119.52,170.1,120.2,151.95,442.25,Single-ply,SBD,M
Boys,124.74,4,Eric Lopez,San Antonio Kennedy,122.11,142.88,81.65,183.7,408.23,Single-ply,SBD,M
Boys,124.74,5,Jesse Flores,San Antonio Memorial,113.4,83.91,83.91,158.76,326.59,Single-ply,SBD,M
Boys,124.74,DQ,Benjamin Arriaga,San Antonio Memorial,116.12,,,,,Single-ply,SBD,M
Boys,124.74+,1,Michael Kessler,Castroville Medina Valley,143.52,210.92,122.47,199.58,532.97,Single-ply,SBD,M
Boys,124.74+,2,Jacob Hernandez,San Antonio Memorial,147.42,174.63,136.08,188.24,498.95,Single-ply,SBD,M
Boys,124.74+,3,Josh Martinez,San Antonio Southwest,136.53,158.76,102.06,158.76,419.57,Single-ply,SBD,M
