Name,BirthDate,Division,BodyweightKg,WeightClassKg,Squat1Kg,Squat2Kg,Squat3Kg,Best3SquatKg,Bench1Kg,Bench2Kg,Bench3Kg,Best3BenchKg,Deadlift1Kg,Deadlift2Kg,Deadlift3Kg,Best3DeadliftKg,TotalKg,Place,Sex,Event,Equipment
Garth Sullivan,1992-02-13,M-T1,51.3,52,117.5,125,-130,125,77.5,87.5,-97.5,87.5,120,132.5,137.5,137.5,350,1,M,SBD,Single-ply
James Severs,1991-07-03,M-T1,51.1,52,102.5,-110,-110,102.5,75,77.5,-82.5,77.5,140,150,-170,150,330,2,M,SBD,Single-ply
Morgan Timiney,1992-07-02,M-T1,52,52,77.5,87.5,-97.5,87.5,47.5,-52.5,-52.5,47.5,110,120,-137.5,120,255,3,M,SBD,Single-ply
Phillip Rotar,1991-02-26,M-T2,51.8,52,140,155,-162.5,155,82.5,-95,95,95,142.5,157.5,-170,157.5,407.5,1,M,SBD,Single-ply
DeMario Nealy,1991-01-10,M-T2,51.7,52,125,132.5,-137.5,132.5,52.5,60,-67.5,60,135,147.5,155,155,347.5,2,M,SBD,Single-ply
Steve Kapala,1989-02-20,M-T3,51.7,52,-107.5,-107.5,-107.5,,75,-82.5,82.5,82.5,137.5,152.5,-165,152.5,,DQ,M,SBD,Single-ply
Neil Steinmetz,1991-06-25,M-T1,54.7,56,122.5,130,-135,130,75,80,-85,80,142.5,155,-162.5,155,365,1,M,SBD,Single-ply
Devon Roblyer,1992-02-26,M-T1,55.3,56,95,,115,115,55,62.5,-67.5,62.5,115,130,-147.5,130,307.5,2,M,SBD,Single-ply
Joey Rein,1990-08-10,M-T2,55.1,56,152.5,162.5,-167.5,162.5,87.5,-92.5,-95,87.5,147.5,150,-172.5,150,400,1,M,SBD,Single-ply
John Bolander,1991-03-01,M-T2,55.7,56,130,-140,-140,130,75,80,-85,80,147.5,-157.5,-157.5,147.5,357.5,2,M,SBD,Single-ply
Christopher Tran #1,1988-07-18,M-T3,55.1,56,142.5,155,167.5,167.5,75,85,-90,85,167.5,185,-202.5,185,437.5,1,M,SBD,Single-ply
Nick Norwood,1988-10-18,M-T3,55.3,56,142.5,150,-155,150,107.5,112.5,-115,112.5,137.5,-147.5,147.5,147.5,410,2,M,SBD,Single-ply
Billy Naquin,1989-03-04,M-T3,54.5,56,-145,145,-162.5,145,-67.5,70,-75,70,180,-190,-200,180,395,3,M,SBD,Single-ply
Kelby Kraft,1991-09-17,M-T1,59.8,60,142.5,162.5,172.5,172.5,95,105,-110,105,145,165,-182.5,165,442.5,1,M,SBD,Single-ply
Joshua Norton,1991-11-14,M-T1,59.6,60,117.5,127.5,132.5,132.5,77.5,82.5,-87.5,82.5,150,160,167.5,167.5,382.5,2,M,SBD,Single-ply
Jeff Franklin,1991-07-10,M-T1,58.7,60,-130,-130,-130,,,,,,,,,,,DQ,M,SBD,Single-ply
Nick Stevenson,1990-03-30,M-T2,59,60,175,-185,-187.5,175,95,-105,-110,95,165,175,185,185,455,1,M,SBD,Single-ply
Wes McCormick,1989-11-16,M-T2,59,60,142.5,150,157.5,157.5,107.5,-112.5,-112.5,107.5,167.5,180,185,185,450,2,M,SBD,Single-ply
Daniel Miller,1990-06-04,M-T2,59.6,60,-167.5,-167.5,,,,,,,,,,,,DQ,M,SBD,Single-ply
Nelson Boutte,1988-12-13,M-T3,59.8,60,220,237.5,-245,237.5,120,-127.5,-127.5,120,215,-230,-230,215,572.5,1,M,SBD,Single-ply
Josh Rein,1985-08-16,M-Jr,60,60,162.5,167.5,-182.5,167.5,92.5,97.5,102.5,102.5,172.5,187.5,195,195,465,1,M,SBD,Single-ply
Alex Healy,1985-05-17,M-Jr,58.3,60,142.5,-155,-155,142.5,-107.5,-107.5,107.5,107.5,160,-180,-190,160,410,2,M,SBD,Single-ply
Andrew Wax,1991-09-02,M-T1,67.2,67.5,145,155,-162.5,155,-92.5,92.5,95,95,147.5,162.5,172.5,172.5,422.5,1,M,SBD,Single-ply
Paul Sholar,1992-03-17,M-T1,66.5,67.5,150,160,-172.5,160,75,-87.5,-87.5,75,162.5,-170,-177.5,162.5,397.5,2,M,SBD,Single-ply
Nathan Hendrickson,1989-10-12,M-T2,67.1,67.5,172.5,182.5,-192.5,182.5,-120,120,-125,120,210,220,-227.5,220,522.5,1,M,SBD,Single-ply
Felix Rodriguez,1990-03-08,M-T2,65,67.5,177.5,-185,185,185,112.5,-117.5,-117.5,112.5,-207.5,207.5,-220,207.5,505,2,M,SBD,Single-ply
Kelby Allen,1989-12-26,M-T2,64.9,67.5,175,185,192.5,192.5,102.5,107.5,-110,107.5,175,182.5,190,190,490,3,M,SBD,Single-ply
Vince Scavuzzo,1989-10-31,M-T2,65.7,67.5,147.5,162.5,-167.5,162.5,95,100,102.5,102.5,155,165,175,175,440,4,M,SBD,Single-ply
Garrett Curtis,1991-05-02,M-T1,66.3,67.5,130,142.5,-150,142.5,-107.5,-107.5,107.5,107.5,167.5,180,-192.5,180,430,5,M,SBD,Single-ply
Mike Carter,1991-03-11,M-T2,67.1,67.5,147.5,-160,160,160,95,100,-107.5,100,152.5,160,-177.5,160,420,6,M,SBD,Single-ply
Tyler Baines,1988-03-13,M-T3,63.8,67.5,-170,172.5,180,180,132.5,-137.5,-137.5,132.5,205,-215,-215,205,517.5,1,M,SBD,Single-ply
Ryan Savell,1988-06-21,M-T3,65.9,67.5,160,172.5,185,185,95,107.5,-117.5,107.5,160,182.5,187.5,187.5,480,2,M,SBD,Single-ply
Kyle Spiekermann,1988-11-06,M-T3,65.6,67.5,162.5,177.5,-192.5,177.5,92.5,-100,-100,92.5,185,200,-210,200,470,3,M,SBD,Single-ply
Kyle Powers,1987-11-19,M-T3,65.6,67.5,147.5,160,-172.5,160,102.5,107.5,-110,107.5,182.5,192.5,-200,192.5,460,4,M,SBD,Single-ply
Vincent Niedoliwka,1985-12-23,M-Jr,67.2,67.5,220,237.5,245,245,140,150,-155,150,242.5,255,-272.5,255,650,1,M,SBD,Single-ply
Tyler Skaggs,1991-06-20,M-T1,74.4,75,-190,190,195,195,92.5,-107.5,-107.5,92.5,-170,177.5,190,190,477.5,1,M,SBD,Single-ply
Kyle Bevins,1991-08-03,M-T1,72.6,75,112.5,127.5,-137.5,127.5,55,62.5,-75,62.5,135,152.5,-160,152.5,342.5,2,M,SBD,Single-ply
Knute Douglas,1989-08-05,M-T2,74.1,75,227.5,245,-260,245,110,-117.5,122.5,122.5,-215,215,-232.5,215,582.5,1,M,SBD,Single-ply
Michael Srokowski,1989-12-06,M-T2,72.1,75,182.5,-200,-200,182.5,102.5,110,,110,182.5,197.5,205,205,497.5,3,M,SBD,Single-ply
John Post,1990-09-21,M-T2,74.5,75,182.5,-195,-195,182.5,110,115,-120,115,200,-217.5,-217.5,200,497.5,2,M,SBD,Single-ply
Ian Amburgy,1989-09-28,M-T2,74.6,75,172.5,180,182.5,182.5,112.5,115,-117.5,115,187.5,192.5,197.5,197.5,495,3,M,SBD,Single-ply
Robby Weber,1989-07-09,M-T2,74,75,-157.5,162.5,-172.5,162.5,-102.5,105,-110,105,190,-195,-197.5,190,457.5,4,M,SBD,Single-ply
Josh Ford,1991-01-25,M-T2,74.6,75,-182.5,-182.5,-182.5,,-105,112.5,-115,112.5,165,175,-185,175,,DQ,M,SBD,Single-ply
Luke Schmidt,1990-08-10,M-T2,74.6,75,-212.5,-217.5,-217.5,,107.5,-115,-117.5,107.5,,,,,,DQ,M,SBD,Single-ply
Andrew Hollenbeck,1989-01-12,M-T3,73.8,75,230,242.5,250,250,160,-175,-175,160,250,-272.5,285,285,695,1,M,SBD,Single-ply
Lucas Hisghman,1987-06-27,M-T3,74.6,75,202.5,-227.5,227.5,227.5,147.5,167.5,177.5,177.5,-210,227.5,-240,227.5,632.5,2,M,SBD,Single-ply
Dustin Merritt,1988-12-03,M-T3,71.8,75,177.5,187.5,197.5,197.5,-110,115,120,120,200,212.5,227.5,227.5,545,3,M,SBD,Single-ply
Trent Thomas,1989-01-17,M-T3,71.5,75,170,185,190,190,-117.5,117.5,127.5,127.5,182.5,-200,200,200,517.5,4,M,SBD,Single-ply
Eric Grundy,1988-11-18,M-T3,74.6,75,175,187.5,-192.5,187.5,-115,115,127.5,127.5,182.5,192.5,195,195,510,5,M,SBD,Single-ply
Zack Beikmann,1989-05-21,M-T2,74,75,152.5,167.5,177.5,177.5,107.5,-122.5,-122.5,107.5,170,182.5,-192.5,182.5,467.5,6,M,SBD,Single-ply
Michael Steinmetz,1984-01-06,M-Jr,74.3,75,220,-232.5,232.5,232.5,-147.5,147.5,157.5,157.5,237.5,-245,,237.5,627.5,1,M,SBD,Single-ply
Nick Royer,1986-02-17,M-Jr,74.1,75,202.5,-217.5,-217.5,202.5,-175,175,185,185,205,222.5,-237.5,222.5,610,2,M,SBD,Single-ply
Jon Norwood,1985-12-21,M-Jr,74.8,75,215,-227.5,-227.5,215,162.5,170,-182.5,170,185,197.5,-202.5,197.5,582.5,3,M,SBD,Single-ply
Levi Hoffman,1991-06-19,M-T1,82,82.5,-205,205,-210,205,135,-137.5,137.5,137.5,217.5,222.5,-227.5,222.5,565,1,M,SBD,Single-ply
Jordan Vallentine,1991-10-01,M-T1,81.7,82.5,132.5,140,152.5,152.5,90,92.5,-95,92.5,187.5,195,-207.5,195,440,2,M,SBD,Single-ply
Cody Everett,1991-01-30,M-T2,81.3,82.5,192.5,-207.5,210,210,117.5,125,130,130,-197.5,-197.5,197.5,197.5,537.5,1,M,SBD,Single-ply
Andrew Cross,1990-10-16,M-T2,81.7,82.5,182.5,-192.5,-192.5,182.5,-122.5,125,130,130,182.5,195,210,210,522.5,2,M,SBD,Single-ply
Caleb Motsinger,1990-02-07,M-T2,80.3,82.5,-187.5,187.5,192.5,192.5,105,110,-112.5,110,205,210,-215,210,512.5,3,M,SBD,Single-ply
Nicholas Jacobson,1990-08-31,M-T2,80.6,82.5,190,205,-212.5,205,95,-102.5,-115,95,185,190,195,195,495,4,M,SBD,Single-ply
Shane Smith,1989-10-09,M-T2,78,82.5,205,-220,-220,205,-115,-115,-115,,235,250,-257.5,250,,DQ,M,SBD,Single-ply
Dustin Witte,1988-07-28,M-T3,81.85,82.5,252.5,270,-272.5,270,142.5,-152.5,-152.5,142.5,257.5,277.5,287.5,287.5,700,1,M,SBD,Single-ply
Taylor Garrett #2,1987-07-31,M-T3,82.25,82.5,237.5,-252.5,-252.5,237.5,-162.5,162.5,165,165,-237.5,237.5,252.5,252.5,655,2,M,SBD,Single-ply
Frank Marucci,1988-04-05,M-T3,80.9,82.5,227.5,-242.5,242.5,242.5,-150,150,155,155,237.5,-245,-247.5,237.5,635,3,M,SBD,Single-ply
Justin Tuinstra,1988-05-18,M-T3,79.55,82.5,230,-240,-240,230,160,-170,-170,160,220,-232.5,-232.5,220,610,4,M,SBD,Single-ply
Steve Soulan,1989-03-10,M-T3,82.25,82.5,215,-230,230,230,122.5,-137.5,-137.5,122.5,210,230,240,240,592.5,5,M,SBD,Single-ply
Zachary Miller,1988-06-07,M-T3,79.8,82.5,175,185,-192.5,185,-142.5,142.5,145,145,225,247.5,-257.5,247.5,577.5,6,M,SBD,Single-ply
Jimmy Mullins,1988-01-31,M-T3,81.6,82.5,185,195,202.5,202.5,-137.5,137.5,-142.5,137.5,180,192.5,200,200,540,7,M,SBD,Single-ply
Mike Tulllis,1988-10-20,M-T3,81.1,82.5,192.5,205,-210,205,-135,-135,-135,,,,,,,DQ,M,SBD,Single-ply
Stephan Meche,1987-04-22,M-T3,81.25,82.5,255,275,-285,275,152.5,162.5,-170,162.5,260,275,-280,275,712.5,1,M,SBD,Single-ply
Terry Acosta,1985-06-04,M-Jr,81.85,82.5,245,267.5,-275,267.5,135,145,-157.5,145,267.5,287.5,292.5,292.5,705,2,M,SBD,Single-ply
Brendan Beikmann,1984-12-05,M-Jr,81,82.5,-265,-265,265,265,140,145,155,155,245,-260,260,260,680,3,M,SBD,Single-ply
Corey Sprague,1986-07-15,M-Jr,81.9,82.5,-197.5,197.5,-227.5,197.5,-147.5,170,-182.5,170,197.5,220,232.5,232.5,600,4,M,SBD,Single-ply
Floyd Knight,1987-02-20,M-Jr,80.75,82.5,62.5,185,205,205,62.5,107.5,115,115,62.5,-205,,62.5,382.5,5,M,SBD,Single-ply
Jason Longfellow,1987-03-26,M-Jr,82.2,82.5,-255,-255,-255,,-150,-150,150,150,255,,,255,,DQ,M,SBD,Single-ply
Matt Pattison,1991-06-22,M-T1,89.1,90,170,177.5,195,195,105,110,-115,110,215,-242.5,-242.5,215,520,1,M,SBD,Single-ply
Taylor Peyronel,1992-05-28,M-T1,88.8,90,-177.5,-177.5,177.5,177.5,92.5,95,97.5,97.5,155,162.5,172.5,172.5,447.5,2,M,SBD,Single-ply
Dennis Ryan,1989-08-20,M-T2,86.7,90,237.5,250,252.5,252.5,147.5,155,-160,155,-232.5,232.5,,232.5,640,1,M,SBD,Single-ply
Tim Parker #3,1990-02-15,M-T2,88.5,90,227.5,240,-247.5,240,-135,135,142.5,142.5,225,240,247.5,247.5,630,2,M,SBD,Single-ply
Andrew Hare,1990-03-01,M-T2,85.6,90,200,220,235,235,110,-140,150,150,200,220,-230,220,605,3,M,SBD,Single-ply
Tony Thompson,1989-07-13,M-T2,85.4,90,220,222.5,-232.5,222.5,-127.5,135,-140,135,237.5,-255,-255,237.5,595,4,M,SBD,Single-ply
Tom Zintsmaster,1989-08-31,M-T2,84.9,90,185,195,200,200,142.5,155,160,160,207.5,220,-250,220,580,5,M,SBD,Single-ply
Daniel Gustinis,1991-04-13,M-T2,88.4,90,-192.5,192.5,-212.5,192.5,102.5,120,127.5,127.5,-175,190,-195,190,510,6,M,SBD,Single-ply
Chris Yared,1991-03-11,M-T2,88.8,90,180,190,-195,190,105,-110,-110,105,175,-190,190,190,485,7,M,SBD,Single-ply
Kris Goranson,1989-07-02,M-T2,84.2,90,-185,-185,-185,,-155,155,-170,155,185,207.5,215,215,,DQ,M,SBD,Single-ply
John Norcott,1989-03-24,M-T3,87.75,90,237.5,-257.5,-257.5,237.5,140,150,157.5,157.5,235,250,260,260,655,1,M,SBD,Single-ply
Curtis McDonald,1987-10-19,M-T3,89.1,90,-240,240,252.5,252.5,-157.5,-157.5,157.5,157.5,215,235,237.5,237.5,647.5,2,M,SBD,Single-ply
Clay Wade,1988-06-05,M-T3,87.3,90,220,232.5,240,240,155,162.5,-167.5,162.5,210,-235,-252.5,210,612.5,3,M,SBD,Single-ply
Peter Persinger,1987-06-26,M-T3,89,90,215,230,-235,230,130,-135,-135,130,220,227.5,-255,227.5,587.5,4,M,SBD,Single-ply
Jacob Dias,1988-09-29,M-T3,88.2,90,-195,-195,195,195,150,157.5,-165,157.5,202.5,-225,-225,202.5,555,5,M,SBD,Single-ply
Antwon Shoto,1988-12-31,M-T3,84.25,90,-175,190,-212.5,190,92.5,102.5,-110,102.5,215,250,-270,250,542.5,6,M,SBD,Single-ply
Justin Walker,1986-08-06,M-Jr,87.75,90,-227.5,242.5,265,265,150,172.5,182.5,182.5,260,300,305,305,752.5,1,M,SBD,Single-ply
Blake Dedas,1984-08-24,M-Jr,89.4,90,277.5,-290,-290,277.5,180,-190,-190,180,277.5,295,-302.5,295,752.5,2,M,SBD,Single-ply
Dan Walsh,1987-01-17,M-Jr,87.8,90,280,-292.5,-292.5,280,155,165,167.5,167.5,280,-295,-295,280,727.5,3,M,SBD,Single-ply
John Suschak,1986-05-28,M-Jr,88.95,90,245,-250,250,250,175,180,182.5,182.5,240,250,260,260,692.5,4,M,SBD,Single-ply
Eric Leitman,1987-03-01,M-Jr,88.45,90,-245,-245,245,245,162.5,-172.5,-172.5,162.5,242.5,265,-275,265,672.5,5,M,SBD,Single-ply
Nicholas DeLuca,1991-12-21,M-T1,90.8,100,230,-250,250,250,155,165,-182.5,165,227.5,-245,-245,227.5,642.5,1,M,SBD,Single-ply
Josh Boehnlein,1992-12-10,M-T1,94.6,100,170,-185,195,195,-115,115,122.5,122.5,160,-177.5,-177.5,160,477.5,2,M,SBD,Single-ply
Mike Prahl,1990-02-07,M-T2,97.1,100,242.5,-255,-257.5,242.5,127.5,-135,137.5,137.5,227.5,245,-262.5,245,625,1,M,SBD,Single-ply
Josh DeHaan,1989-09-01,M-T2,98.6,100,205,212.5,-225,212.5,122.5,135,-147.5,135,215,227.5,245,245,592.5,2,M,SBD,Single-ply
Gage Volkes,1990-03-06,M-T2,95.3,100,205,225,240,240,147.5,-157.5,-160,147.5,202.5,-225,-225,202.5,590,3,M,SBD,Single-ply
Chris Skinner,1989-02-13,M-T3,93.3,100,272.5,297.5,-322.5,297.5,137.5,170,-185,170,217.5,240,265,265,732.5,1,M,SBD,Single-ply
Stan Fujimoto,1987-11-25,M-T3,98.4,100,260,-272.5,-280,260,162.5,-167.5,167.5,167.5,237.5,250,-260,250,677.5,2,M,SBD,Single-ply
Blake Foret,1988-09-22,M-T3,99.5,100,222.5,245,262.5,262.5,152.5,-165,167.5,167.5,207.5,-227.5,227.5,227.5,657.5,4,M,SBD,Single-ply
Kevin Soulen,1988-03-10,M-T3,99,100,260,-282.5,-282.5,260,135,140,145,145,227.5,237.5,252.5,252.5,657.5,3,M,SBD,Single-ply
Kevin Clark,1987-07-17,M-T3,97.6,100,-227.5,-227.5,227.5,227.5,160,-170,-170,160,205,217.5,222.5,222.5,610,5,M,SBD,Single-ply
Tony Monahos,1988-12-09,M-T3,98.8,100,250,-272.5,272.5,272.5,115,-160,-160,115,-207.5,207.5,-227.5,207.5,595,6,M,SBD,Single-ply
Derek Brixius,1985-07-26,M-Jr,99.95,100,282.5,295,305,305,202.5,212.5,217.5,217.5,270,282.5,290,290,812.5,1,M,SBD,Single-ply
Richard Pachuta,1985-08-12,M-Jr,99.85,100,262.5,275,285,285,187.5,192.5,197.5,197.5,260,272.5,-290,272.5,755,2,M,SBD,Single-ply
Antonio Hayes,1986-06-02,M-Jr,99.6,100,272.5,290,-300,290,-125,130,147.5,147.5,272.5,-295,295,295,732.5,3,M,SBD,Single-ply
David Labrie,1985-08-21,M-Jr,98.8,100,272.5,-285,285,285,-170,-170,170,170,260,270,272.5,272.5,727.5,4,M,SBD,Single-ply
Rocco DeStefano,1983-06-28,M-Jr,99.9,100,260,280,287.5,287.5,160,170,-177.5,170,245,262.5,-267.5,262.5,720,5,M,SBD,Single-ply
Blake Cassidy,1984-05-22,M-Jr,98.4,100,-250,-250,-250,,,,,,,,,,,DQ,M,SBD,Single-ply
Justin Rolfe,1991-09-20,M-T1,108.75,110,220,227.5,237.5,237.5,125,137.5,147.5,147.5,-207.5,207.5,217.5,217.5,602.5,1,M,SBD,Single-ply
Parker Payne,1991-11-02,M-T1,109.05,110,-167.5,170,-182.5,170,-97.5,97.5,112.5,112.5,-175,-175,175,175,457.5,2,M,SBD,Single-ply
Alex Oliva,1989-07-24,M-T2,109.6,110,210,222.5,-232.5,222.5,122.5,132.5,142.5,142.5,197.5,210,225,225,590,1,M,SBD,Single-ply
Trey Cahill,1990-06-01,M-T2,106.15,110,192.5,-202.5,202.5,202.5,-142.5,-145,145,145,205,227.5,237.5,237.5,585,2,M,SBD,Single-ply
Zack Balwinski,1990-02-23,M-T2,103.7,110,-227.5,232.5,,232.5,-127.5,127.5,135,135,-195,205,215,215,582.5,3,M,SBD,Single-ply
Austin Shields,1990-08-13,M-T2,107.55,110,172.5,185,200,200,102.5,112.5,-117.5,112.5,172.5,197.5,-200,197.5,510,4,M,SBD,Single-ply
Cameron Mitchell,1990-02-10,M-T2,103.7,110,182.5,-210,210,210,-125,-125,-125,,-182.5,,,,,DQ,M,SBD,Single-ply
Sam White,1990-09-20,M-T2,109,110,-220,220,227.5,227.5,175,187.5,190,190,-207.5,-207.5,-207.5,,,DQ,M,SBD,Single-ply
Jayson Kline,1987-07-02,M-T3,106.5,110,275,295,-305,295,172.5,182.5,192.5,192.5,255,267.5,-270,267.5,755,1,M,SBD,Single-ply
Alex Mullins,1988-05-06,M-T3,108.5,110,247.5,265,-272.5,265,-195,195,-217.5,195,230,240,-250,240,700,2,M,SBD,Single-ply
Jessie Betzinger,1984-06-09,M-Jr,108.35,110,340,350,-362.5,350,190,197.5,205,205,282.5,305,-312.5,305,860,1,M,SBD,Single-ply
Chris White,1986-10-01,M-Jr,105.15,110,210,-235,-240,210,137.5,205,-215,205,182.5,235,,235,650,2,M,SBD,Single-ply
Mike Hamilton,1984-09-23,M-Jr,106.2,110,-247.5,-247.5,-247.5,,160,-170,175,175,275,-290,-290,275,,DQ,M,SBD,Single-ply
Pascal Waller,1984-10-19,M-Jr,108.2,110,-237.5,-237.5,-250,,,,,,,,,,,DQ,M,SBD,Single-ply
Bryan Miller,1991-08-09,M-T1,121.4,125,185,200,-227.5,200,112.5,-120,-120,112.5,165,185,-197.5,185,497.5,1,M,SBD,Single-ply
Brett Anderson,1989-08-21,M-T2,116.4,125,282.5,295,-320,295,-145,-145,145,145,265,-275,,265,705,1,M,SBD,Single-ply
Steven Bonar,1989-07-25,M-T2,123.7,125,230,-242.5,255,255,145,155,167.5,167.5,185,197.5,207.5,207.5,630,2,M,SBD,Single-ply
Tyler Gordon,1989-09-03,M-T2,116.8,125,-205,-205,205,205,-140,-140,140,140,187.5,202.5,-227.5,202.5,547.5,3,M,SBD,Single-ply
Jon Lapolla,1989-01-09,M-T3,119,125,-232.5,232.5,-250,232.5,142.5,-150,157.5,157.5,235,-245,-245,235,625,1,M,SBD,Single-ply
Jon Krogman,1986-04-21,M-Jr,123.5,125,337.5,352.5,-367.5,352.5,212.5,220,-227.5,220,300,312.5,325,325,897.5,1,M,SBD,Single-ply
Tom Szorady,1984-08-08,M-Jr,117.7,125,237.5,250,-262.5,250,-187.5,-190,-190,-187.5,237.5,252.5,267.5,267.5,,DQ,M,SBD,Single-ply
Josh Jordan,1991-09-08,M-T1,133.7,125+,-200,200,230,230,120,137.5,-150,137.5,177.5,-205,-205,177.5,545,1,M,SBD,Single-ply
John Clark,1989-08-12,M-T2,126.3,125+,280,302.5,312.5,312.5,-167.5,167.5,187.5,187.5,237.5,257.5,262.5,262.5,762.5,1,M,SBD,Single-ply
Blaine Sumner,1987-06-22,M-T3,142.2,125+,305,325,335,335,-202.5,202.5,-220,202.5,265,-302.5,-302.5,265,802.5,1,M,SBD,Single-ply
Brian Kovach,1983-12-22,M-Jr,126,125+,327.5,362.5,372.5,372.5,207.5,217.5,227.5,227.5,225,252.5,-272.5,252.5,852.5,1,M,SBD,Single-ply
Aaron Gibes,1984-10-25,M-Jr,171.1,125+,-275,275,295,295,-175,175,195,195,270,292.5,-322.5,292.5,782.5,2,M,SBD,Single-ply
Ty Westbrook,1986-09-28,M-Jr,151.2,125+,285,-332.5,332.5,332.5,160,172.5,182.5,182.5,225,-257.5,-267.5,225,740,3,M,SBD,Single-ply
Andre LeBlanc,1987-01-26,M-Jr,150.4,125+,-260,267.5,-290,267.5,182.5,-192.5,-197.5,182.5,240,260,-272.5,260,710,4,M,SBD,Single-ply
Jesse Hernandez,1987-05-25,M-T3,141.3,125+,-245,-245,-245,-245,-182.5,-190,200,200,250,-272.5,-272.5,250,,DQ,M,SBD,Single-ply
