Division,WeightClassKg,Place,Name,Team,BodyweightKg,Best3SquatKg,Best3BenchKg,Best3DeadliftKg,TotalKg,Equipment,Event,Sex
Boys,51.71,1,ZaQuavion Golden,Hearne,51.44,99.79,65.77,138.35,303.91,Single-ply,SBD,M
Boys,51.71,2,Bryce Roundtree,Madisonville,48.53,97.52,61.23,99.79,258.55,Single-ply,SBD,M
Boys,51.71,3,Levi Goudeau,Anderson-Shiro,46.81,90.72,49.9,86.18,226.8,Single-ply,SBD,M
Boys,51.71,4,Eli Parker,Centerville,50.8,83.91,43.09,92.99,219.99,Single-ply,SBD,M
Boys,55.79,1,Jacob Hanson,College Station A&M; Cons,54.98,158.76,88.45,145.15,392.36,Single-ply,SBD,M
Boys,55.79,2,Cade Haring,Franklin,54.88,90.72,58.97,113.4,263.08,Single-ply,SBD,M
Boys,55.79,3,Tye Conger,Madisonville,55.34,88.45,52.16,104.33,244.94,Single-ply,SBD,M
Boys,55.79,DQ,Daniel Villareal,Centerville,53.07,83.91,,,,Single-ply,SBD,M
Boys,59.87,1,Bobby Sanchez,Centerville,56.7,131.54,72.57,145.15,349.27,Single-ply,SBD,M
Boys,59.87,2,Joe Rangel,Cameron Yoe,59.42,104.33,65.77,149.69,319.78,Single-ply,SBD,M
Boys,59.87,3,Harris Sherrod,Jewett Leon,56.25,115.67,61.23,138.35,315.25,Single-ply,SBD,M
Boys,59.87,4,Malcolm Manley,Bryan Rudder,56.34,113.4,52.16,117.93,283.5,Single-ply,SBD,M
Boys,67.13,1,Jeremiah Manley,Bryan Rudder,66.41,183.7,97.52,181.44,462.66,Single-ply,SBD,M
Boys,67.13,2,Chase Gibson,College Station A&M; Cons,65.95,154.22,97.52,163.29,415.04,Single-ply,SBD,M
Boys,67.13,3,Truman Garza,Jewett Leon,66.86,165.56,79.38,167.83,412.77,Single-ply,SBD,M
Boys,67.13,4,Christian Rokes,Franklin,61.87,151.95,95.25,158.76,405.97,Single-ply,SBD,M
Boys,67.13,5,Nathan Chappell,Madisonville,65.32,158.76,83.91,147.42,390.09,Single-ply,SBD,M
Boys,67.13,6,Cory Price,College Station A&M; Cons,66.77,131.54,86.18,165.56,383.29,Single-ply,SBD,M
Boys,67.13,7,Jonathan Boone,Madisonville,60.78,129.27,74.84,165.56,369.68,Single-ply,SBD,M
Boys,67.13,8,Christian Zarate,Centerville,67.13,136.08,83.91,149.69,369.68,Single-ply,SBD,M
Boys,67.13,9,Alex Flores,Anderson-Shiro,61.33,131.54,83.91,149.69,365.14,Single-ply,SBD,M
Boys,67.13,10,Tyler Evans #3,Franklin,63.5,145.15,63.5,138.35,347,Single-ply,SBD,M
Boys,67.13,11,Jason Zarate,Centerville,65.77,102.06,74.84,142.88,319.78,Single-ply,SBD,M
Boys,67.13,12,Jacob Shuler,Jewett Leon,62.14,113.4,61.23,115.67,290.3,Single-ply,SBD,M
Boys,67.13,DQ,JT Abshire,College Station,65.77,213.19,,,,Single-ply,SBD,M
Boys,74.84,1,Braden Tschirhart,College Station,72.94,229.06,147.42,199.58,576.06,Single-ply,SBD,M
Boys,74.84,2,Dequarius White,Bryan Rudder,73.03,190.51,115.67,215.46,521.63,Single-ply,SBD,M
Boys,74.84,3,Frank Williams,College Station A&M; Cons,67.59,195.04,111.13,195.04,501.22,Single-ply,SBD,M
Boys,74.84,4,Sergio Villareal,Centerville,73.48,204.12,102.06,181.44,487.61,Single-ply,SBD,M
Boys,74.84,5,Abraham Sanchez,Centerville,73.12,142.88,104.33,199.58,446.79,Single-ply,SBD,M
Boys,74.84,6,Cedrion Golden,Hearne,73.84,170.1,95.25,181.44,446.79,Single-ply,SBD,M
Boys,74.84,7,Roland Davis,Centerville,71.85,147.42,102.06,158.76,408.23,Single-ply,SBD,M
Boys,74.84,8,Efran Garza,Madisonville,73.03,129.27,99.79,176.9,405.97,Single-ply,SBD,M
Boys,74.84,9,Cody Smith,Franklin,74.84,147.42,97.52,158.76,403.7,Single-ply,SBD,M
Boys,74.84,10,Asa Surface,Madisonville,68.04,129.27,74.84,170.1,374.21,Single-ply,SBD,M
Boys,74.84,11,Tyler Burt,Cameron Yoe,71.67,136.08,83.91,140.61,360.61,Single-ply,SBD,M
Boys,74.84,12,Jeremy Flake,Jewett Leon,71.85,124.74,83.91,147.42,356.07,Single-ply,SBD,M
Boys,74.84,13,Thomas Kays,Anderson-Shiro,69.13,136.08,68.04,149.69,353.8,Single-ply,SBD,M
Boys,74.84,14,Cade Pate,Centerville,73.03,102.06,92.99,142.88,337.93,Single-ply,SBD,M
Boys,74.84,15,Marcus Dorman,Madisonville,68.95,99.79,72.57,145.15,317.51,Single-ply,SBD,M
Boys,74.84,16,Kolbee Lee,Normangee,68.4,106.59,74.84,124.74,306.17,Single-ply,SBD,M
Boys,74.84,17,Wyatt Burke,Madisonville,67.95,68.04,40.82,86.18,195.04,Single-ply,SBD,M
Boys,74.84,DQ,Smith Rayburn,Anderson-Shiro,72.21,86.18,,127.01,,Single-ply,SBD,M
Boys,82.1,1,Robert Franklin,College Station A&M; Cons,81.92,226.8,163.29,238.14,628.23,Single-ply,SBD,M
Boys,82.1,2,Kevin Advic,Cameron Yoe,82.1,183.7,113.4,185.97,483.08,Single-ply,SBD,M
Boys,82.1,3,Sven Levin,Anderson-Shiro,76.2,140.61,97.52,,238.14,Single-ply,SB,M
Boys,89.81,1,Nathan Ellard,College Station,88.9,272.16,163.29,229.06,664.51,Single-ply,SBD,M
Boys,89.81,2,Jason Jasperson,College Station A&M; Cons,89.27,233.6,136.08,226.8,596.47,Single-ply,SBD,M
Boys,89.81,3,Matthew O'Neil,College Station A&M; Cons,89.72,192.78,102.06,210.92,505.76,Single-ply,SBD,M
Boys,89.81,4,Colton Harper,College Station A&M; Cons,87.72,158.76,117.93,185.97,462.66,Single-ply,SBD,M
Boys,89.81,5,Matt Duewall,Franklin,85.28,170.1,95.25,163.29,428.64,Single-ply,SBD,M
Boys,89.81,6,Bryson Crowley,Centerville,87,142.88,92.99,174.63,410.5,Single-ply,SBD,M
Boys,89.81,7,Michail Harrell,Madisonville,86.64,147.42,90.72,170.1,408.23,Single-ply,SBD,M
Boys,89.81,8,Tim Swonke,Madisonville,87.54,136.08,83.91,149.69,369.68,Single-ply,SBD,M
Boys,89.81,DQ,Andrew Lambert,Normangee,83.46,,,,,Single-ply,SBD,M
Boys,99.79,1,DeVarion Guyton,College Station A&M; Cons,97.07,240.4,142.88,258.55,641.83,Single-ply,SBD,M
Boys,99.79,2,Mark Wagner #5,College Station,96.52,229.06,136.08,244.94,610.08,Single-ply,SBD,M
Boys,99.79,3,Davis Wood,College Station,98.43,240.4,142.88,215.46,598.74,Single-ply,SBD,M
Boys,99.79,4,Ben Wolz,College Station,90.54,229.06,136.08,215.46,580.6,Single-ply,SBD,M
Boys,99.79,5,Nico Vargas,Cameron Yoe,91.63,233.6,120.2,226.8,580.6,Single-ply,SBD,M
Boys,99.79,6,Patrick Foley,Hearne,91.63,242.67,129.27,195.04,566.99,Single-ply,SBD,M
Boys,99.79,7,Anthony Stokley,Franklin,98.88,195.04,124.74,190.51,510.29,Single-ply,SBD,M
Boys,99.79,8,Nick Ucci,Jewett Leon,96.43,172.37,90.72,172.37,435.45,Single-ply,SBD,M
Boys,99.79,9,Ethan Williams,Madisonville,92.99,147.42,88.45,188.24,424.11,Single-ply,SBD,M
Boys,99.79,10,Dominic Lewis,Cameron Yoe,91.63,154.22,106.59,161.03,421.84,Single-ply,SBD,M
Boys,99.79,11,Cody Duewall,Franklin,94.53,158.76,88.45,147.42,394.63,Single-ply,SBD,M
Boys,99.79,DQ,Cash Parker,Centerville,93.44,183.7,,,,Single-ply,SBD,M
Boys,109.77,1,Anthony Banda,Normangee,106.59,204.12,120.2,217.72,542.04,Single-ply,SBD,M
Boys,109.77,2,Bradley Dorsett,College Station,100.97,208.65,140.61,190.51,539.77,Single-ply,SBD,M
Boys,109.77,3,Korey Grisham,Centerville,107.05,192.78,115.67,210.92,519.36,Single-ply,SBD,M
Boys,109.77,4,Dylan Woods,Hearne,108.77,204.12,111.13,174.63,489.88,Single-ply,SBD,M
Boys,109.77,5,Kevin Kindt,Bryan Rudder,107.95,158.76,104.33,167.83,430.91,Single-ply,SBD,M
Boys,109.77,DQ,Corey Craft,Normangee,106.05,,,,,Single-ply,SBD,M
Boys,124.74,1,Blake Johnson,Franklin,121.56,331.12,179.17,274.42,784.71,Single-ply,SBD,M
Boys,124.74,2,Dortavious Lewis,Cameron Yoe,117.48,272.16,149.69,217.72,639.57,Single-ply,SBD,M
Boys,124.74,3,Andrew Seabeck,Anderson-Shiro,123.56,176.9,108.86,181.44,467.2,Single-ply,SBD,M
Boys,124.74,DQ,Colby Garcia,Jewett Leon,124.65,,,,,Single-ply,SBD,M
Boys,124.74+,1,Joey McIver,Madisonville,135.17,222.26,140.61,204.12,566.99,Single-ply,SBD,M
Boys,124.74+,DQ,Adrian Lewis,Cameron Yoe,149.69,,,,,Single-ply,SBD,M
