Name,Sex,WeightClassKg,Division,AgeRange,Equipment,Best3BenchKg,Best3DeadliftKg,TotalKg,Event,Place
Cooper,M,75,Teen 17-19,17-19,Single-ply,131.54,,131.54,B,1
Gondosh,M,75,Teen 17-19,17-19,Single-ply,129.27,,129.27,B,2
Chad Jodikinos,M,75,Novice,,Single-ply,115.67,,115.67,B,1
Yeager,M,75,Novice,,Single-ply,97.52,,97.52,B,2
Burkhart,M,75,Juniors 20-23,20-23,Single-ply,106.59,,106.59,B,1
Jacob Williams,M,82.5,Open,,Single-ply,192.78,,192.78,B,1
Hamer,M,82.5,Open,,Single-ply,192.78,,192.78,B,2
Jacob Williams,M,82.5,Novice,,Single-ply,192.78,,192.78,B,1
Miller,M,82.5,Police,,Single-ply,161.03,,161.03,B,1
Jacob Williams,M,82.5,Submasters 33-39,33-39,Single-ply,192.78,,192.78,B,1
Umberger,M,90,Open,,Single-ply,210.92,,210.92,B,1
Dugan,M,90,Open,,Single-ply,204.12,,204.12,B,2
Austerberry,M,90,Open,,Single-ply,174.63,,174.63,B,3
Bickers,M,90,Police,,Single-ply,149.69,,149.69,B,1
Pettis,M,90,Teen 14-16,14-16,Single-ply,95.25,,95.25,B,1
Cook,M,100,Police,,Single-ply,251.74,,251.74,B,1
Casey Williams #1,M,100,Juniors 20-23,20-23,Single-ply,185.97,,185.97,B,1
Marantino,M,100,Submasters 33-39,33-39,Single-ply,242.67,,242.67,B,1
Durci,M,100,Master,,Single-ply,199.58,,199.58,B,1
Muehlbauer,M,100,Teen 14-16,14-16,Single-ply,102.06,,102.06,B,1
Chris Carson,M,110,Open,,Single-ply,319.78,,319.78,B,1
Wilson,M,110,Open,,Single-ply,244.94,,244.94,B,2
Jarrod Cassidy,M,110,Open,,Single-ply,244.94,,244.94,B,3
Jankowski,M,110,Juniors 20-23,20-23,Single-ply,163.29,,163.29,B,1
Johnson,M,110,Submasters 33-39,33-39,Single-ply,215.46,,215.46,B,1
Harris,M,110,Master,40-999,Single-ply,199.58,,199.58,B,1
Caughey,M,110,Teen 14-16,14-16,Single-ply,142.88,,142.88,B,1
Rich,M,125,Open,,Single-ply,301.64,,301.64,B,1
Steve Bly,M,125,Open,,Single-ply,274.42,,274.42,B,2
Moskos,M,125,Novice,,Single-ply,199.58,,199.58,B,1
Cregger,M,125,Submasters 33-39,33-39,Single-ply,156.49,,156.49,B,1
Rich,M,125,Master,40-999,Single-ply,301.64,,301.64,B,1
Gray,M,125,Teen 17-19,17-19,Single-ply,161.03,,161.03,B,1
Romano,M,140,Master,40-999,Single-ply,249.48,,249.48,B,1
Domin,M,140,Teen 17-19,17-19,Single-ply,142.88,,142.88,B,1
Weimer,M,140+,Teen 17-19,17-19,Single-ply,208.65,,208.65,B,1
Keith McNeill,M,90,Teen 17-19,17-19,Single-ply,136.08,,136.08,B,1
John Herbein,M,90,Grandmaster 70-79,70-79,Single-ply,113.4,,113.4,B,1
Bruce,M,82.5,Grandmaster 80-89,80-89,Single-ply,90.72,,90.72,B,1
Zack Barravecchio,M,56,Teen 14-16,14-16,Raw,45.36,,45.36,B,1
Zack Barravecchio,M,56,Teen 14-16,14-16,Raw,,92.99,92.99,D,1
Leighty,M,67.5,Teen 14-16,14-16,Raw,79.38,,79.38,B,1
Clouse,M,75,Novice,,Raw,142.88,,142.88,B,1
Sferra,M,75,Novice,,Raw,131.54,,131.54,B,2
Chad Jodikinos,M,75,Novice,,Raw,115.67,,115.67,B,3
Hill,M,75,Novice,,Raw,113.4,,113.4,B,4
Yondola,M,75,Teen 17-19,17-19,Raw,113.4,,113.4,B,1
C. Reese,M,75,Teen 17-19,17-19,Raw,102.06,,102.06,B,2
Jacob Williams,M,82.5,Novice,,Raw,192.78,,192.78,B,1
Hinchee,M,82.5,Novice,,Raw,154.22,,154.22,B,2
Dotson,M,82.5,Novice,,Raw,131.54,,131.54,B,3
Helbus,M,82.5,Novice,,Raw,124.74,,124.74,B,4
Mullins,M,82.5,Teen 14-16,14-16,Raw,102.06,,102.06,B,1
Dezak,M,82.5,Teen 17-19,17-19,Raw,124.74,,124.74,B,1
Nicolo,M,90,Open,,Raw,158.76,,158.76,B,1
Christian Cuspard,M,90,Open,,Raw,151.95,,151.95,B,2
Hoffman,M,90,Open,,Raw,142.88,,142.88,B,3
Leighty,M,90,Open,,Raw,131.54,,131.54,B,4
Barua,M,90,Teen 17-19,17-19,Raw,172.37,,172.37,B,1
Christian Cuspard,M,90,Teen 17-19,17-19,Raw,151.95,,151.95,B,2
Jim Patterson,M,100,Open,,Raw,208.65,,208.65,B,1
Casey Williams #1,M,100,Open,,Raw,185.97,,185.97,B,2
Obryon,M,100,Open,,Raw,181.44,,181.44,B,3
Dave Stitch,M,100,Open,,Raw,165.56,,165.56,B,4
Steel,M,100,Open,,Raw,165.56,,165.56,B,5
Dave Stitch,M,100,Police,,Raw,181.44,,181.44,B,1
Maze,M,100,Teen 17-19,17-19,Raw,129.27,,129.27,B,1
Jarrod Cassidy,M,110,Open,,Raw,250.38,,250.38,B,1
Miller,M,110,Open,,Raw,197.31,,197.31,B,2
Florida,M,110,Open,,Raw,176.9,,176.9,B,3
Canter,M,110,Open,,Raw,138.35,,138.35,B,4
Board,M,110,Open,,Raw,124.74,,124.74,B,5
Sunday,M,110,Master,40-999,Raw,183.7,,183.7,B,1
Magill,M,125,Open,,Raw,204.12,,204.12,B,1
John Steilner,M,125,Open,,Raw,199.58,,199.58,B,2
Mancino,M,125,Open,,Raw,192.78,,192.78,B,3
Mancino,M,125,Police,,Raw,192.78,,192.78,B,1
Pekular,M,125,Teen 17-19,17-19,Raw,149.69,,149.69,B,1
Cody Lentz,M,140,Open,,Raw,260.82,,260.82,B,1
Burger,M,140,Open,,Raw,215.46,,215.46,B,2
Roberts,M,140,Open,,Raw,197.31,,197.31,B,3
Jackson,M,140+,Open,,Raw,195.04,,195.04,B,1
