Division,WeightClassKg,Place,Name,Team,BodyweightKg,Best3SquatKg,Best3BenchKg,Best3DeadliftKg,TotalKg,Equipment,Event,Sex
Boys,51.71,1,Brandon Luevano,Haskell Paint Creek,50.26,74.84,52.16,117.93,244.94,Single-ply,SBD,M
Boys,51.71,2,Brady Estes,Dublin,45.81,83.91,43.09,90.72,217.72,Single-ply,SBD,M
Boys,55.79,1,Echo Jones,Strawn,52.34,147.42,63.5,174.63,385.55,Single-ply,SBD,M
Boys,59.87,2,Stanley Stevens,Ranger,55.88,136.08,68.04,136.08,340.19,Single-ply,SBD,M
Boys,55.79,3,Gabe Boyett,Moran,53.98,117.93,68.04,136.08,322.05,Single-ply,SBD,M
Boys,59.87,1,Mason Matthews,Gatesville,57.06,124.74,68.04,154.22,347,Single-ply,SBD,M
Boys,59.87,2,Daniel Rodriguez #5,Dublin,58.6,131.54,79.38,131.54,342.46,Single-ply,SBD,M
Boys,67.13,3,Christian Lee,Gatesville,60.06,81.65,61.23,113.4,256.28,Single-ply,SBD,M
Boys,67.13,1,Chance Alvarez,Gatesville,65.41,172.37,106.59,197.31,476.27,Single-ply,SBD,M
Boys,67.13,2,Ryan Martinez,Early,67.13,156.49,115.67,163.29,435.45,Single-ply,SBD,M
Boys,67.13,3,Casey Sisson,Bangs,65.32,147.42,77.11,158.76,383.29,Single-ply,SBD,M
Boys,67.13,4,Evan Gravell,Bangs,61.6,127.01,88.45,142.88,358.34,Single-ply,SBD,M
Boys,74.84,5,Christian Uhlhorn,Ranger,67.36,124.74,79.38,151.95,356.07,Single-ply,SBD,M
Boys,67.13,6,Israel Vazquez,Dublin,67.04,124.74,72.57,124.74,322.05,Single-ply,SBD,M
Boys,67.13,7,Randell Laird,Moran,60.33,120.2,52.16,136.08,308.44,Single-ply,SBD,M
Boys,74.84,1,Jacob Riley,Dublin,72.21,151.95,88.45,215.46,455.86,Single-ply,SBD,M
Boys,74.84,2,Anthony Garcia,Strawn,69.4,170.1,90.72,161.03,421.84,Single-ply,SBD,M
Boys,74.84,3,Josh Johnson,Gatesville,73.12,158.76,97.52,142.88,399.16,Single-ply,SBD,M
Boys,74.84,4,Taylor Coleman,Gatesville,69.13,129.27,83.91,124.74,337.93,Single-ply,SBD,M
Boys,74.84,DQ,Bailey Janisch,Gatesville,68.58,133.81,72.57,,,Single-ply,SBD,M
Boys,82.1,1,Grayson Ebarb,Early,78.56,213.19,117.93,170.1,501.22,Single-ply,SBD,M
Boys,82.1,2,Tate Tabor,Moran,79.83,172.37,104.33,208.65,485.34,Single-ply,SBD,M
Boys,82.1,3,Logan Thomas,Early,77.75,174.63,120.2,185.97,480.81,Single-ply,SBD,M
Boys,82.1,4,Gabriel Coronado,Dublin,79.29,179.17,88.45,181.44,449.06,Single-ply,SBD,M
Boys,82.1,5,Jacob Williams,Gatesville,75.84,129.27,90.72,154.22,374.21,Single-ply,SBD,M
Boys,89.81,1,Miguel Elizondo,Early,85.82,210.92,108.86,215.46,535.24,Single-ply,SBD,M
Boys,89.81,2,Kody Wages,Millsap,85,176.9,104.33,192.78,474,Single-ply,SBD,M
Boys,89.81,3,Tim Dorris,Strawn,84.64,199.58,102.06,167.83,469.47,Single-ply,SBD,M
Boys,89.81,4,Micah Waggoner,Moran,88.81,138.35,92.99,163.29,394.63,Single-ply,SBD,M
Boys,99.79,5,Ben Steele,Moran,89.9,127.01,79.38,127.01,333.39,Single-ply,SBD,M
Boys,99.79,1,Randy Charman,Ranger,91.35,163.29,77.11,197.31,437.72,Single-ply,SBD,M
Boys,99.79,2,Michael Robinson,Millsap,95.35,102.06,72.57,124.74,299.37,Single-ply,SBD,M
Boys,109.77,1,Ambrosio Rodriguez,Dublin,109.5,249.48,149.69,210.92,610.08,Single-ply,SBD,M
Boys,109.77,2,Brandon Taylor #6,Gatesville,103.42,217.72,113.4,224.53,555.65,Single-ply,SBD,M
Boys,109.77,3,David Madore,Ranger,106.23,201.85,147.42,206.38,555.65,Single-ply,SBD,M
Boys,109.77,4,Ethan Price,Dublin,107.05,183.7,124.74,174.63,483.08,Single-ply,SBD,M
Boys,124.74,1,Chris Bullington,Gatesville,118.21,244.94,129.27,204.12,578.33,Single-ply,SBD,M
Boys,124.74,2,Trace Boyd,Strawn,119.29,181.44,142.88,204.12,528.44,Single-ply,SBD,M
Boys,124.74,3,Ryan Belew,Dublin,124.74,158.76,86.18,158.76,403.7,Single-ply,SBD,M
Boys,124.74+,1,Landon Beck,Early,127.82,256.28,158.76,249.48,664.51,Single-ply,SBD,M
Boys,124.74+,2,Kelton Parson,Bangs,135.81,226.8,140.61,181.44,548.85,Single-ply,SBD,M
Boys,124.74+,3,Connor Murphy,Early,135.9,192.78,120.2,181.44,494.42,Single-ply,SBD,M
Boys,124.74+,4,Riley Russell,Millsap,128.82,147.42,115.67,156.49,419.57,Single-ply,SBD,M
Boys,,NS,Ethan Harper,Haskell Paint Creek,,,,,,Single-ply,SBD,M
Boys,,NS,Jaime Padron,Millsap,,,,,,Single-ply,SBD,M
Boys,,NS,Sam Jackson #1,Gatesville,,,,,,Single-ply,SBD,M
Boys,,NS,Gage Miller,Gatesville,,,,,,Single-ply,SBD,M
Boys,,NS,Quenton McKinnerney,Bangs,,,,,,Single-ply,SBD,M
Boys,,NS,Josh Moore,Strawn,,,,,,Single-ply,SBD,M
Boys,,NS,Xavier Olivo,Strawn,,,,,,Single-ply,SBD,M
Boys,,NS,Marcus Lopez,Strawn,,,,,,Single-ply,SBD,M
Boys,,NS,Zane Whitt,Moran,,,,,,Single-ply,SBD,M
