﻿BELGIUM DRUG FREE POWERLIFTING FEDERATION
BK. BENCH UNEQUIPPED 2016
                                                         W.Class                                                      1é      2é       3é       4     points
Open
1                                           1            - 50,5 KG Van Casteren    Hanne        F   18   T3   48,0    45      50       52,5           54,26
1                                           1            60 KG El Mahassani        Waled        M   18   T3   57,8    75      80       85       -90   71,85
2                                           1            60 KG Honoré              Jeffrey      M   22   JR   58,3    65      70       -72,5          58,63
1                                                        67,5 KG Van den Abbeele   Tim          M   28   SR   65,8    115     120      -125,5         89,15
2                                           1            67,5 KG Dierckx           Liam         M   21   JR   66,5    95      100      -102,5         73,57
1                                           1            75 KG Dhalluin            Jonas        M   22   JR   73,3    122,5   127,5    -130           86,28
2                                           1            75 KG Van de Haeghen      Christian    M   55   M4   73,9    100     105      -107,5         70,59
3                                                        75 KG Vanhaverbeke        Kenny        M   32   SR   73,1    95      100      -107,5         67,82
4                                           2            75 KG Vandenbosch         Kevin        M   21   JR   70,8    95      -100     -100           66,16
1                                                        82,5 KG Van Walle         Mike         M   36   SR   81,3    115     -117,5   -117,5         71,96
2                                           1            82,5 KG Vanglabeke        Noël         M   67   M6   81,5    92,5    97,5     -100           60,90
1                                                        90 KG Van Vooren          Kenneth      M   34   SR   85,1    115     120      125            75,80
2                                           1            90 KG Annaert             Gregg        M   21   JR   87,7    120                             71,36
1                                           1            100 KG Cheaitli           Hatem        M   17   T2   93,2    -145    155      -165           88,92
2                                                        100 KG Goethals           Dries        M   31   SR   100,0   -125    125      132,5          73,41
1                                                        110 KG Janssens           Roel         M   27   SR   101,1   162,5   170      -172,5         93,76
2                                           1            110 KG Gheldof            Marcel       M   51   M3   107,6   150     -160,5   -160,5         80,94
3                                                        110 KG Wouters            Sammuel  M       28   SR   101,2   115     120      -122,5         66,16
Nat Record                                  Drugtested
European Record                             POS
5 Nov Antwerpen
