Division,WeightClassKg,Place,Name,Team,BodyweightKg,Best3SquatKg,Best3BenchKg,Best3DeadliftKg,TotalKg,Equipment,Event,Sex
Boys,51.71,1,Dustin Richardson,Lake Worth,50.71,113.4,56.7,161.03,331.12,Single-ply,SBD,M
Boys,51.71,2,Austin Farrar,Fort Worth Western Hills,47.63,102.06,47.63,111.13,260.82,Single-ply,SBD,M
Boys,51.71,3,Jacob Lewis,Stephenville,41.41,70.31,45.36,83.91,199.58,Single-ply,SBD,M
Boys,51.71,4,Tanner Wisdom,Fort Worth Western Hills,42.77,61.23,34.02,74.84,170.1,Single-ply,SBD,M
Boys,55.79,1,Jared Hamilton,Cedar Hill,53.07,124.74,63.5,127.01,315.25,Single-ply,SBD,M
Boys,55.79,2,Tristan Zamarripa,Lake Worth,53.93,111.13,63.5,138.35,312.98,Single-ply,SBD,M
Boys,55.79,3,Celso Granda,Waco University,54.3,106.59,56.7,122.47,285.76,Single-ply,SBD,M
Boys,55.79,4,Ivan Oropeza,Fort Worth North Side,55.29,104.33,43.09,124.74,272.16,Single-ply,SBD,M
Boys,59.87,5,Blake Thompson,Stephenville,55.84,97.52,58.97,111.13,267.62,Single-ply,SBD,M
Boys,55.79,6,Joe Sosa,Fort Worth North Side,55.52,90.72,52.16,111.13,254.01,Single-ply,SBD,M
Boys,59.87,1,Jramarguis DeGrato,Waco University,57.2,142.88,83.91,142.88,369.68,Single-ply,SBD,M
Boys,59.87,2,Zack Rose,Cedar Hill,58.83,124.74,70.31,158.76,353.8,Single-ply,SBD,M
Boys,59.87,3,Terry Johnson,Fort Worth Wyatt,57.2,111.13,74.84,149.69,335.66,Single-ply,SBD,M
Boys,59.87,4,Tyler Madsen,Fort Worth Western Hills,59.69,97.52,56.7,142.88,297.1,Single-ply,SBD,M
Boys,59.87,5,Levisay Charles,Stephenville,59.56,102.06,65.77,120.2,288.03,Single-ply,SBD,M
Boys,59.87,6,Donald Funk,Lake Worth,59.87,79.38,58.97,111.13,249.48,Single-ply,SBD,M
Boys,59.87,NS,Raul Rodriguez,Hurst Bell,,,,,,Single-ply,SBD,M
Boys,67.13,1,Tyler Barnett,Keller Central,66.18,181.44,97.52,163.29,442.25,Single-ply,SBD,M
Boys,67.13,2,Jay Barton,Hurst Bell,60.42,147.42,88.45,142.88,378.75,Single-ply,SBD,M
Boys,67.13,3,David Brown #12,Hurst Bell,65.45,113.4,102.06,145.15,360.61,Single-ply,SBD,M
Boys,67.13,4,Uriel Medina,Lake Worth,66.32,131.54,86.18,140.61,358.34,Single-ply,SBD,M
Boys,67.13,5,Ian Astorga,Keller Central,60.51,111.13,83.91,136.08,331.12,Single-ply,SBD,M
Boys,67.13,6,Dalton Franklin,Lake Worth,65.54,95.25,72.57,138.35,306.17,Single-ply,SBD,M
Boys,67.13,7,Wes Lundy,Stephenville,66.63,97.52,61.23,133.81,292.57,Single-ply,SBD,M
Boys,67.13,8,Jalon Garrett,North Forney,63.82,102.06,70.31,115.67,288.03,Single-ply,SBD,M
Boys,67.13,9,Daniel Kresnik,North Forney,62.01,90.72,61.23,97.52,249.48,Single-ply,SBD,M
Boys,67.13,DQ,Nathon Oubre,Keller Central,64.77,,,,,Single-ply,SBD,M
Boys,74.84,1,Antonio Alba,Fort Worth North Side,73.16,197.31,115.67,226.8,539.77,Single-ply,SBD,M
Boys,74.84,2,Terrance Majors,Waco University,73.16,199.58,122.47,181.44,503.49,Single-ply,SBD,M
Boys,82.1,3,Jon Rojas,Keller Timber Creek,74.89,181.44,106.59,192.78,480.81,Single-ply,SBD,M
Boys,74.84,4,Tarick Crear,Cedar Hill,72.71,172.37,108.86,195.04,476.27,Single-ply,SBD,M
Boys,74.84,5,Isaiah Hines,Cedar Hill,69.31,149.69,92.99,195.04,437.72,Single-ply,SBD,M
Boys,74.84,6,James Toh,Hurst Bell,73.44,151.95,111.13,170.1,433.18,Single-ply,SBD,M
Boys,74.84,7,Austin White,Stephenville,74.39,136.08,106.59,181.44,424.11,Single-ply,SBD,M
Boys,74.84,8,Ja'Darias Wright,Waco University,72.98,158.76,81.65,179.17,419.57,Single-ply,SBD,M
Boys,74.84,9,Shea Smith,Hurst Bell,72.26,142.88,106.59,156.49,405.97,Single-ply,SBD,M
Boys,74.84,10,Kurt Rowe,Keller Central,69.22,136.08,88.45,147.42,371.95,Single-ply,SBD,M
Boys,74.84,11,Antonio Balcazar,Fort Worth Wyatt,68.31,117.93,81.65,165.56,365.14,Single-ply,SBD,M
Boys,74.84,12,Ao Stevenson,Fort Worth Western Hills,72.3,133.81,88.45,142.88,365.14,Single-ply,SBD,M
Boys,74.84,13,Blake Ritenour,Keller Central,68.13,129.27,88.45,142.88,360.61,Single-ply,SBD,M
Boys,74.84,14,David Hutto,Fort Worth Western Hills,68.36,111.13,83.91,161.03,356.07,Single-ply,SBD,M
Boys,74.84,15,Kolton Gifford,Keller,67.63,133.81,65.77,147.42,347,Single-ply,SBD,M
Boys,74.84,16,Josue Hernandez,Fort Worth North Side,70.49,117.93,65.77,158.76,342.46,Single-ply,SBD,M
Boys,82.1,17,Chris Perez,Fort Worth North Side,75.07,127.01,65.77,149.69,342.46,Single-ply,SBD,M
Boys,74.84,18,Greg Roberts,Lake Worth,69.22,117.93,68.04,149.69,335.66,Single-ply,SBD,M
Boys,74.84,19,Kade Suratt,Keller Central,74.66,104.33,65.77,129.27,299.37,Single-ply,SBD,M
Boys,74.84,DQ,Felipe Gallegos,Lake Worth,73.48,,,,,Single-ply,SBD,M
Boys,82.1,1,Justin Campos,Fort Worth North Side,81.78,204.12,117.93,204.12,526.17,Single-ply,SBD,M
Boys,82.1,2,Derrious Burns,Waco University,75.39,195.04,115.67,197.31,508.02,Single-ply,SBD,M
Boys,82.1,3,Lapone Finley,North Forney,81.51,170.1,97.52,204.12,471.74,Single-ply,SBD,M
Boys,82.1,4,Isiah Lewis,Cedar Hill,80.78,181.44,102.06,172.37,455.86,Single-ply,SBD,M
Boys,82.1,5,Payton Wynn,Lake Worth,79.38,154.22,92.99,165.56,412.77,Single-ply,SBD,M
Boys,82.1,6,Jeremy Horne,Keller,81.37,174.63,99.79,136.08,410.5,Single-ply,SBD,M
Boys,82.1,7,Sean Slater,Fort Worth Western Hills,78.74,156.49,65.77,183.7,405.97,Single-ply,SBD,M
Boys,82.1,8,Michael Edwards #6,Keller Timber Creek,76.25,124.74,83.91,185.97,394.63,Single-ply,SBD,M
Boys,82.1,9,Christian Garcia,Fort Worth Western Hills,79.38,120.2,65.77,124.74,310.71,Single-ply,SBD,M
Boys,82.1,NS,Pat Patterson,Fort Worth Wyatt,,,,,,Single-ply,SBD,M
Boys,89.81,1,Caleb Moreau,Fort Worth Western Hills,88.54,215.46,115.67,215.46,546.58,Single-ply,SBD,M
Boys,89.81,2,Amir Murad,Keller,89.31,170.1,104.33,183.7,458.13,Single-ply,SBD,M
Boys,89.81,3,Arturo Padilla,Fort Worth North Side,87.32,158.76,95.25,188.24,442.25,Single-ply,SBD,M
Boys,89.81,4,Steven Taylor,Cedar Hill,87.68,154.22,111.13,170.1,435.45,Single-ply,SBD,M
Boys,89.81,5,Miguel Sepulveda,North Forney,84.73,151.95,111.13,170.1,433.18,Single-ply,SBD,M
Boys,89.81,6,Anthony Rodriguez,Waco University,85.96,154.22,90.72,158.76,403.7,Single-ply,SBD,M
Boys,89.81,7,Chris Richardson,North Forney,87.77,140.61,97.52,151.95,390.09,Single-ply,SBD,M
Boys,89.81,8,Dillon Hebert,Keller,86.27,140.61,79.38,163.29,383.29,Single-ply,SBD,M
Boys,89.81,9,Jalen Miles,Cedar Hill,86.86,129.27,90.72,158.76,378.75,Single-ply,SBD,M
Boys,89.81,10,Beau Hughes,North Forney,87.32,136.08,70.31,158.76,365.14,Single-ply,SBD,M
Boys,89.81,NS,Martin Alvarez,Keller Central,,,,,,Single-ply,SBD,M
Boys,89.81,NS,James Daniels,Fort Worth Wyatt,,,,,,Single-ply,SBD,M
Boys,89.81,DQ,Matt Mullen,Keller Central,89.58,,,,,Single-ply,SBD,M
Boys,99.79,1,Spencer Heflin,Lake Worth,95.75,204.12,136.08,229.06,569.26,Single-ply,SBD,M
Boys,99.79,2,Jacob Burnley,Keller Central,93.85,213.19,129.27,217.72,560.19,Single-ply,SBD,M
Boys,99.79,3,DeAndre Kirtz,Keller Central,94.17,208.65,129.27,217.72,555.65,Single-ply,SBD,M
Boys,99.79,4,Jarad Howse,Hurst Bell,96.8,213.19,136.08,199.58,548.85,Single-ply,SBD,M
Boys,99.79,5,Chris Dimas,Lake Worth,98.75,204.12,124.74,213.19,542.04,Single-ply,SBD,M
Boys,99.79,6,Dillon Wilkes,Keller,98.66,183.7,145.15,204.12,532.97,Single-ply,SBD,M
Boys,99.79,7,Josh Flemming,Keller Timber Creek,96.66,181.44,136.08,192.78,510.29,Single-ply,SBD,M
Boys,99.79,8,Alfonzo Castellano,Keller Central,94.3,199.58,115.67,183.7,498.95,Single-ply,SBD,M
Boys,99.79,9,Jack St Germain,Hurst Bell,92.26,176.9,120.2,192.78,489.88,Single-ply,SBD,M
Boys,99.79,10,Cory Smith,Cedar Hill,91.31,165.56,108.86,190.51,464.93,Single-ply,SBD,M
Boys,99.79,11,Ashton Thirkill,Cedar Hill,98.47,170.1,108.86,181.44,460.4,Single-ply,SBD,M
Boys,99.79,12,Trevor Barton,Keller,96.93,181.44,92.99,183.7,458.13,Single-ply,SBD,M
Boys,99.79,13,Tommy Sanders,Stephenville,93.03,170.1,97.52,181.44,449.06,Single-ply,SBD,M
Boys,99.79,14,Taylor Smith #10,Cedar Hill,96.3,151.95,106.59,190.51,449.06,Single-ply,SBD,M
Boys,99.79,15,Eli Alonzo,North Forney,95.84,158.76,99.79,167.83,426.38,Single-ply,SBD,M
Boys,99.79,16,Austin Cutting,Keller Central,91.99,161.03,90.72,158.76,410.5,Single-ply,SBD,M
Boys,99.79,17,Robert Greene,Fort Worth North Side,98.66,136.08,74.84,136.08,347,Single-ply,SBD,M
Boys,99.79,NS,Carlos Diaz,Fort Worth North Side,,,,,,Single-ply,SBD,M
Boys,99.79,DQ,Cameron Salley,Hurst Bell,92.58,208.65,106.59,185.97,,Single-ply,SBD,M
Boys,99.79,NS,Jacoby Miller-Salem,Stephenville,,,,,,Single-ply,SBD,M
Boys,99.79,DQ,Jason Poole,Fort Worth Western Hills,90.36,,,,,Single-ply,SBD,M
Boys,109.77,1,Alex Fritz,Haltom City Haltom,104.42,254.01,161.03,233.6,648.64,Single-ply,SBD,M
Boys,109.77,2,Trevor Gardner,Lake Worth,105.32,204.12,142.88,213.19,560.19,Single-ply,SBD,M
Boys,109.77,3,AJ Willingham,Fort Worth Western Hills,107.55,201.85,156.49,183.7,542.04,Single-ply,SBD,M
Boys,109.77,4,Nef Pabon,Hurst Bell,108.5,199.58,145.15,197.31,542.04,Single-ply,SBD,M
Boys,109.77,5,Darious Alley,Waco University,109.09,197.31,120.2,195.04,512.56,Single-ply,SBD,M
Boys,109.77,6,Terry Jackson,North Forney,101.97,204.12,120.2,183.7,508.02,Single-ply,SBD,M
Boys,109.77,7,Glaedis Kalengayi,Hurst Bell,105.96,199.58,124.74,181.44,505.76,Single-ply,SBD,M
Boys,109.77,8,Vincent Green,Cedar Hill,102.33,195.04,113.4,195.04,503.49,Single-ply,SBD,M
Boys,109.77,9,Ryan Tharp,Hurst Bell,102.78,172.37,117.93,161.03,451.32,Single-ply,SBD,M
Boys,109.77,10,Kody Josserand,Stephenville,101.15,163.29,113.4,165.56,442.25,Single-ply,SBD,M
Boys,109.77,11,Lucas Herrera,Keller Timber Creek,103.19,151.95,113.4,170.1,435.45,Single-ply,SBD,M
Boys,109.77,12,Cody Curlee,Keller Timber Creek,107.95,161.03,102.06,156.49,419.57,Single-ply,SBD,M
Boys,109.77,13,Jordan Watson #2,Waco University,107.5,151.95,97.52,154.22,403.7,Single-ply,SBD,M
Boys,109.77,14,Eric Castruita,Fort Worth North Side,106.55,127.01,79.38,140.61,347,Single-ply,SBD,M
Boys,124.74,1,Mason White,Keller Timber Creek,112.94,249.48,145.15,249.48,644.1,Single-ply,SBD,M
Boys,124.74,2,Luke Young #2,Keller,121.97,226.8,124.74,210.92,562.45,Single-ply,SBD,M
Boys,124.74,3,Austin Burtnett,Keller,114.53,174.63,142.88,204.12,521.63,Single-ply,SBD,M
Boys,124.74,4,Kenny Johnson,Fort Worth Western Hills,121.43,183.7,120.2,215.46,519.36,Single-ply,SBD,M
Boys,124.74,5,Kody Hook,Stephenville,123.29,158.76,127.01,204.12,489.88,Single-ply,SBD,M
Boys,124.74,6,Tanner Jerrett,Stephenville,120.56,181.44,108.86,172.37,462.66,Single-ply,SBD,M
Boys,124.74,7,Cole Caldwell,Keller,115.62,183.7,106.59,163.29,453.59,Single-ply,SBD,M
Boys,124.74,8,Thomas Turner,Waco University,112.49,158.76,92.99,151.95,403.7,Single-ply,SBD,M
Boys,124.74,9,Christian Reyes,Fort Worth Western Hills,116.62,147.42,79.38,176.9,403.7,Single-ply,SBD,M
Boys,124.74,10,Sean Partridge,Fort Worth Western Hills,121.15,124.74,79.38,138.35,342.46,Single-ply,SBD,M
Boys,124.74+,1,Ben Hughes,Waco University,140.98,226.8,142.88,229.06,598.74,Single-ply,SBD,M
Boys,124.74+,2,Josh Aguilar,Waco University,135.67,226.8,158.76,204.12,589.67,Single-ply,SBD,M
Boys,124.74+,3,Guner Hudson,North Forney,134.04,195.04,124.74,206.38,526.17,Single-ply,SBD,M
Boys,124.74+,4,Jordan Kilcrease,Stephenville,141.57,226.8,140.61,147.42,514.83,Single-ply,SBD,M
Boys,124.74+,NS,Bryce Torrence,Fort Worth Wyatt,,,,,,Single-ply,SBD,M
Boys,124.74+,NS,Drion Casson,Fort Worth Wyatt,,,,,,Single-ply,SBD,M
Boys,124.74+,NS,Charles Brown,Fort Worth Wyatt,,,,,,Single-ply,SBD,M
Boys,124.74+,DQ,Zach Britton,Keller Central,127.78,226.8,,,,Single-ply,SBD,M
