Place,Name,Sex,BirthDate,Age,State,Equipment,Division,BodyweightKg,WeightClassKg,Squat1Kg,Squat2Kg,Squat3Kg,Squat4Kg,Best3SquatKg,Bench1Kg,Bench2Kg,Bench3Kg,Bench4Kg,Best3BenchKg,Deadlift1Kg,Deadlift2Kg,Deadlift3Kg,Deadlift4Kg,Best3DeadliftKg,TotalKg,Event,Team
1,Emily Daniel,F,1999-08-04,21,TX,Raw,Juniors,104.5,110,167.5,185,-192.5,,185,95,102.5,-112.5,,102.5,177.5,190,200,,200,487.5,SBD,Quads
1,Jennifer Martinez #11,F,1990-08-29,30,TX,Raw,Open,60,60,112.5,120,125,,125,62.5,65,67.5,,67.5,137.5,145,150,,150,342.5,SBD,
1,Lydia Wallace,F,1990-03-16,30,TX,Raw,Open,84,90,145,-150,150,,150,77.5,82.5,-85,,82.5,165,172.5,-177.5,,172.5,405,SBD,Quads Gym Keller Texas
1,Emily Daniel,F,1999-08-04,21,TX,Raw,Open,104.5,110,167.5,185,-192.5,,185,95,102.5,-112.5,,102.5,177.5,190,200,,200,487.5,SBD,Quads
1,Jessica Thompson #3,F,2000-06-05,20,TX,Raw,Open,133.9,110+,195,202.5,-220,,202.5,80,85,87.5,90,87.5,200,210,-220,,210,500,SBD,aWARD Winning Fitness
1,Tabitha Darnell,F,1978-10-10,42,TX,Wraps,Masters 40-44,71.05,75,112.5,125,137.5,,137.5,90,95,-97.5,,95,125,145,162.5,,162.5,395,SBD,Denison Nautilus and Underground Sports Nutrition
1,Mariela Vallejo,F,1992-08-03,28,TX,Raw,Open,74.8,75,115,120,-125,,120,50,55,-60,,55,122.5,130,140,,140,315,SBD,aWARD Winning Fitness
1,Gabby Grife,F,1987-11-04,33,TX,Wraps,Submasters,109.75,110,-100,100,115,,115,50,52.5,-55,,52.5,120,130,140,,140,307.5,SBD,aWARD Winning Fitness
1,Jessica Rosalez,F,2005-01-13,15,TX,Wraps,Teenage 13-15,59.4,60,62.5,80,85,,85,30,-40,-40,,30,92.5,115,120,125,120,235,SBD,
1,Regina Raine,F,,65,TX,Single-ply,Masters 65-69,68.7,75,85,97.5,107.5,,107.5,42.5,52.5,-62.5,,52.5,110,130,142.5,,142.5,302.5,SBD,
1,Angie Cervantes,F,1996-08-27,24,TX,Single-ply,Open,56,56,110,122.5,135,,135,42.5,57.5,60,,60,97.5,110,122.5,130,122.5,317.5,SBD,
1,Madison Villa,F,,17,TX,Single-ply,Teenage 16-17,46.7,48,95,102.5,110,112.5,110,60,67.5,70,,70,97.5,105,112.5,,112.5,292.5,SBD,
1,Keeley Jurca,F,2001-01-06,19,TX,Single-ply,Teenage 18-19,47.95,48,102.5,105,110,112.5,110,62.5,67.5,72.5,,72.5,95,102.5,-110,,102.5,285,SBD,
1,Tricia Garrett,F,1980-05-08,40,TX,Raw,Masters 40-44,55.7,56,,,,,,62.5,65,67.5,72.5,67.5,,,,,,67.5,B,Metroflex
1,Tricia Garrett,F,1980-05-08,40,TX,Raw,Open,55.7,56,,,,,,62.5,65,67.5,72.5,67.5,,,,,,67.5,B,Metroflex
1,Faith Idehen,F,1994-01-01,26,TX,Raw,Open,67,67.5,,,,,,,,,,,147.5,-160,165,,165,165,D,aWARD Winning Fitness
1,Ethan Perry,M,2003-04-06,17,TX,Raw,Teenage 16-17,77.05,82.5,102.5,122.5,-137.5,,122.5,85,97.5,102.5,,102.5,120,132.5,150,162.5,150,375,SBD,
1,Jose Aguilar,M,1997-08-23,23,TX,Wraps,Juniors,89.5,90,220,235,-250,,235,110,117.5,122.5,,122.5,232.5,252.5,-272.5,,252.5,610,SBD,
1,Austin Oliver #1,M,1997-08-05,23,TX,Wraps,Juniors,99.9,100,207.5,225,245,,245,185,-192.5,-192.5,,185,225,247.5,255,,255,685,SBD,Cannoli Castle
1,Eric Semifero,M,1977-02-22,43,TX,Wraps,Masters 40-44,121.35,125,295,320,325,,325,175,190,,,190,227.5,257.5,,,257.5,772.5,SBD,
1,Alex Mata,M,1998-08-29,22,TX,Wraps,Open,74.85,75,200,225,,,225,105,117.5,120,,120,220,-237.5,237.5,,237.5,582.5,SBD,Metroflex San Marcos
1,Arturo Mendoza,M,2000-09-21,20,TX,Wraps,Open,82,82.5,202.5,210,-215,,210,115,122.5,-130,,122.5,192.5,200,-207.5,,200,532.5,SBD,
2,Brandon Reeves,M,2000-09-30,20,TX,Wraps,Open,81.2,82.5,-175,-175,175,,175,107.5,-115,-115,,107.5,185,190,192.5,,192.5,475,SBD,
1,Jose Aguilar,M,1997-08-23,23,TX,Wraps,Open,89.5,90,220,235,-250,,235,110,117.5,122.5,,122.5,232.5,252.5,-272.5,,252.5,610,SBD,
2,Luis Padilla,M,1995-02-26,25,TX,Wraps,Open,88.2,90,147.5,-200,-225,,147.5,102.5,-140,-155,,102.5,147.5,190,-220,,190,440,SBD,
1,Tyler Oliver #1,M,1996-01-23,24,TX,Wraps,Open,92.8,100,255,262.5,275,,275,165,167.5,-170,,167.5,300,320,327.5,,327.5,770,SBD,
1,Erick Franco,M,1995-10-20,25,TX,Wraps,Open,109.2,110,195,-212.5,-215,,195,115,122.5,132.5,,132.5,205,225,240,,240,567.5,SBD,
1,Kyle Patterson,M,1991-04-30,29,TX,Wraps,Open,136.6,140,215,272.5,300,,300,182.5,200,-230,,200,250,300,327.5,,327.5,827.5,SBD,Strouds Fitness/Team Steel
2,Vincent Hernandez,M,1994-01-14,26,TX,Wraps,Open,136.2,140,302.5,312.5,325,,325,170,177.5,187.5,,187.5,270,280,290,,290,802.5,SBD,aWARD Winning Fitness
1,Louis Armstrong,M,1984-04-01,36,TX,Wraps,Submasters,126.2,140,200,237.5,277.5,,277.5,150,175,195,,195,200,240,275,,275,747.5,SBD,
1,Demetrius Murray,M,1981-03-12,,TX,Wraps,Submasters,150.75,140+,225,-250,-267.5,,225,220,242.5,-250,,242.5,225,250,-305,,250,717.5,SBD,Champion Fitness
1,Dax Lott,M,2003-06-12,17,TX,Multi-ply,Teenage 16-17,73.75,75,212.5,235,252.5,,252.5,160,187.5,192.5,,192.5,187.5,195,-202.5,,195,640,SBD,
1,Christopher Garcia,M,1990-02-10,30,TX,Raw,Open,130,140,,,,,,165,180,185,,185,205,-222.5,222.5,,222.5,407.5,BD,aWARD Winning Fitness
1,Todd Palvado,M,1984-10-12,36,TX,Raw,Open,142.5,140+,,,,,,175,-190,,,175,,,,,,175,B,
1,Todd Palvado,M,1984-10-12,36,TX,Raw,Submasters,142.5,140+,,,,,,175,-190,,,175,,,,,,175,B,
1,Larry Gatlin,M,1967-09-07,53,TX,Raw,Masters 50-54,117.9,118,,,,,,,,,,,182.5,205,-227.5,,205,205,D,War Room Fitness
