<svg width="36" height="36" viewBox="0 0 36 36" fill="none" xmlns="http://www.w3.org/2000/svg">
<path d="M3 22.0494V27.7531C3 28.8257 3.86953 29.6952 4.94214 29.6952C5.98345 29.6952 6.83947 28.874 6.88261 27.8336L6.94445 26.3423C6.94932 26.2249 6.96454 26.1081 6.98993 25.9933L7.19152 25.0818C7.22671 24.9227 7.2812 24.7685 7.35378 24.6227L7.82994 23.6658L8.25297 22.9574C8.54277 22.4721 8.61368 21.8869 8.44817 21.3464L8.18777 20.4961C8.14463 20.3552 8.07979 20.2219 7.99557 20.101L7.731 19.7213C7.39247 19.2354 6.70798 19.1489 6.25924 19.5353C6.13729 19.6404 6.04251 19.7733 5.98298 19.9228L5.8776 20.1876C5.81347 20.3487 5.72599 20.4994 5.61799 20.6351L5.53143 20.7438C5.31511 21.0155 5.00593 21.1975 4.66342 21.2549L4.52585 21.2779C4.38889 21.3009 4.24839 21.2898 4.11671 21.2457C3.56768 21.0618 3 21.4704 3 22.0494Z" fill="#00A7FF"/>
<ellipse cx="8.26904" cy="20.2835" rx="2.63452" ry="2.64706" fill="#00A7FF"/>
<path d="M32.9999 22.0494V27.7531C32.9999 28.8257 32.1304 29.6952 31.0578 29.6952C30.0165 29.6952 29.1605 28.874 29.1173 27.8336L29.0555 26.3423C29.0506 26.2249 29.0354 26.1081 29.01 25.9933L28.8084 25.0818C28.7732 24.9227 28.7187 24.7685 28.6462 24.6227L28.17 23.6658L27.747 22.9574C27.4572 22.4721 27.3863 21.8869 27.5518 21.3464L27.8122 20.4961C27.8553 20.3552 27.9202 20.2219 28.0044 20.101L28.2689 19.7213C28.6075 19.2354 29.292 19.1489 29.7407 19.5353C29.8627 19.6404 29.9574 19.7733 30.017 19.9228L30.1223 20.1876C30.1865 20.3487 30.2739 20.4994 30.3819 20.6351L30.4685 20.7438C30.6848 21.0155 30.994 21.1975 31.3365 21.2549L31.4741 21.2779C31.611 21.3009 31.7516 21.2898 31.8832 21.2457C32.4323 21.0618 32.9999 21.4704 32.9999 22.0494Z" fill="#828282"/>
<ellipse cx="27.5846" cy="20.2835" rx="2.63451" ry="2.64706" fill="#828282"/>
<path fill-rule="evenodd" clip-rule="evenodd" d="M28.0257 17.7835L31.3435 12.6443C31.4724 12.4446 31.5647 12.2235 31.616 11.9915L32.0599 9.98453C32.1023 9.79276 32.1163 9.59579 32.1013 9.39996L32.0134 8.25248C31.9898 7.94406 31.895 7.64532 31.7364 7.37975L31.0184 6.17748C30.7865 5.7891 30.4298 5.49082 30.0065 5.33132L29.6939 5.21357C29.558 5.16233 29.4168 5.12606 29.2729 5.10542L28.7062 5.02407C28.5459 5.00106 28.3833 4.99761 28.2221 5.0138L27.2616 5.11032C27.0887 5.12769 26.9189 5.16749 26.7563 5.22874L25.9896 5.51764C25.8836 5.55758 25.7812 5.60645 25.6835 5.66373L24.4733 6.37303C24.2105 6.52702 23.9864 6.73898 23.8181 6.99274L23.3434 7.70807C23.2454 7.85577 23.1675 8.01583 23.1117 8.18407L22.9031 8.81295C22.8068 9.10312 22.7791 9.41165 22.8221 9.71432L23.3006 13.0794C23.3281 13.2733 23.3271 13.4701 23.2975 13.6637L23.1178 14.8367C23.0771 15.1031 23.2125 15.3655 23.4534 15.4865L23.4721 15.4959C23.5779 15.549 23.6978 15.5671 23.8145 15.5476C24.1705 15.488 24.4884 15.7771 24.4628 16.1371L24.3918 17.136C24.3753 17.3677 24.2992 17.5911 24.1708 17.7847L23.4685 18.8431C23.2894 19.1131 23.0473 19.3355 22.7632 19.4912L21.9685 19.9267C21.7164 20.0649 21.4373 20.1471 21.1505 20.1677L19.6582 20.2748C19.5774 20.2806 19.4972 20.2935 19.4187 20.3132C18.7998 20.4687 18.3658 21.0251 18.3658 21.6632V23.018C18.3658 23.4392 18.4988 23.8496 18.7457 24.1907L19.4054 25.1021C19.4927 25.2227 19.5932 25.3332 19.705 25.4314L20.3564 26.0042C20.5874 26.2073 20.8622 26.3544 21.1594 26.434L22.5586 26.8089C22.7865 26.87 23.0233 26.8902 23.2582 26.8688L23.5794 26.8394C24.0349 26.7978 24.4623 26.6014 24.7905 26.2828L25.5773 25.5191C25.9289 25.1779 26.1429 24.7196 26.1789 24.231L26.4032 21.1891C26.4116 21.0758 26.4295 20.9634 26.457 20.8532L26.7497 19.6765C26.819 19.3982 26.9473 19.138 27.1259 18.9136L28.0257 17.7835ZM21.1536 23.705L21.015 23.5099C20.8218 23.2382 20.7697 22.8908 20.8747 22.5744C20.9556 22.3303 21.1237 22.1246 21.3467 21.9965L21.7136 21.7859C21.9195 21.6677 22.1449 21.587 22.3791 21.5478L22.9031 21.4601C23.3605 21.4601 23.7064 21.8741 23.6249 22.3242L23.4886 23.0777L23.3074 23.4872C23.0712 24.0212 22.4957 24.3194 21.9232 24.2043C21.6125 24.1419 21.3373 23.9633 21.1536 23.705Z" fill="#8D8D8D"/>
<path fill-rule="evenodd" clip-rule="evenodd" d="M8.26406 17.7793L4.9463 12.64C4.81738 12.4403 4.7251 12.2193 4.67377 11.9872L4.2299 9.98026C4.18748 9.78849 4.17355 9.59152 4.18854 9.39568L4.27639 8.2482C4.3 7.93979 4.39483 7.64105 4.55342 7.37547L5.27136 6.17321C5.50328 5.78483 5.86001 5.48655 6.28332 5.32705L6.59585 5.2093C6.73184 5.15806 6.87301 5.12179 7.01686 5.10114L7.58355 5.0198C7.74391 4.99678 7.90647 4.99334 8.06766 5.00953L9.02823 5.10605C9.20107 5.12341 9.37091 5.16322 9.53346 5.22447L10.3002 5.51337C10.4062 5.55331 10.5086 5.60218 10.6063 5.65946L11.8165 6.36875C12.0793 6.52275 12.3034 6.73471 12.4717 6.98847L12.9464 7.7038C13.0444 7.85149 13.1223 8.01156 13.1781 8.1798L13.3867 8.80868C13.483 9.09885 13.5107 9.40737 13.4677 9.71005L12.9892 13.0752C12.9616 13.269 12.9627 13.4658 12.9923 13.6594L13.172 14.8324C13.2127 15.0988 13.0773 15.3612 12.8364 15.4822L12.8177 15.4916C12.7119 15.5447 12.592 15.5629 12.4753 15.5433C12.1193 15.4837 11.8014 15.7728 11.827 16.1328L11.898 17.1317C11.9145 17.3634 11.9906 17.5869 12.119 17.7804L12.8213 18.8388C13.0004 19.1088 13.2425 19.3312 13.5266 19.4869L14.3213 19.9225C14.5734 20.0607 14.8525 20.1429 15.1393 20.1635L16.6316 20.2706C16.7124 20.2764 16.7926 20.2892 16.8711 20.3089C17.49 20.4644 17.924 21.0208 17.924 21.6589V23.0138C17.924 23.4349 17.791 23.8453 17.5441 24.1864L16.8844 25.0978C16.7971 25.2184 16.6966 25.3289 16.5848 25.4272L15.9334 25.9999C15.7023 26.203 15.4276 26.3501 15.1304 26.4297L13.7312 26.8046C13.5033 26.8657 13.2665 26.8859 13.0316 26.8645L12.7104 26.8351C12.2549 26.7935 11.8275 26.5971 11.4993 26.2786L10.7125 25.5148C10.3609 25.1736 10.1469 24.7153 10.1109 24.2267L9.88659 21.1848C9.87824 21.0715 9.86026 20.9592 9.83283 20.8489L9.54005 19.6722C9.4708 19.3939 9.3425 19.1337 9.16385 18.9094L8.26406 17.7793ZM15.1362 23.7007L15.2748 23.5057C15.468 23.234 15.5201 22.8865 15.4151 22.5701C15.3342 22.326 15.1661 22.1203 14.9431 21.9923L14.5762 21.7816C14.3703 21.6634 14.1449 21.5828 13.9107 21.5435L13.3867 21.4558C12.9293 21.4558 12.5834 21.8698 12.6649 22.3199L12.8012 23.0734L12.9824 23.4829C13.2186 24.0169 13.7941 24.3151 14.3666 24.2001C14.6773 24.1376 14.9525 23.959 15.1362 23.7007Z" fill="#8D8D8D"/>
</svg>
