# OBJ file format with ext .obj
v -2.000000 0.000000 0.000000
v -3.000000 0.000000 -1.000000
v -4.000000 0.000000 -0.000001
v -3.000000 0.000000 1.000000
v -1.000000 -1.732050 0.000000
v -1.500000 -2.598080 -1.000000
v -2.000000 -3.464100 -0.000001
v -1.500000 -2.598080 1.000000
v 1.000000 -1.732050 0.000000
v 1.500000 -2.598080 -1.000000
v 2.000000 -3.464100 -0.000001
v 1.500000 -2.598080 1.000000
v 2.000000 0.000000 0.000000
v 3.000000 0.000000 -1.000000
v 4.000000 0.000000 -0.000001
v 3.000000 0.000000 1.000000
v 1.000000 1.732050 0.000000
v 1.500000 2.598080 -1.000000
v 2.000000 3.464100 -0.000001
v 1.500000 2.598080 1.000000
v -1.000000 1.732050 0.000000
v -1.500000 2.598080 -1.000000
v -2.000000 3.464100 -0.000001
v -1.500000 2.598080 1.000000
f 2 1 6
f 5 6 1
f 3 2 7
f 6 7 2
f 4 3 8
f 7 8 3
f 1 4 5
f 8 5 4
f 6 5 10
f 9 10 5
f 7 6 11
f 10 11 6
f 8 7 12
f 11 12 7
f 5 8 9
f 12 9 8
f 10 9 14
f 13 14 9
f 11 10 15
f 14 15 10
f 12 11 16
f 15 16 11
f 9 12 13
f 16 13 12
f 14 13 18
f 17 18 13
f 15 14 19
f 18 19 14
f 16 15 20
f 19 20 15
f 13 16 17
f 20 17 16
f 18 17 22
f 21 22 17
f 19 18 23
f 22 23 18
f 20 19 24
f 23 24 19
f 17 20 21
f 24 21 20
f 22 21 2
f 1 2 21
f 23 22 3
f 2 3 22
f 24 23 4
f 3 4 23
f 21 24 1
f 4 1 24