^C:\USERS\PETR\DOCUMENTS\ANO1\DIP\X64\DEBUG\DEFAULTS.OBJ|C:\USERS\PETR\DOCUMENTS\ANO1\DIP\X64\DEBUG\DIP.OBJ|C:\USERS\PETR\DOCUMENTS\ANO1\DIP\X64\DEBUG\STDAFX.OBJ
C:\USERS\PETR\DOCUMENTS\ANO1\X64\DEBUG\DIP.EXE
C:\USERS\PETR\DOCUMENTS\ANO1\X64\DEBUG\DIP.ILK
C:\USERS\PETR\DOCUMENTS\ANO1\X64\DEBUG\DIP.PDB
