^C:\USERS\PETR\DOCUMENTS\ANO1\ANO1\X64\DEBUG\ANO1.OBJ|C:\USERS\PETR\DOCUMENTS\ANO1\ANO1\X64\DEBUG\DEFAULTS.OBJ|C:\USERS\PETR\DOCUMENTS\ANO1\ANO1\X64\DEBUG\STDAFX.OBJ
C:\USERS\PETR\DOCUMENTS\ANO1\X64\DEBUG\ANO1.EXE
C:\USERS\PETR\DOCUMENTS\ANO1\X64\DEBUG\ANO1.ILK
C:\USERS\PETR\DOCUMENTS\ANO1\X64\DEBUG\ANO1.PDB
^C:\USERS\PETR\DOCUMENTS\GITLAB\VSB-ANO1\ANO1\X64\DEBUG\ANO1.OBJ|C:\USERS\PETR\DOCUMENTS\GITLAB\VSB-ANO1\ANO1\X64\DEBUG\COLOROBJECTS.OBJ|C:\USERS\PETR\DOCUMENTS\GITLAB\VSB-ANO1\ANO1\X64\DEBUG\DEFAULTS.OBJ|C:\USERS\PETR\DOCUMENTS\GITLAB\VSB-ANO1\ANO1\X64\DEBUG\INDEXOBJECTS.OBJ|C:\USERS\PETR\DOCUMENTS\GITLAB\VSB-ANO1\ANO1\X64\DEBUG\MOMENTS.OBJ|C:\USERS\PETR\DOCUMENTS\GITLAB\VSB-ANO1\ANO1\X64\DEBUG\SHAPE.OBJ|C:\USERS\PETR\DOCUMENTS\GITLAB\VSB-ANO1\ANO1\X64\DEBUG\STDAFX.OBJ|C:\USERS\PETR\DOCUMENTS\GITLAB\VSB-ANO1\ANO1\X64\DEBUG\THRESHOLD.OBJ
C:\USERS\PETR\DOCUMENTS\GITLAB\VSB-ANO1\X64\DEBUG\ANO1.EXE
C:\USERS\PETR\DOCUMENTS\GITLAB\VSB-ANO1\X64\DEBUG\ANO1.ILK
C:\USERS\PETR\DOCUMENTS\GITLAB\VSB-ANO1\X64\DEBUG\ANO1.PDB
