{
	"hasPosition" : true,
	"navigation" : {
		"sort" : { "order" : 1 }
	},
	"ui" : {
		"fields" : {
			"name" : { "cols" : 12, "label" : "Name",  "hint" : "Radio Name" },
			"website" : { "cols" : 12, "label" : "Website", "hint": "http://www.radiowebsite.com/" },
			"streamURL" : { "cols" : 12, "label" : "Streaming URL", "hint" : "http://www.radiowebsite.com:8000/radio.mp3" },
			"skin" : { "cols" : 4, "label" : "Skin Name",  "hint" : "McClean" },
			"codec" : { "cols" : 4, "label" : "Codec" },
			"quality" : { "cols" : 4, "label" : "Quality", "hint" : "44.1khz 64bit stereo" }
		},
		"listingFields" : {
			"#" : { 
				"fields" : { "order" : null },
				"options" : { "setPosition" : true, "positionArrows" : true },
				"style" : "text-align:center;"
			},
			"Name" : { "fields" : { "name" : null } },
			"StreamingURL / Website" : {
				"fields" : {
					"_id" : [ "substr:-5", "a:<span class=\"glyphicon glyphicon-volume-up\">&nbsp;</span>:onclick=\"return modalPopup('live.php?id=%%&cn=workingExamples','Testing ...@@ live!', '115px');\" title=\"Test ...@@ Live!\"" ], 
					"streamURL" : [ "br" ],
					"website" : [ "a:%%:target=\"_blank\"" ]
				}
			},
			"Stream Info / Skin" : { "fields" : {
				"codec" : [ "bold", "suffix: / " ],
				"quality" :  [ "br" ],
				"skin" : null
			} }
		},
		"listingOptions" : {
			"descriptiveText" : [ "name" ],
			"dataTables" : {
				"order" : [[ 0, "asc" ]]
			},
			"pagination" : 50
		}
	},
	"fields" : {
		"name": { "type": "string", "trim" : true },
		"website": { "type": "string", "trim" : true, "nullable" : true },
		"streamURL": { "type": "string", "trim" : true },
		"skin": { "type": "string", "trim" : true },
		"codec": { "type": "multi", "options" : [ "mp3", "aac", "ogg", "opus" ] },
		"quality": { "type": "string", "trim" : true }
	}
}