{
	"ui" : {
		"label" : "Station",
		"pluralLabel" : "Stations",
		"onSubmit" : "return checkStationSubmit();",
		"fields" : {
			"name" : { "cols" : 12, "label" : "Name",  "hint" : "Station name" },
			"streamURL" : { "cols" : 12, "label" : "Streaming URL" },
			"imageURL" : { "cols" : 12, "label" : "External image (url)", "hint" : "Image URL" },
			"image" : { "cols" : 12, "label" : "Image File", "inputOptions": { "allowedFileTypes" : [ "image" ] }, "previewMode" : "image" },
			"desc" : { "cols" : 12, "label" : "Description", "hint" : "Station description" },
			"longDesc" : { "cols" : 12, "label" : "Description", "hint" : "Station long description", "height" : "60px" },
			"cat" : { "cols" : 3, "label" : "Category" },
			"codec" : { "cols" : 3, "label" : "Codec" },
			"buffer" : { "cols" : 3, "label" : "Buffer (ms)", "min" : 0, "max": 10000 },
			"published" : { "cols" : 3, "label" : "Published", "class" : "text-danger", "trueTxt" : "YES", "falseTxt" : "NO" }
		},
		"listingFields" : {
			"ID" : {
				"fields" : { "_id" : [ "prefix:...", "substr:-5" ] },
				"style" : "text-align:center;width:100px;"
			},
			"Image" : {	"fields" : {
				"imageURL" : [ "emptyCut:", "img:style=\"width:100px;\"" ],
				"image" : [ "emptyCut:", "fileUrl", "img:style=\"width:100px;\"" ] 
			} },
			"Name" : { "fields" : { "name" : null } },
			"Category" : { "fields" : { "cat" : null } },
			"CODEC" : { "fields" : { "codec" : null } },
			"Streaming URL" : { "fields" : { 
				"_id" : [ "substr:-5", "a:<span class=\"glyphicon glyphicon-volume-up\">&nbsp;</span>:onclick=\"return modalPopup('live.php?id=%%','Testing ...@@ live!', '115px');\" title=\"Test ...@@ Live!\"" ], 
				"streamURL" : [ "truncate:60:..." ] 
			} }
		},
		"listingOptions" : {
			"descriptiveText" : [ "name" ],
			"dataTables" : {
				"order" : [[ 0, "asc" ]]
			},
			"pagination" : 50
		}
	},
	"fields" : {
		"name" : { "type" : "string" , "trim" : true },
		"desc" : { "type" : "string" , "trim" : true },
		"imageURL" : { "type" : "string" , "trim" : true, "nullable" : true },
		"image" : { "type" : "file", "nullable": true },			
		"longDesc" : { "type" : "text" , "trim" : true, "nullable" : true },
		"streamURL" : { "type" : "string" , "trim" : true, "nullable" : true },
		"buffer" : { "type" : "int" },
		"cat" : { "type" : "multi" , "options" : [ "-uncategorized-", "Rock", "Pop", "News", "Jazz", "Sports", "70s", "80s", "90s", "2000s" ] },
		"codec" : { "type" : "multi", "options" : [ "-unknown-", "aac", "mp3", "ogg", "rtmp" ] },
		"published" : { "type" : "bool" }
	}
}