{
	"ui" : {
		"fields" : {
			"name" : { "separator": "", "cols" : 12, "label" : "Name", "hint" : "Museter" },
			"contactName" : { "cols" : 6, "label" : "Contact name", "hint" : "John Snow" },
			"contactEMail" : { "cols" : 6, "label" : "Type", "hint" : "johnsnow@winterfell.com"  },
			"enabled" : { "cols" : 4, "label" : "Enabled", "class" : "text-danger" },
			"contractDetails" : { "cols" : 8, "label" : "Contract details", "height":"60px", "hint" : "Enter payment method, period, amount, dates, etc..." },

			"bannerCategory" : { "separator": "Banner info", "cols" : 4, "label" : "Banner category" },
			"bannerURL" : { "cols" : 4, "label" : "Banner URL", "hint" : "http://winterfell.com/promo" },
			"bannerImage" : { "cols" : 4, "label" : "Banner Image", "hint" : "image/ads/museter.png" },

			"hasCustomForm" : { "separator": "Sample radio for custom form", "cols" : 4, "label" : "Enable custom form" },
			"sampleStreamURL" : { "cols" : 4, "label" : "Streaming URL", "hint" : "http://67.213.213.143:8048/;" },
			"sampleTitle" : { "cols" : 4, "label" : "Title", "hint": "Winterfell FM" },
			"customFormID" : { "cols" : 4, "label" : "Custom Form ID", "hint": "COMCITIES" },
			"sampleCodec" : { "cols" : 4, "label" : "Codec" },
			"mrpScript" : { "cols" : 4, "label" : "MRP JS Script", "hint" : "(leave empty for default: https://hosted.muses.org/mrp.js)" }
		},
		"listingFields" : {
			"ID" : { "fields" : {
				"enabled" : [ "bool:: <b>[disabled]</b>", "style:color:red;font-size:0.8em;", "br" ],
				"_id" : [ "prefix:...", "substr:-5" ]
			} },
			"Name" : { "fields" : {
				"name" : [ "bold", "br" ],
				"contactName" : [ "emptyCut:", "format:\"%s\" ", "italic", "br" ],
				"contactEMail" : [ "emptyCut:", "format:&lt;%s&gt;", "italic" ]
			} },
			"Banner" : { "fields" : {
				"bannerCategory" : [ "bold", "ucfirst", "br" ],
				"bannerURL" : [ "emptyCut:", "a:%%:target=\"_blank\"", "br" ],
				"bannerImage" : [ "emptyCut:", "format:../%s", "img:style=\"width:100px\"" ]
			} },
			"Custom form" : { "fields" : {
				"hasCustomForm" : [ "bool::<font color=\"#D90\">[disabled]</font><br/> ", "bold", "style:font-size:0.8em;" ],
				"customFormID" : [ "emptyCut:", "format:<a href=\"../hosted-form:%1$s\" target=\"_blank\">hosted&#8209;form:%1$s</a>", "br"],
				"sampleTitle" : null,
				"sampleStreamURL" : [ "prefix: ", "truncate:30:...", "style:color:#999;" ],
				"mrpScript" : [ "emptyCut:", "prefix:<br/>", "format:<b>MRP Script:</b> %s", "style:color:#900;font-size:0.7em;"]
			} }
		},
		"listingOptions" : {
			"descriptiveText" : [ "name" ],
			"dataTables" : {
				"order" : [[ 0, "desc" ]],
				"ajax" : {
					"url" : "",
					"searchFields" : [ "name", "contactName", "contactEMail" ]
				}
			},
			"pagination" : 50
		}
	},
	"fields" : {
		"name" : { "type": "string", "trim": true },
		"contactName" : { "type": "string", "trim": true, "nullable": true },
		"contactEMail" : { "type": "email", "trim": true, "nullable": true },
		"contractDetails" : { "type" : "text", "trim": true, "nullable": true },
		"enabled" : { "type" : "bool" },
		"bannerCategory" : { "type" : "multi", "options" : [ "-none-", "platinum", "gold", "silver" ] },
		"hasCustomForm" : { "type" : "bool" },
		"bannerURL" : { "type": "string", "trim": true, "nullable": true },
		"bannerImage" : { "type": "string", "trim": true, "nullable": true },
		"customFormID" : { "type": "string", "trim": true, "nullable": true },
		"sampleStreamURL" : { "type": "string", "trim": true, "nullable": true },
		"sampleTitle" : { "type": "string", "trim": true, "nullable": true },
		"sampleCodec" : { "type": "multi", "options" : ["mp3","aac","ogg" ] },
		"mrpScript" : { "type": "string", "trim": true, "nullable": true }
	}
}