{
	"hasPosition" : true,
	"navigation" : {
		"sort" : { "order" : -1 }
	},
	"ui" : {
		"fields" : {
			"day" : { "cols" : 3, "label" : "Day",  "hint" : "Day" },
			"month" : { "cols" : 3, "label" : "Month" },
			"year" : { "cols" : 3, "label" : "Year", "hint" : "Year" },
			"published" : { "cols" : 3, "label" : "Published" },
			"title" : { "separator": "English", "cols" : 12, "label" : "Title",  "hint" : "News Title", "style" : "font-size:1.2em" },
			"text" : { "cols" : 12, "label" : "Text", "hint" : "News Text", "height" : "200px" },
			"title_es" : { "separator": "Spanish", "cols" : 12, "label" : "Title",  "hint" : "News Title", "style" : "font-size:1.2em" },
			"text_es" : { "cols" : 12, "label" : "Text", "hint" : "News Text", "height" : "200px" }
		},
		"listingFields" : {
			"#" : {
				"fields" : { "order" : null },
				"options" : { "setPosition" : true, "positionArrows" : false },
				"style" : "text-align:center;"
			},
			"Date" : {
				"fields" : {
					"month" : [ "concat:&nbsp;" ],
					"day" : [ "br" ],
					"year" : [ "style:font-size:0.9em;color:#999;", "br" ],
					"published" : [ "bool::not published", "style:font-size:0.6em;color:red;", "bold" ]
				},
				"style" : "text-align:center;"
			},
			"Title/Text" : { "fields" : {
				"title" : [ "bold", "br" ],
				"text" :  [ "br" ],
				"title_es" : [ "emptyCut:<span style=\"color:red;\">-Missing spanish translation-</span>", "bold", "br" ],
				"text_es" :  null
			} }
		},
		"listingOptions" : {
			"descriptiveText" : [ "title" ],
			"dataTables" : {
				"order" : [[ 0, "desc" ]]
			},
			"pagination" : 50
		}
	},
	"fields" : {
		"day": { "type": "int", "min": 1, "max": 31 },
		"month": { "type": "multi", "options" : [ "Jan", "Feb", "Mar", "Apr", "Jun", "Jul", "Aug", "Sep", "Oct", "Nov", "Dec" ] },
		"year": { "type": "int", "min": 2010, "max": 2100 },
		"title": { "type": "string", "trim": true },
		"text": { "type": "richtext", "trim": true },
		"title_es": { "type": "string", "trim": true },
		"text_es": { "type": "richtext", "trim": true },
		"published" : { "type": "bool" }
	}
}