{
	"hasPosition" : true,
	"navigation" : {
		"sort" : { "order" : 1 },
		"softDeleteField" : "deleted"
	},
	"ui" : {
		"fields" : {
			"name" : { "cols" : 12, "label" : "Name", "hint" : "SuperSkin" },
			"zipFile" : { "cols" : 12, "label" : "Zip File", "inputOptions": { "allowedFileExtensions" : [ "zip" ] } },
			"fname" : { "cols" : 4, "label" : "File Name",  "hint" : "superskin" },
			"width" : { "cols" : 4, "label" : "Width (px)" },
			"height" : { "cols" : 4, "label" : "Height (px)"  },
			"author" : { "cols" : 6, "label" : "Author",  "hint" : "Giuseppe Verdi" },
			"country" : { "cols" : 6, "label" : "Country", "hint" : "Italy" },
			"official" : { "cols" : 4, "label" : "Is official", "trueTxt" : "YES", "falseTxt" : "NO" },
			"elegible" : { "cols" : 4, "label" : "Elegible on home", "trueTxt" : "YES", "falseTxt" : "NO" },
			"default" : { "cols" : 4, "label" : "Default", "trueTxt" : "YES", "falseTxt" : "NO" }
		},
		"listingFields" : {
			"#" : {
				"fields" : { "order" : [ "format:% 5d" ] },
				"options" : { "setPosition" : true, "positionArrows" : true },
				"style" : "text-align:center;"
			},
			"Name" : { "fields" : { 
				"name" : [ "bold", "br" ], 
				"fname" : null,
				"default" : [ "bool: (Default skin):" , "bold", "style:font-size:0.8em;color:#A00;" ]
			} },
			"Properties" : { "fields" : {
				"width" : null, 
				"height" : [ "prefix:x", "suffix: (px)", "br" ],
				"official" : [ "bool:Official Skin:Community Skin", "italic", "style:font-size:0.9em;color:#999;"  ],
				"elegible" : [ "bool: [elegible for home]:", "italic", "style:font-size:0.8em;color:#9D0;" ]
			} },
			"Author" : { "fields" : {
				"author" : [ "bold", "br" ],
				"country" :  null
			} }
		},
		"listingOptions" : {
			"descriptiveText" : [ "name" ],
			"dataTables" : {
				"order" : [[ 0, "asc" ]]
			},
			"pagination" : 50
		}
	},
	"fields" : {
		"official": { "type": "bool" },
		"elegible": { "type": "bool" },
		"name": { "type": "string", "trim" : true },
		"fname": { "type": "string", "trim" : true },
		"width": { "type": "int" },
		"height": { "type": "int" },
		"author": { "type": "string", "trim" : true, "nullable" : true },
		"country": { "type": "string", "trim" : true, "nullable" : true },
		"default": { "type": "bool" },
		"zipFile": { "type": "file", "nullable" : true },
		"images": { "type": "files", "nullable" : true }
	}
}