<svg width="27" height="24" viewBox="0 0 27 24" fill="none" xmlns="http://www.w3.org/2000/svg">
<path d="M19.4177 12.0337H26.8332L23.1255 15.7223L19.4177 12.0337Z" fill="#FF3E17"/>
<path d="M7.58193 12.0337L0.166504 12.0337L3.87421 8.34502L7.58193 12.0337Z" fill="#FF3E17"/>
<path d="M21.7129 12.2231C21.7149 12.149 21.7159 12.0747 21.7159 12.0001C21.7159 7.43826 18.0177 3.74013 13.4559 3.74013C10.618 3.74013 8.11447 5.17121 6.62746 7.35105L4.61365 5.33718C6.63437 2.65977 9.84302 0.929199 13.4559 0.929199C19.5702 0.929199 24.5268 5.88583 24.5268 12.0001C24.5268 12.8911 24.4215 13.7575 24.2228 14.5875L21.7129 12.2231Z" fill="#FF3E17"/>
<path d="M20.3258 16.5877C18.8441 18.8021 16.3203 20.2601 13.4559 20.2601C8.89398 20.2601 5.19585 16.562 5.19585 12.0001C5.19585 11.9662 5.19605 11.9323 5.19646 11.8985L2.63696 9.64036C2.47187 10.4008 2.38492 11.1903 2.38492 12.0001C2.38492 18.1144 7.34155 23.0711 13.4559 23.0711C17.0951 23.0711 20.3243 21.3151 22.3422 18.6042L20.3258 16.5877Z" fill="#FF3E17"/>
</svg>
