{
    "name": "kafka1-1-mysql-simpsons",
    "config": {
        "connector.class": "io.debezium.connector.mysql.MySqlConnector",
        "tasks.max": 1,
        "topic.creation.default.replication.factor": 3,
        "topic.creation.default.partitions": 10,
        "connection.timeout.ms": 50000,
        "read.timeout.ms": 50000,

        "database.server.name": "DBSERVER",
        "database.hostname": "DEBHOST",
        "database.port": "3306",
        "database.user": "USER_NAME",
        "database.password": "USER_PASSWORD",
        "database.server.id": "DBID42",
        "database.allowPublicKeyRetrieval":"true",
        
        "transforms": "unwrap",
        "transforms.unwrap.type": "io.debezium.transforms.ExtractNewRecordState",
        "transforms.unwrap.add.source.fields": "table,lsn",
        "key.converter": "org.apache.kafka.connect.json.JsonConverter",
        "key.converter.schemas.enable": "false",
        "value.converter": "org.apache.kafka.connect.json.JsonConverter",
        "value.converter.schemas.enable": "false",

        "database.history.kafka.bootstrap.servers": "kafka1-1:9092, kafka1-2:9092, kafka1-3:9092",
        "database.history.kafka.topic": "dbhistory.kafka1-1-mysql-simpsons",
        "include.schema.changes": "true"
    }
}
