{
  "name": "dangkimonhoc",
  "auto": true,
  "contexts": [],
  "responses": [
    {
      "resetContexts": false,
      "action": "",
      "affectedContexts": [],
      "parameters": [
        {
          "dataType": "@hanh_dong",
          "name": "hanh_dong",
          "value": "$hanh_dong",
          "isList": false
        }
      ],
      "messages": [],
      "defaultResponsePlatforms": {
        "facebook": true
      },
      "speech": []
    }
  ],
  "priority": 500000,
  "webhookUsed": true,
  "webhookForSlotFilling": true,
  "fallbackIntent": false,
  "events": []
}