<?xml version="1.0" standalone="no"?>
<!DOCTYPE svg PUBLIC "-//W3C//DTD SVG 1.1//EN" "http://www.w3.org/Graphics/SVG/1.1/DTD/svg11.dtd" >
<svg xmlns="http://www.w3.org/2000/svg" xmlns:xlink="http://www.w3.org/1999/xlink" version="1.1">
<metadata>
Created by FontForge 20170910 at Wed May  1 15:11:59 2019
 By Jimmy Wärting
Digitized data copyright (c) 2010-2012 Google Corporation.
</metadata>
<defs>
<font id="Arimo-Bold" horiz-adv-x="1139" >
  <font-face 
    font-family="Arimo"
    font-weight="700"
    font-stretch="normal"
    units-per-em="2048"
    panose-1="2 11 7 4 2 2 2 2 2 4"
    ascent="1638"
    descent="-410"
    x-height="1082"
    cap-height="1409"
    bbox="-32 -434 1931 1484"
    underline-thickness="215"
    underline-position="-324"
    unicode-range="U+0030-007A"
  />
<missing-glyph horiz-adv-x="1536" 
d="M205 1409h1125v-1409h-1125v1409zM281 1333v-1257h973v1257h-973z" />
    <glyph glyph-name=".notdef" horiz-adv-x="1536" 
d="M205 1409h1125v-1409h-1125v1409zM281 1333v-1257h973v1257h-973z" />
    <glyph glyph-name=".null" horiz-adv-x="0" 
 />
    <glyph glyph-name="nonmarkingreturn" horiz-adv-x="569" 
 />
    <glyph glyph-name="space" horiz-adv-x="569" 
 />
    <glyph glyph-name="zero" unicode="0" 
d="M1055 705q0 -357 -122.5 -541t-367.5 -184q-484 0 -484 725q0 253 53 413t159 236t280 76q250 0 366 -181t116 -544zM773 705q0 195 -19 303t-61 155t-122 47q-85 0 -128.5 -47.5t-62 -155t-18.5 -302.5q0 -193 19.5 -301.5t62 -155.5t123.5 -47q80 0 123.5 49.5
t63 158.5t19.5 296z" />
    <glyph glyph-name="one" unicode="1" 
d="M129 0v209h349v961l-338 -211v221l353 229h266v-1200h323v-209h-953z" />
    <glyph glyph-name="two" unicode="2" 
d="M71 0v195q55 121 156.5 236t255.5 240q148 120 207.5 198t59.5 153q0 184 -185 184q-90 0 -137.5 -48.5t-61.5 -145.5l-283 16q24 196 146.5 299t333.5 103q228 0 350 -104t122 -292q0 -99 -39 -179t-100 -147.5t-135.5 -126.5t-144.5 -115t-127.5 -113t-85.5 -122h654
v-231h-986z" />
    <glyph glyph-name="three" unicode="3" 
d="M1065 391q0 -198 -130 -306t-370 -108q-227 0 -361 104.5t-157 301.5l286 25q27 -203 231 -203q101 0 157 50t56 153q0 94 -68 144t-202 50h-98v227h92q121 0 182 49.5t61 141.5q0 87 -48.5 136.5t-141.5 49.5q-87 0 -140.5 -48t-61.5 -136l-281 20q22 182 151 285
t337 103q221 0 345.5 -99.5t124.5 -275.5q0 -132 -77.5 -217t-223.5 -113v-4q162 -19 249.5 -106.5t87.5 -223.5z" />
    <glyph glyph-name="four" unicode="4" 
d="M940 287v-287h-268v287h-641v211l595 911h314v-913h188v-209h-188zM672 957q0 54 3.5 117t5.5 81q-26 -56 -94 -162l-327 -497h412v461z" />
    <glyph glyph-name="five" unicode="5" 
d="M1082 469q0 -224 -139.5 -356.5t-382.5 -132.5q-212 0 -339.5 95.5t-157.5 276.5l281 23q22 -90 78 -131t141 -41q105 0 167.5 67t62.5 193q0 111 -59 177.5t-165 66.5q-117 0 -191 -91h-274l49 793h847v-209h-592l-23 -356q102 90 255 90q201 0 321.5 -125t120.5 -340z
" />
    <glyph glyph-name="six" unicode="6" 
d="M1065 461q0 -225 -126 -353t-348 -128q-249 0 -382.5 174.5t-133.5 517.5q0 377 135.5 567.5t387.5 190.5q179 0 282.5 -79t146.5 -245l-265 -37q-38 139 -170 139q-113 0 -177.5 -113t-64.5 -343q45 75 125 115t181 40q189 0 299 -120t110 -326zM783 453
q0 120 -55.5 183.5t-152.5 63.5q-93 0 -149 -59.5t-56 -157.5q0 -123 58.5 -203.5t153.5 -80.5t148 67.5t53 186.5z" />
    <glyph glyph-name="seven" unicode="7" 
d="M1049 1186q-95 -150 -179.5 -291t-147.5 -283.5t-99.5 -293t-36.5 -318.5h-293q0 176 46 340.5t133 335t316 502.5h-700v231h961v-223z" />
    <glyph glyph-name="eight" unicode="8" 
d="M1076 397q0 -198 -131 -307.5t-374 -109.5q-241 0 -373.5 109t-132.5 306q0 135 78 227.5t209 114.5v4q-114 25 -184 113t-70 203q0 173 122.5 273t346.5 100q229 0 351.5 -97.5t122.5 -277.5q0 -115 -69.5 -202t-186.5 -110v-4q136 -22 213.5 -111.5t77.5 -230.5z
M752 1040q0 100 -46 146.5t-139 46.5q-182 0 -182 -193q0 -202 184 -202q92 0 137.5 47t45.5 155zM785 420q0 221 -220 221q-102 0 -156.5 -58t-54.5 -167q0 -124 54 -181t165 -57q109 0 160.5 57t51.5 185z" />
    <glyph glyph-name="nine" unicode="9" 
d="M1063 727q0 -375 -137 -561t-389 -186q-186 0 -291.5 79.5t-149.5 251.5l264 37q39 -147 180 -147q118 0 181.5 113t65.5 335q-38 -75 -124.5 -117.5t-186.5 -42.5q-186 0 -295.5 126.5t-109.5 342.5q0 222 128.5 347t363.5 125q253 0 376.5 -175.5t123.5 -527.5z
M766 924q0 131 -57.5 208.5t-152.5 77.5q-93 0 -146.5 -67.5t-53.5 -186.5q0 -117 53 -187.5t148 -70.5q90 0 149.5 61.5t59.5 164.5z" />
    <glyph glyph-name="A" unicode="A" horiz-adv-x="1479" 
d="M1133 0l-125 360h-537l-125 -360h-295l514 1409h348l512 -1409h-292zM739 1192l-6 -22q-10 -36 -24 -82t-172 -506h405l-139 405l-43 136z" />
    <glyph glyph-name="B" unicode="B" horiz-adv-x="1479" 
d="M1386 402q0 -192 -144 -297t-400 -105h-705v1409h645q258 0 390.5 -89.5t132.5 -264.5q0 -120 -66.5 -202.5t-202.5 -111.5q171 -20 260.5 -107.5t89.5 -231.5zM1008 1015q0 95 -60.5 135t-179.5 40h-336v-349h338q125 0 181.5 43.5t56.5 130.5zM1090 425q0 198 -284 198
h-374v-404h385q142 0 207.5 51.5t65.5 154.5z" />
    <glyph glyph-name="C" unicode="C" horiz-adv-x="1479" 
d="M795 212q267 0 371 268l257 -97q-83 -204 -243.5 -303.5t-384.5 -99.5q-340 0 -525.5 192.5t-185.5 538.5q0 347 179 533t519 186q248 0 404 -99.5t219 -292.5l-260 -71q-33 106 -129.5 168.5t-227.5 62.5q-200 0 -303.5 -124t-103.5 -363q0 -243 106.5 -371t307.5 -128z
" />
    <glyph glyph-name="D" unicode="D" horiz-adv-x="1479" 
d="M1393 715q0 -218 -85.5 -380.5t-242 -248.5t-358.5 -86h-570v1409h510q356 0 551 -179.5t195 -514.5zM1096 715q0 227 -118 346.5t-337 119.5h-209v-953h250q190 0 302 131t112 356z" />
    <glyph glyph-name="E" unicode="E" horiz-adv-x="1366" 
d="M137 0v1409h1108v-228h-813v-354h752v-228h-752v-371h854v-228h-1149z" />
    <glyph glyph-name="F" unicode="F" horiz-adv-x="1251" 
d="M432 1181v-436h721v-228h-721v-517h-295v1409h1039v-228h-744z" />
    <glyph glyph-name="G" unicode="G" horiz-adv-x="1593" 
d="M806 211q115 0 223 33.5t167 85.5v195h-344v218h614v-518q-112 -115 -291.5 -180t-376.5 -65q-344 0 -529 190.5t-185 540.5q0 348 186 533.5t535 185.5q496 0 631 -367l-272 -82q-44 107 -138 162t-221 55q-208 0 -316 -126t-108 -361q0 -239 111.5 -369.5t313.5 -130.5
z" />
    <glyph glyph-name="H" unicode="H" horiz-adv-x="1479" 
d="M1046 0v604h-614v-604h-295v1409h295v-561h614v561h295v-1409h-295z" />
    <glyph glyph-name="I" unicode="I" horiz-adv-x="569" 
d="M137 0v1409h295v-1409h-295z" />
    <glyph glyph-name="J" unicode="J" 
d="M524 -20q-219 0 -336.5 95t-156.5 307l293 43q18 -109 67 -161.5t135 -52.5q88 0 133.5 59t45.5 169v739h-281v231h575v-963q0 -220 -125 -343t-350 -123z" />
    <glyph glyph-name="K" unicode="K" horiz-adv-x="1479" 
d="M1112 0l-506 647l-174 -133v-514h-295v1409h295v-639l635 639h344l-602 -596l651 -813h-348z" />
    <glyph glyph-name="L" unicode="L" horiz-adv-x="1251" 
d="M137 0v1409h295v-1181h756v-228h-1051z" />
    <glyph glyph-name="M" unicode="M" horiz-adv-x="1706" 
d="M1307 0v854q0 29 0.5 58t9.5 249q-71 -269 -105 -375l-254 -786h-210l-254 786l-107 375q12 -232 12 -307v-854h-262v1409h395l252 -788l22 -76l48 -189l63 226l259 827h393v-1409h-262z" />
    <glyph glyph-name="N" unicode="N" horiz-adv-x="1479" 
d="M995 0l-614 1085q18 -158 18 -254v-831h-262v1409h337l623 -1094q-18 151 -18 275v819h262v-1409h-346z" />
    <glyph glyph-name="O" unicode="O" horiz-adv-x="1593" 
d="M1507 711q0 -220 -87 -387t-249 -255.5t-378 -88.5q-332 0 -520.5 195.5t-188.5 535.5q0 339 188 529t523 190t523.5 -192t188.5 -527zM1206 711q0 228 -108 357.5t-303 129.5q-198 0 -306 -128.5t-108 -358.5q0 -232 110.5 -365.5t301.5 -133.5q198 0 305.5 130
t107.5 369z" />
    <glyph glyph-name="P" unicode="P" horiz-adv-x="1366" 
d="M1296 963q0 -136 -62 -243t-177.5 -165.5t-274.5 -58.5h-350v-496h-295v1409h633q253 0 389.5 -116.5t136.5 -329.5zM999 958q0 222 -262 222h-305v-457h313q122 0 188 60.5t66 174.5z" />
    <glyph glyph-name="Q" unicode="Q" horiz-adv-x="1593" 
d="M1507 711q0 -282 -138.5 -469.5t-385.5 -237.5q34 -99 95.5 -143t172.5 -44q59 0 119 10l-2 -202q-126 -28 -242 -28q-163 0 -270 91t-172 302q-285 27 -442.5 217.5t-157.5 503.5q0 339 188 529t523 190t523.5 -192t188.5 -527zM1206 711q0 228 -108 357.5t-303 129.5
q-198 0 -306 -128.5t-108 -358.5q0 -232 110 -366t302 -134q198 0 305.5 130t107.5 370z" />
    <glyph glyph-name="R" unicode="R" horiz-adv-x="1479" 
d="M1105 0l-327 535h-346v-535h-295v1409h704q252 0 389 -108.5t137 -311.5q0 -148 -84 -255.5t-227 -141.5l381 -592h-332zM1070 977q0 203 -260 203h-378v-416h386q124 0 188 56t64 157z" />
    <glyph glyph-name="S" unicode="S" horiz-adv-x="1366" 
d="M1286 406q0 -207 -153.5 -316.5t-450.5 -109.5q-271 0 -425 96t-198 291l285 47q29 -112 113 -162.5t233 -50.5q309 0 309 188q0 60 -35.5 99t-100 65t-247.5 63q-158 37 -220 59.5t-112 53t-85 73.5t-54.5 101t-19.5 133q0 191 143.5 292.5t417.5 101.5q262 0 393.5 -82
t169.5 -271l-286 -39q-22 91 -89.5 137t-193.5 46q-268 0 -268 -168q0 -55 28.5 -90t84.5 -59.5t227 -61.5q203 -43 290.5 -79.5t138.5 -85t78 -116t27 -155.5z" />
    <glyph glyph-name="T" unicode="T" horiz-adv-x="1251" 
d="M773 1181v-1181h-295v1181h-455v228h1206v-228h-456z" />
    <glyph glyph-name="U" unicode="U" horiz-adv-x="1479" 
d="M723 -20q-291 0 -445.5 142t-154.5 406v881h295v-858q0 -167 79.5 -253.5t233.5 -86.5q158 0 243 90.5t85 259.5v848h295v-866q0 -268 -165.5 -415.5t-465.5 -147.5z" />
    <glyph glyph-name="V" unicode="V" horiz-adv-x="1366" 
d="M834 0h-299l-521 1409h308l290 -905q27 -88 74 -266l21 86l51 180l289 905h305z" />
    <glyph glyph-name="W" unicode="W" horiz-adv-x="1933" 
d="M1567 0h-350l-191 815q-35 144 -59 301q-24 -131 -39 -199.5t-213 -916.5h-350l-363 1409h299l204 -910l46 -220q28 139 54.5 265.5t199.5 864.5h330l178 -750q21 -84 71 -380l25 116l53 230l170 784h299z" />
    <glyph glyph-name="X" unicode="X" horiz-adv-x="1366" 
d="M1038 0l-354 561l-354 -561h-312l488 741l-447 668h312l313 -498l313 498h310l-428 -668l469 -741h-310z" />
    <glyph glyph-name="Y" unicode="Y" horiz-adv-x="1366" 
d="M831 578v-578h-294v578l-502 831h309l338 -596l342 596h309z" />
    <glyph glyph-name="Z" unicode="Z" horiz-adv-x="1251" 
d="M1192 0h-1131v209l762 969h-686v231h1014v-205l-762 -973h803v-231z" />
    <glyph glyph-name="a" unicode="a" 
d="M393 -20q-157 0 -245 85.5t-88 240.5q0 168 109.5 256t317.5 90l233 4v55q0 106 -37 157.5t-121 51.5q-78 0 -114.5 -35.5t-45.5 -117.5l-293 14q27 158 144.5 239.5t320.5 81.5q205 0 316 -101t111 -287v-394q0 -91 20.5 -125.5t68.5 -34.5q32 0 62 6v-152
q-25 -6 -45 -11t-40 -8t-42.5 -5t-52.5 -2q-106 0 -156.5 52t-60.5 153h-6q-118 -213 -356 -213zM720 501l-144 -2q-98 -4 -139 -21.5t-62.5 -53.5t-21.5 -96q0 -77 35.5 -114.5t94.5 -37.5q66 0 120.5 36t85.5 99.5t31 134.5v55z" />
    <glyph glyph-name="b" unicode="b" horiz-adv-x="1251" 
d="M1167 545q0 -268 -107.5 -416.5t-307.5 -148.5q-115 0 -199 50t-129 144h-2q0 -35 -4.5 -96t-9.5 -78h-273q8 93 8 247v1237h281v-414l-4 -176h4q95 208 346 208q192 0 294.5 -145.5t102.5 -411.5zM874 545q0 184 -54 273t-167 89q-114 0 -173.5 -95.5t-59.5 -275.5
q0 -172 58.5 -268t172.5 -96q223 0 223 373z" />
    <glyph glyph-name="c" unicode="c" 
d="M594 -20q-246 0 -380 146.5t-134 408.5q0 268 135 417.5t383 149.5q191 0 316 -96t157 -265l-283 -14q-12 83 -60 132.5t-136 49.5q-217 0 -217 -363q0 -374 221 -374q80 0 134 50.5t67 150.5l282 -13q-15 -111 -79.5 -198t-169.5 -134.5t-236 -47.5z" />
    <glyph glyph-name="d" unicode="d" horiz-adv-x="1251" 
d="M844 0q-4 15 -9.5 75.5t-5.5 100.5h-4q-91 -196 -346 -196q-189 0 -292 147.5t-103 412.5q0 269 108.5 415.5t307.5 146.5q115 0 198.5 -48t128.5 -143h2l-2 178v395h281v-1248q0 -100 8 -236h-272zM831 547q0 175 -58.5 269.5t-172.5 94.5q-113 0 -168 -91.5t-55 -279.5
q0 -368 221 -368q111 0 172 97.5t61 277.5z" />
    <glyph glyph-name="e" unicode="e" 
d="M586 -20q-244 0 -375 144.5t-131 421.5q0 268 133 412t377 144q233 0 356 -154.5t123 -452.5v-8h-694q0 -158 58.5 -238.5t166.5 -80.5q149 0 188 129l265 -23q-115 -294 -467 -294zM586 925q-99 0 -152.5 -69t-56.5 -193h420q-8 131 -63 196.5t-148 65.5z" />
    <glyph glyph-name="f" unicode="f" horiz-adv-x="682" 
d="M473 892v-892h-280v892h-158v190h158v113q0 147 78 218t237 71q79 0 178 -16v-181q-41 9 -82 9q-72 0 -101.5 -28.5t-29.5 -100.5v-85h213v-190h-213z" />
    <glyph glyph-name="g" unicode="g" horiz-adv-x="1251" 
d="M596 -434q-198 0 -318.5 75.5t-148.5 215.5l281 33q15 -65 64.5 -102t129.5 -37q117 0 171 72t54 214v57l2 107h-2q-93 -199 -348 -199q-189 0 -293 142t-104 406q0 265 107 409t311 144q236 0 327 -195h5q0 35 4.5 95t9.5 79h266q-6 -108 -6 -250v-799q0 -231 -131 -349
t-381 -118zM831 556q0 167 -59.5 260.5t-169.5 93.5q-225 0 -225 -360q0 -353 223 -353q112 0 171.5 93.5t59.5 265.5z" />
    <glyph glyph-name="h" unicode="h" horiz-adv-x="1251" 
d="M420 866q57 124 143 180t205 56q172 0 264 -106t92 -310v-686h-280v606q0 285 -193 285q-102 0 -164.5 -87.5t-62.5 -224.5v-579h-281v1484h281v-405q0 -109 -8 -213h4z" />
    <glyph glyph-name="i" unicode="i" horiz-adv-x="569" 
d="M143 1277v207h281v-207h-281zM143 0v1082h281v-1082h-281z" />
    <glyph glyph-name="j" unicode="j" horiz-adv-x="569" 
d="M144 1277v207h281v-207h-281zM138 -425q-100 0 -170 9v198l51 -4q72 0 98.5 31.5t26.5 130.5v1142h281v-1210q0 -143 -72.5 -220t-214.5 -77z" />
    <glyph glyph-name="k" unicode="k" 
d="M834 0l-289 490l-121 -84v-406h-281v1484h281v-850l386 448h302l-380 -422l409 -660h-307z" />
    <glyph glyph-name="l" unicode="l" horiz-adv-x="569" 
d="M143 0v1484h281v-1484h-281z" />
    <glyph glyph-name="m" unicode="m" horiz-adv-x="1821" 
d="M780 0v607q0 285 -164 285q-85 0 -138.5 -87t-53.5 -225v-580h-281v840q0 87 -2.5 142.5t-5.5 99.5h268q3 -19 8 -101.5t5 -113.5h4q52 124 129.5 180t185.5 56q248 0 301 -236h6q55 126 132 181t196 55q158 0 241 -107.5t83 -308.5v-687h-279v607q0 285 -164 285
q-82 0 -134.5 -79.5t-57.5 -219.5v-593h-279z" />
    <glyph glyph-name="n" unicode="n" horiz-adv-x="1251" 
d="M844 0v607q0 285 -193 285q-102 0 -164.5 -87.5t-62.5 -224.5v-580h-281v840q0 87 -2.5 142.5t-5.5 99.5h268q3 -19 8 -101.5t5 -113.5h4q57 124 143 180t205 56q172 0 264 -106t92 -310v-687h-280z" />
    <glyph glyph-name="o" unicode="o" horiz-adv-x="1251" 
d="M1171 542q0 -263 -146 -412.5t-404 -149.5q-253 0 -397 150t-144 412q0 261 144 410.5t403 149.5q265 0 404.5 -144.5t139.5 -415.5zM877 542q0 193 -63 280t-183 87q-256 0 -256 -367q0 -181 62.5 -275.5t180.5 -94.5q259 0 259 370z" />
    <glyph glyph-name="p" unicode="p" horiz-adv-x="1251" 
d="M1167 546q0 -271 -108.5 -418.5t-306.5 -147.5q-114 0 -198.5 49.5t-129.5 142.5h-6q6 -30 6 -182v-415h-281v1258q0 153 -8 249h273q5 -18 8.5 -71t3.5 -105h4q95 199 346 199q189 0 293 -145.5t104 -413.5zM874 546q0 364 -223 364q-112 0 -171.5 -98t-59.5 -274
q0 -175 59.5 -270.5t169.5 -95.5q225 0 225 374z" />
    <glyph glyph-name="q" unicode="q" horiz-adv-x="1251" 
d="M84 540q0 268 109.5 415.5t308.5 147.5q236 0 327 -195q0 46 5.5 102.5t9.5 71.5h270q-6 -108 -6 -249v-1258h-279v450l5 155h-2q-93 -200 -353 -200q-189 0 -292 147.5t-103 412.5zM831 546q0 173 -58 268.5t-171 95.5q-225 0 -225 -370q0 -368 223 -368
q110 0 170.5 97.5t60.5 276.5z" />
    <glyph glyph-name="r" unicode="r" horiz-adv-x="797" 
d="M143 0v828q0 89 -2.5 148.5t-5.5 105.5h268q3 -18 8 -109.5t5 -121.5h4q41 114 73 160.5t76 69t110 22.5q54 0 87 -15v-235q-68 15 -120 15q-105 0 -163.5 -85t-58.5 -252v-531h-281z" />
    <glyph glyph-name="s" unicode="s" 
d="M1055 316q0 -157 -128.5 -246.5t-355.5 -89.5q-223 0 -341.5 70.5t-157.5 219.5l247 37q21 -77 72.5 -109t179.5 -32q118 0 172 30t54 94q0 52 -43.5 82.5t-147.5 51.5q-238 47 -321 87.5t-126.5 105t-43.5 158.5q0 155 119.5 241.5t338.5 86.5q193 0 310.5 -75
t146.5 -217l-249 -26q-12 66 -59 98.5t-149 32.5q-100 0 -150 -25.5t-50 -85.5q0 -47 38.5 -74.5t129.5 -45.5q127 -26 225.5 -53.5t158 -65.5t95 -97.5t35.5 -152.5z" />
    <glyph glyph-name="t" unicode="t" horiz-adv-x="682" 
d="M420 -18q-124 0 -191 67.5t-67 204.5v638h-137v190h151l88 254h176v-254h205v-190h-205v-562q0 -79 30 -116.5t93 -37.5q33 0 94 14v-174q-104 -34 -237 -34z" />
    <glyph glyph-name="u" unicode="u" horiz-adv-x="1251" 
d="M408 1082v-607q0 -285 192 -285q102 0 164.5 87.5t62.5 224.5v580h281v-840q0 -138 8 -242h-268q-12 144 -12 215h-5q-56 -123 -142.5 -179t-205.5 -56q-172 0 -264 105.5t-92 309.5v687h281z" />
    <glyph glyph-name="v" unicode="v" 
d="M731 0h-336l-387 1082h297l189 -605q15 -50 71 -250q10 41 41 144t230 711h294z" />
    <glyph glyph-name="w" unicode="w" horiz-adv-x="1593" 
d="M1313 0h-297l-172 660q-12 45 -47 222l-52 -224l-174 -658h-297l-280 1082h264l178 -827l14 74l25 117l170 636h301l166 -636q14 -52 41 -191l28 132l156 695h260z" />
    <glyph glyph-name="x" unicode="x" 
d="M819 0l-252 392l-254 -392h-299l396 559l-377 523h303l231 -354l230 354h305l-377 -520l399 -562h-305z" />
    <glyph glyph-name="y" unicode="y" 
d="M283 -425q-101 0 -177 13v200q53 -8 97 -8q60 0 99.5 19t71 63t70.5 149l-428 1071h297l170 -507q40 -109 101 -334l25 95l65 235l160 511h294l-428 -1139q-86 -208 -178.5 -288t-238.5 -80z" />
    <glyph glyph-name="z" unicode="z" horiz-adv-x="1024" 
d="M82 0v199l509 680h-468v203h778v-201l-506 -676h555v-205h-868z" />
    <hkern g1="space" u2="Y" k="37" />
    <hkern g1="space" u2="A" k="76" />
    <hkern u1="&#x31;" u2="&#x31;" k="113" />
    <hkern u1="A" u2="y" k="76" />
    <hkern u1="A" u2="w" k="37" />
    <hkern u1="A" u2="v" k="76" />
    <hkern u1="A" u2="Y" k="188" />
    <hkern u1="A" u2="W" k="113" />
    <hkern u1="A" u2="V" k="152" />
    <hkern u1="A" u2="T" k="152" />
    <hkern u1="A" g2="space" k="76" />
    <hkern u1="F" u2="A" k="113" />
    <hkern u1="L" u2="y" k="76" />
    <hkern u1="L" u2="Y" k="188" />
    <hkern u1="L" u2="W" k="113" />
    <hkern u1="L" u2="V" k="152" />
    <hkern u1="L" u2="T" k="152" />
    <hkern u1="L" g2="space" k="37" />
    <hkern u1="P" u2="A" k="152" />
    <hkern u1="P" g2="space" k="37" />
    <hkern u1="R" u2="Y" k="76" />
    <hkern u1="R" u2="W" k="37" />
    <hkern u1="R" u2="V" k="37" />
    <hkern u1="T" u2="y" k="152" />
    <hkern u1="T" u2="w" k="152" />
    <hkern u1="T" u2="u" k="152" />
    <hkern u1="T" u2="s" k="152" />
    <hkern u1="T" u2="r" k="113" />
    <hkern u1="T" u2="o" k="152" />
    <hkern u1="T" u2="i" k="37" />
    <hkern u1="T" u2="e" k="152" />
    <hkern u1="T" u2="c" k="152" />
    <hkern u1="T" u2="a" k="152" />
    <hkern u1="T" u2="O" k="37" />
    <hkern u1="T" u2="A" k="152" />
    <hkern u1="V" u2="y" k="76" />
    <hkern u1="V" u2="u" k="76" />
    <hkern u1="V" u2="r" k="113" />
    <hkern u1="V" u2="o" k="152" />
    <hkern u1="V" u2="i" k="37" />
    <hkern u1="V" u2="e" k="113" />
    <hkern u1="V" u2="a" k="113" />
    <hkern u1="V" u2="A" k="152" />
    <hkern u1="W" u2="y" k="37" />
    <hkern u1="W" u2="u" k="37" />
    <hkern u1="W" u2="r" k="37" />
    <hkern u1="W" u2="o" k="37" />
    <hkern u1="W" u2="i" k="18" />
    <hkern u1="W" u2="e" k="37" />
    <hkern u1="W" u2="a" k="76" />
    <hkern u1="W" u2="A" k="113" />
    <hkern u1="Y" u2="v" k="113" />
    <hkern u1="Y" u2="u" k="113" />
    <hkern u1="Y" u2="q" k="152" />
    <hkern u1="Y" u2="p" k="113" />
    <hkern u1="Y" u2="o" k="152" />
    <hkern u1="Y" u2="i" k="76" />
    <hkern u1="Y" u2="e" k="113" />
    <hkern u1="Y" u2="a" k="113" />
    <hkern u1="Y" u2="A" k="188" />
    <hkern u1="Y" g2="space" k="37" />
  </font>
</defs></svg>
