[ {
  "uid" : "918b298540cc1e42",
  "name" : "local_mobile MOBILE test1()",
  "time" : {
    "start" : 1637787351611,
    "stop" : 1637787351640,
    "duration" : 29
  },
  "status" : "passed",
  "severity" : "normal"
}, {
  "uid" : "1ae107bf8ad3856e",
  "name" : "local_desktop DESKTOP test1()",
  "time" : {
    "start" : 1637787197761,
    "stop" : 1637787197797,
    "duration" : 36
  },
  "status" : "passed",
  "severity" : "normal"
} ]