"Status","Start Time","Stop Time","Duration in ms","Parent Suite","Suite","Sub Suite","Test Class","Test Method","Name","Description"
"passed","Wed Nov 24 22:55:51 EET 2021","Wed Nov 24 22:55:51 EET 2021","29","","guru.qa.tests.SelenideTest","","guru.qa.tests.SelenideTest","test1","local_mobile MOBILE test1()",""
"passed","Wed Nov 24 22:53:17 EET 2021","Wed Nov 24 22:53:17 EET 2021","36","","guru.qa.tests.SelenideTest","","guru.qa.tests.SelenideTest","test1","local_desktop DESKTOP test1()",""
