MT5Real2,43000028,USD,0.9
MT5Real3,44000026,USD,0.56
MT5Real3,44000133,VND,3484.5
MT5Real2,43000059,USD,8.29
MT5Real2,43000093,USD,213.09
MT5Real2,43000122,USD,1298.57
MT5Real2,43000140,USD,2.55
MT5Real2,43000190,USD,113.28
MT5Real2,43001135,USD,608.5
MT5Real2,43001136,USD,1409.54
MT5Real3,44000627,USD,48.38
MT5Real2,43000195,USD,14.43
MT5Real2,43000209,USD,491.5
MT5Real2,43000225,USD,97.55
MT5Real2,43000233,USD,374.4
MT5Real2,43000237,USD,2.26
MT5Real2,43000258,USD,50.11
MT5Real2,43000263,USD,54.73
MT5Real2,43000266,USD,5.73
MT5Real2,43000299,USD,69.2
MT5Real2,43001975,USD,28.0
MT5Real2,43000315,USD,45.54
MT5Real2,43000407,USD,37.42
MT5Real2,43000416,USD,286.06
MT5Real2,43002624,USD,138.22
MT5Real3,44001936,USD,0.08
MT5Real2,43000469,USD,4.24
MT5Real2,43000474,USD,16.0
MT5Real2,43000494,ZAR,426.33
MT5Real2,43000508,USD,32.86
MT5Real2,43002555,USD,8.92
MT5Real2,43000556,USD,128.41
MT5Real2,43000600,USD,11.56
MT5Real2,43000605,USD,0.46
MT5Real2,43000606,USD,3.13
MT5Real2,43000614,USD,266.74
MT5Real2,43000617,USD,1.4
Real3,888454,USD,25.13
MT5Real2,43000630,USD,1.51
MT5Real2,43000661,USD,28.4
MT5Real2,43000682,USD,606.04
MT5Real2,43000684,USD,1.68
MT5Real2,43001768,USD,1497.24
Real3,892414,USD,15.57
MT5Real2,43000699,USD,8.68
MT5Real2,43000707,USD,230.66
MT5Real2,43000708,USD,7396.89
MT5Real2,43000711,USD,4.24
MT5Real2,43000753,USD,65.22
MT5Real2,43000761,USD,1.28
MT5Real2,43002423,USD,3.54
MT5Real2,43000801,VND,13009.0
MT5Real2,43000824,USD,8.93
MT5Real2,43000825,USD,2.35
MT5Real2,43000827,USD,33.99
MT5Real2,43000843,USD,849.0
MT5Real2,43002101,USD,272.0
MT5Real2,43000886,USD,31.11
MT5Real2,43000889,USD,12.48
MT5Real2,43000893,USD,9.08
MT5Real2,43000927,USD,52.37
MT5Real2,43000934,USD,19.23
MT5Real2,43000939,USD,283.19
MT5Real2,43000956,USD,1055.08
MT5Real2,43000960,USD,270.27
MT5Real2,43000967,USD,1.56
MT5Real2,43000974,USD,1.3
MT5Real2,43001028,USD,79.16
MT5Real2,43001033,USD,5.36
MT5Real2,43001040,USD,0.32
Real3,890680,USD,19.93
Real3,890820,USD,40.62
Real3,892262,USD,19.72
Real3,892263,USD,17.16
MT5Real2,43001042,USD,5.49
MT5Real2,43001188,USD,25.64
MT5Real2,43001059,USD,12.35
MT5Real2,43001089,USD,0.42
MT5Real2,43001095,USD,44.28
MT5Real2,43001102,USD,80.67
MT5Real2,43002726,USD,35.65
MT5Real3,44000956,USD,48.69
Real3,892524,USD,12.64
MT5Real2,43001118,USD,11.2
MT5Real2,43001156,USD,1.6
MT5Real2,43001160,USD,18.49
MT5Real2,43001194,USD,4.48
MT5Real2,43001200,USD,1.3
MT5Real2,43001223,USD,49.67
MT5Real2,43001224,USD,315.26
MT5Real2,43001245,USD,13.92
MT5Real2,43001272,USD,7.92
MT5Real3,44001675,USD,0.39
MT5Real2,43001283,USD,30.05
MT5Real3,44001111,USD,59.26
MT5Real2,43001293,USD,0.22
MT5Real2,43001294,USD,9.05
MT5Real2,43001316,USD,1292.33
MT5Real2,43001318,USD,21.03
MT5Real2,43001319,USD,168.94
MT5Real2,43001379,USD,5.12
MT5Real2,43001383,USD,2.56
MT5Real2,43001407,VND,16611.0
MT5Real2,43001478,USD,50.66
MT5Real2,43001487,THB,3239.7
MT5Real2,43001488,USD,92.21
MT5Real2,43001497,USD,137.45
MT5Real2,43001506,USD,15.55
MT5Real2,43001508,USD,16.06
MT5Real2,43001642,USD,14.66
MT5Real2,43001513,USD,7.57
MT5Real2,43001518,USD,143.95
MT5Real2,43001537,USD,490.89
MT5Real2,43001544,USD,273.0
MT5Real2,43001573,USD,386.34
MT5Real2,43001591,USD,58.29
Real3,891861,USD,224.55
MT5Real2,43001592,USD,127.0
MT5Real2,43001609,USD,21.56
MT5Real2,43001613,USD,13.41
MT5Real2,43001615,USD,5.74
MT5Real2,43001627,USD,2177.08
MT5Real2,43001659,USD,443.95
MT5Real2,43001694,VND,14879150.0
MT5Real2,43001697,USD,62.2
MT5Real2,43001700,USD,0.22
MT5Real2,43001706,USD,46.8
MT5Real2,43001720,USD,4.03
Real3,892793,USD,0.28
MT5Real2,43001737,USD,4.1
MT5Real2,43001738,USD,39.4
MT5Real2,43002538,USD,21.07
MT5Real2,43001746,USD,6.77
MT5Real2,43001761,USD,2.45
MT5Real2,43002656,USD,15.96
MT5Real2,43001762,USD,11.04
MT5Real2,43001766,USD,58.45
MT5Real2,43001767,USD,0.07
MT5Real2,43001781,USD,710.5
MT5Real2,43002773,USD,11.1
MT5Real2,43001788,USD,922.35
MT5Real2,43001831,USD,32.77
MT5Real2,43001853,USD,909.6
MT5Real2,43001857,USD,14.2
MT5Real2,43001859,USD,142.33
MT5Real2,43001862,USD,15.7
Real3,888915,USD,62.82
MT5Real2,43001868,USD,2.75
MT5Real2,43001875,USD,31.06
MT5Real2,43002899,USD,1.06
MT5Real2,43001907,USD,4.36
MT5Real2,43001912,USD,5.54
MT5Real2,43001921,USD,0.88
MT5Real2,43001943,USD,54.5
MT5Real2,43001948,USD,12.32
MT5Real2,43001950,USD,71.76
MT5Real2,43001953,USD,11.26
MT5Real2,43001962,USD,23.92
MT5Real2,43001963,USD,303.1
MT5Real2,43001967,USD,40.67
MT5Real2,43001972,USD,112.0
MT5Real2,43002024,USD,208.4
MT5Real2,43002537,USD,3832.16
MT5Real2,43002628,USD,396.88
MT5Real2,43002650,USD,2018.71
MT5Real2,43002987,USD,73.9
MT5Real3,44001998,USD,181.52
MT5Real2,43001999,USD,19.17
MT5Real2,43002029,USD,72.4
MT5Real2,43002040,USD,64.45
MT5Real2,43002047,USD,46.04
MT5Real2,43002052,USD,899.27
MT5Real2,43002053,USD,1.39
MT5Real2,43002074,USD,22.26
MT5Real2,43002075,USD,20.64
MT5Real2,43002077,USD,195.11
MT5Real2,43002085,USD,1725.95
MT5Real2,43002092,USD,239.36
MT5Real2,43002094,USD,35.12
MT5Real2,43002327,USD,202.65
MT5Real2,43002107,USD,13.48
MT5Real2,43002108,USD,1.33
MT5Real2,43002109,USD,582.57
MT5Real2,43002125,USD,97.67
MT5Real2,43002129,USD,45.6
MT5Real2,43002135,USD,11.2
MT5Real3,44002185,USD,71.19
Real9,19003893,USD,28.07
MT5Real2,43002136,USD,38.59
MT5Real2,43002157,USD,30.58
MT5Real2,43002164,THB,1429.99
MT5Real2,43002183,USD,417.15
MT5Real2,43002192,USD,5.75
MT5Real2,43002210,USD,6.25
MT5Real2,43002214,USD,7.78
MT5Real2,43002218,USD,11.0
MT5Real2,43002654,USD,50.9
MT5Real2,43002232,USD,8.88
MT5Real2,43002246,USD,42.7
MT5Real2,43002255,USD,1433.67
Real9,19003836,USD,54.95
MT5Real2,43002262,USD,7.32
MT5Real2,43002278,USD,8.84
MT5Real2,43002282,USD,4.72
MT5Real3,44001975,USD,3.92
MT5Real2,43002293,USD,563.41
MT5Real2,43002314,USD,66.26
MT5Real2,43002325,USD,314.4
MT5Real2,43002326,USD,23.94
MT5Real2,43002328,USD,45.11
MT5Real2,43002330,USD,15.31
MT5Real2,43002336,USD,34.89
Real3,891948,USD,7.84
MT5Real2,43002342,USD,287.23
MT5Real2,43002540,USD,526.65
MT5Real2,43002346,USD,17.6
MT5Real2,43002349,USD,333.6
MT5Real2,43002352,USD,3.07
Real3,892138,USD,43.99
MT5Real2,43002353,USD,20.03
MT5Real2,43002355,USD,4.16
MT5Real3,44002054,USD,196.06
MT5Real2,43002367,USD,310.33
MT5Real2,43002373,USD,396.34
MT5Real2,43002378,USD,19.16
MT5Real2,43002380,USD,40.12
MT5Real2,43002383,USD,79.53
MT5Real2,43002386,USD,197.73
MT5Real2,43002388,USD,52.47
MT5Real2,43002401,USD,10.24
MT5Real2,43002422,USD,23.46
MT5Real2,43002426,USD,339.05
MT5Real2,43002428,USD,371.2
MT5Real2,43002441,USD,16.0
MT5Real2,43002446,USD,23.58
MT5Real2,43002464,USD,12.75
MT5Real2,43002470,USD,3924.9
MT5Real2,43002486,USD,10.36
MT5Real2,43002515,USD,11.21
MT5Real2,43002517,USD,17.25
MT5Real2,43002519,USD,3.92
MT5Real3,44002312,USD,22.93
MT5Real2,43002525,USD,0.76
MT5Real2,43002530,USD,170.28
MT5Real2,43002546,BRL,448.72
MT5Real2,43002552,USD,28.45
MT5Real2,43002568,USD,742.41
MT5Real2,43002574,USD,176.15
MT5Real2,43002587,USD,0.16
MT5Real2,43002592,USD,0.16
MT5Real3,44002191,USD,0.08
MT5Real2,43002588,USD,162.91
MT5Real2,43002594,USD,0.65
MT5Real2,43002598,USD,13.27
MT5Real2,43002604,VND,473931.0
MT5Real2,43002658,USD,16.1
MT5Real2,43002840,VND,2243739.0
MT5Real2,43002921,VND,3037807.0
MT5Real2,43003013,VND,260198.0
MT5Real2,43002625,USD,66.02
Real3,892205,USD,9.53
MT5Real2,43002627,USD,105.47
MT5Real3,44002208,USD,15.54
MT5Real2,43002633,USD,47.2
MT5Real2,43002637,USD,1416.26
MT5Real2,43002671,USD,50.93
MT5Real2,43002672,USD,640.45
MT5Real2,43002689,USD,1928.63
MT5Real2,43002691,USD,43.06
MT5Real2,43002697,USD,63.31
MT5Real2,43002701,USD,1522.46
Real3,892664,USD,0.72
Real3,892739,USD,37.16
Real3,892858,USD,521.5
MT5Real2,43002713,USD,15.68
MT5Real2,43002719,USD,29.5
MT5Real3,44002602,USD,44.2
MT5Real2,43002720,USD,31.01
MT5Real2,43002751,USD,520.16
MT5Real2,43002754,GHS,3884.25
MT5Real2,43002758,USD,3.72
Real9,19003310,USD,3.99
MT5Real2,43002768,USD,12.17
MT5Real2,43002769,USD,14.14
MT5Real2,43002775,USD,12.38
MT5Real2,43002779,USD,5.69
MT5Real2,43002781,USD,208.56
MT5Real2,43002787,USD,3.55
MT5Real2,43002791,USD,36.24
MT5Real2,43002792,USD,1283.17
MT5Real2,43002800,USD,591.4
MT5Real2,43002893,USD,123.5
MT5Real2,43002812,USD,1046.6
MT5Real2,43002816,USD,126.38
MT5Real2,43002848,USD,24.52
MT5Real2,43002851,USD,20.46
MT5Real2,43002854,VND,11476580.0
MT5Real2,43002856,USD,46.63
MT5Real3,44002337,USD,2.46
MT5Real2,43002857,USD,115.12
MT5Real2,43002866,USD,0.08
MT5Real2,43002871,USD,0.08
MT5Real3,44002430,USD,0.08
MT5Real2,43002891,USD,9.92
MT5Real2,43002894,USD,4.88
Real3,892547,USD,22.56
MT5Real2,43002905,USD,0.42
MT5Real2,43002910,USD,0.86
MT5Real2,43002906,USD,9.61
MT5Real2,43002908,USD,3.2
MT5Real3,44001982,USD,5.51
Real3,887504,USD,9.57
Real9,19001131,USD,27.18
MT5Real2,43002913,USD,60.0
MT5Real2,43002918,USD,3.2
MT5Real3,44002360,USD,0.08
MT5Real2,43002926,USD,46.21
MT5Real3,44002474,USD,0.36
MT5Real2,43002934,USD,256.0
MT5Real2,43002935,USD,4.24
MT5Real2,43002966,USD,5.93
MT5Real2,43002971,VND,315958.0
MT5Real2,43002976,USD,53.45
Real3,892703,USD,34.11
MT5Real2,43002982,USD,133.44
Real3,892658,USD,0.08
MT5Real2,43002989,USD,64.64
MT5Real2,43002998,USD,10.47
MT5Real3,44000917,USD,69.4
MT5Real3,44002596,USD,36.93
MT5Real2,43003012,USD,3.87
MT5Real2,43003018,USD,503.18
MT5Real2,43003032,USD,20.3
MT5Real2,43003035,USD,9.25
MT5Real2,43003040,USD,37.49
MT5Real2,43003044,USD,97.8
Real3,892215,USD,21.9
MT5Real2,43003045,USD,225.34
MT5Real2,43003077,USD,0.96
MT5Real2,43003081,USD,3.74
MT5Real2,43003095,USD,0.14
MT5Real2,43003097,USD,7.7
MT5Real2,43003106,USD,4.44
MT5Real2,43003113,USD,5.3
MT5Real3,44002262,USD,5.63
MT5Real3,44002318,USD,53.38
MT5Real2,43003116,USD,0.45
MT5Real3,44002655,USD,0.35
MT5Real3,44000035,USD,0.15
MT5Real3,44000069,USD,7.07
MT5Real3,44000084,USD,2.14
MT5Real3,44001712,USD,17.36
MT5Real3,44000091,USD,2.86
MT5Real3,44000098,USD,1072.43
MT5Real3,44000101,USD,33.66
MT5Real3,44000107,USD,0.52
MT5Real3,44000116,USD,2.51
MT5Real3,44000132,USD,66.16
MT5Real3,44000145,USD,0.08
MT5Real3,44000164,USD,32.59
MT5Real3,44000168,USD,3.5
MT5Real3,44000171,USD,6.8
MT5Real3,44000185,USD,28.99
Real3,891747,USD,120.64
MT5Real3,44000197,USD,3.92
Real9,19001998,USD,4.72
MT5Real3,44000202,USD,7.99
MT5Real3,44000241,USD,291.13
MT5Real3,44000248,USD,0.21
MT5Real3,44000256,USD,175.24
MT5Real3,44001098,USD,21.11
MT5Real3,44001108,USD,127.05
Real9,19001962,USD,203.81
Real9,19001963,USD,108.91
MT5Real3,44000271,USD,136.42
MT5Real3,44000273,USD,574.84
MT5Real3,44002131,USD,23.8
MT5Real3,44000284,USD,15.54
MT5Real3,44000287,USD,9.76
MT5Real3,44000299,USD,164.64
MT5Real3,44000374,USD,23.71
Real9,19000760,USD,5.12
Real9,19001412,USD,8.18
MT5Real3,44000375,USD,3.88
MT5Real3,44000387,USD,8.75
MT5Real3,44000399,THB,7439.58
MT5Real3,44000400,USD,2.19
MT5Real3,44000407,USD,5.03
MT5Real3,44000484,USD,26.33
MT5Real3,44000511,USD,106.75
MT5Real3,44000524,USD,1.79
MT5Real3,44000548,USD,165.91
MT5Real3,44000551,USD,16.63
MT5Real3,44000568,USD,15.26
MT5Real3,44000574,USD,3.18
MT5Real3,44000621,USD,167.23
MT5Real3,44000623,USD,4.27
Real9,19002502,USD,1.9
MT5Real3,44000639,USD,0.04
MT5Real3,44000671,USD,356.75
MT5Real3,44000673,USD,2.59
MT5Real3,44000680,USD,0.49
MT5Real3,44000682,USD,184.09
MT5Real3,44000694,USD,321.76
MT5Real3,44000697,USD,143.16
MT5Real3,44000699,USD,0.38
MT5Real3,44000711,THB,319.85
Real3,885068,THB,192.73
MT5Real3,44000737,USD,0.22
MT5Real3,44000766,USD,20.64
MT5Real3,44000773,USD,12.81
MT5Real3,44000796,USD,1235.19
MT5Real3,44002442,USD,7.35
MT5Real3,44000798,USD,43.05
MT5Real3,44000837,USD,7.14
MT5Real3,44000914,THB,678.15
MT5Real3,44000840,USD,141.05
MT5Real3,44000846,USD,90.33
MT5Real3,44000850,USD,137.83
MT5Real3,44000854,USD,0.28
Real9,19001738,USD,0.22
MT5Real3,44000902,USD,29.09
MT5Real3,44000921,USD,0.91
MT5Real3,44000925,USD,232.64
MT5Real3,44000936,USD,12.43
MT5Real3,44000945,USD,109.55
MT5Real3,44000986,USD,101.86
MT5Real3,44001019,USD,30.31
MT5Real3,44001040,USD,347.89
MT5Real3,44001046,USD,56.84
MT5Real3,44001063,USD,19.07
MT5Real3,44001095,USD,930.9
MT5Real3,44001120,VND,67476.5
MT5Real3,44001129,USD,5.85
MT5Real3,44001141,USD,1841.0
MT5Real3,44001143,USD,64.68
Real9,19004094,USD,2.64
MT5Real3,44001163,USD,433.33
MT5Real3,44001185,THB,11.26
MT5Real3,44001211,USD,285.98
MT5Real3,44001254,USD,0.04
MT5Real3,44001273,USD,13.34
MT5Real3,44001313,USD,30.1
MT5Real3,44001319,USD,3.28
MT5Real3,44001322,VND,918802.5
MT5Real3,44001474,VND,574048.5
MT5Real3,44001475,VND,159363.0
MT5Real3,44001324,VND,622838.0
MT5Real3,44001359,VND,269949.0
MT5Real3,44001934,VND,611448.0
MT5Real3,44001349,USD,19.64
MT5Real3,44001353,USD,1.33
MT5Real3,44001878,USD,3.85
MT5Real3,44001364,USD,45.86
MT5Real3,44001370,USD,89.95
MT5Real3,44001371,USD,14.39
MT5Real3,44001384,USD,9.8
Real9,19001909,USD,87.6
MT5Real3,44001414,USD,212.51
MT5Real3,44001440,USD,20.2
MT5Real3,44002150,USD,1.08
MT5Real3,44001446,USD,84.66
MT5Real3,44001449,USD,3.5
MT5Real3,44001481,USD,0.55
MT5Real3,44001496,USD,5.67
MT5Real3,44001498,USD,5.46
MT5Real3,44001501,USD,27.27
MT5Real3,44001504,USD,379.75
MT5Real3,44001511,USD,2.42
MT5Real3,44001512,USD,0.42
MT5Real3,44001561,USD,3.01
MT5Real3,44001571,USD,28.67
MT5Real3,44001572,USD,13.09
MT5Real3,44001576,USD,10.5
MT5Real3,44001578,USD,940.14
MT5Real3,44001595,USD,38.79
MT5Real3,44001601,THB,3.4
MT5Real3,44001615,USD,0.21
MT5Real3,44001619,USD,28.32
MT5Real3,44001620,USD,62.65
MT5Real3,44002464,USD,57.4
MT5Real3,44001647,USD,10.57
MT5Real3,44001669,USD,2.81
MT5Real3,44001691,USD,2.49
Real9,19003087,USD,11.2
MT5Real3,44001651,USD,5.15
MT5Real3,44001658,USD,3.25
MT5Real3,44001661,USD,155.01
MT5Real3,44001681,USD,18.83
MT5Real3,44001682,GBP,7.74
MT5Real3,44001683,USD,7.07
MT5Real3,44001714,USD,422.88
MT5Real3,44001717,USD,262.15
MT5Real3,44001723,THB,33.25
MT5Real3,44001735,USD,11.06
MT5Real3,44001744,USD,427.0
MT5Real3,44001760,USD,190.57
MT5Real3,44001769,VND,4631268.5
MT5Real3,44001771,USD,5.0
MT5Real3,44001774,USD,5.48
MT5Real3,44001779,USD,10.0
MT5Real3,44001790,USD,4.24
MT5Real3,44001917,USD,0.18
MT5Real3,44001797,USD,10.5
MT5Real3,44001805,USD,53.03
MT5Real3,44001818,KWD,832.25
MT5Real3,44001821,ZAR,8.14
MT5Real3,44001828,USD,8.97
MT5Real3,44002306,USD,3.33
MT5Real3,44001835,USD,18.48
MT5Real3,44002605,USD,0.63
MT5Real3,44001890,USD,100.35
MT5Real3,44001892,USD,58.73
MT5Real3,44001897,USD,51.09
MT5Real3,44002201,USD,113.21
MT5Real3,44001899,THB,42928.26
Real9,19002833,THB,16725.96
MT5Real3,44001908,AUD,2738.86
MT5Real3,44001918,USD,17.19
MT5Real3,44001920,AUD,181.11
MT5Real3,44001945,VND,48790.0
MT5Real3,44001962,USD,220.32
MT5Real3,44001973,USD,1.2
MT5Real3,44001977,USD,7.14
MT5Real3,44002000,GBP,12.7
MT5Real3,44002026,USD,10.1
MT5Real3,44002045,USD,0.32
Real9,19001067,USD,7.14
MT5Real3,44002048,USD,2.24
MT5Real3,44002055,THB,2968.25
MT5Real3,44002056,USD,35.39
MT5Real3,44002058,USD,1.25
MT5Real3,44002068,USD,10.76
MT5Real3,44002078,USD,32.42
MT5Real3,44002080,IDR,6068.76
MT5Real3,44002223,IDR,26451.54
MT5Real3,44002089,USD,13.2
MT5Real3,44002199,USD,23.06
Real9,19003428,USD,43.89
MT5Real3,44002091,USD,14.81
MT5Real3,44002116,USD,45.19
MT5Real3,44002132,USD,15.54
MT5Real3,44002141,USD,88.23
MT5Real3,44002147,USD,7.85
MT5Real3,44002155,USD,294.17
MT5Real3,44002168,USD,39.3
MT5Real3,44002169,USD,1018.58
Real9,19002978,USD,17.56
MT5Real3,44002170,USD,53.98
MT5Real3,44002171,USD,25.56
Real9,19003740,USD,9.38
MT5Real3,44002177,USD,0.56
MT5Real3,44002184,USD,6.97
MT5Real3,44002423,USD,173.01
MT5Real3,44002192,USD,7.36
MT5Real3,44002204,USD,31.64
MT5Real3,44002209,VND,37402.5
MT5Real3,44002214,USD,3.5
MT5Real3,44002221,USD,495.95
MT5Real3,44002231,USD,84.39
MT5Real3,44002239,USD,28.36
MT5Real3,44002252,IDR,528148.48
Real3,891773,USD,34.13
Real3,892617,IDR,288107.69
MT5Real3,44002258,USD,1.75
MT5Real3,44002263,USD,1.64
MT5Real3,44002268,VND,105690.0
MT5Real3,44002272,USD,0.14
MT5Real3,44002276,USD,242.75
MT5Real3,44002280,USD,29.78
MT5Real3,44002283,USD,420.81
MT5Real3,44002296,USD,4.4
MT5Real3,44002314,USD,22.68
MT5Real3,44002324,USD,17.32
MT5Real3,44002335,USD,2.46
MT5Real3,44002345,USD,0.07
MT5Real3,44002348,USD,0.28
MT5Real3,44002365,USD,1.26
MT5Real3,44002366,USD,11.45
MT5Real3,44002367,USD,99.8
MT5Real3,44002372,USD,29.4
MT5Real3,44002376,USD,11.62
MT5Real3,44002377,USD,33.56
MT5Real3,44002381,USD,12.64
MT5Real3,44002385,USD,6.65
MT5Real3,44002386,USD,26.88
MT5Real3,44002388,USD,9.31
MT5Real3,44002397,USD,646.46
MT5Real3,44002417,USD,119.28
MT5Real3,44002400,USD,3.85
Real3,892609,USD,53.34
MT5Real3,44002410,USD,10.19
MT5Real3,44002411,USD,10.11
MT5Real3,44002416,USD,8.58
MT5Real3,44002449,USD,1.89
MT5Real3,44002453,USD,0.42
MT5Real3,44002456,USD,11.1
MT5Real3,44002457,USD,114.52
MT5Real3,44002458,USD,2.42
MT5Real3,44002460,USD,5.88
MT5Real3,44002462,USD,3.29
MT5Real3,44002483,VND,78863.5
MT5Real3,44002487,USD,8.75
MT5Real3,44002493,USD,77.0
MT5Real3,44002502,USD,2.92
MT5Real3,44002503,USD,13.23
MT5Real3,44002551,USD,5.29
MT5Real3,44002554,USD,0.08
MT5Real3,44002562,USD,10.5
MT5Real3,44002575,USD,4.07
MT5Real3,44002584,USD,12.32
MT5Real3,44002585,USD,0.56
MT5Real3,44002604,USD,55.37
MT5Real3,44002616,USD,43.75
MT5Real3,44002625,USD,0.56
Real9,19004019,USD,9.56
MT5Real3,44002627,USD,0.35
MT5Real3,44002641,USD,20.64
MT5Real3,44002654,USD,0.6
MT5Real3,44002657,USD,0.21
Real3,885047,USD,164.85
Real3,885052,USD,20.24
Real3,885096,USD,92.53
Real3,885814,USD,32.66
Real3,885890,USD,5.76
Real3,885892,USD,62.09
Real3,885893,USD,404.89
Real3,885894,USD,63.57
Real3,885895,USD,920.87
Real9,19000133,USD,48.26
Real3,885103,USD,4.78
Real3,885104,USD,202.88
Real3,885105,USD,3.14
Real9,19000144,USD,0.1
Real3,885111,USD,42.24
Real3,885127,USD,1.05
Real3,885192,USD,63.4
Real3,887949,USD,84.33
Real3,885199,USD,0.64
Real3,885228,USD,146.11
Real9,19000396,USD,145.04
Real3,885258,USD,5.61
Real3,885272,USD,105.79
Real3,885280,USD,18.0
Real3,889626,USD,411.76
Real9,19000541,USD,448.7
Real3,885314,USD,3.95
Real3,885325,USD,21.36
Real3,885327,USD,166.6
Real3,885360,USD,0.22
Real3,885366,IDR,540752.31
Real3,885402,USD,88.35
Real3,885406,USD,3.22
Real3,885407,USD,113.82
Real3,885414,USD,0.08
Real3,885415,USD,41.53
Real3,885430,USD,0.18
Real3,885433,USD,2.88
Real3,885434,USD,0.18
Real9,19000287,USD,0.49
Real9,19000289,USD,0.36
Real3,885487,USD,0.05
Real3,885488,USD,57.6
Real3,885502,USD,41.8
Real3,885503,USD,1.6
Real3,885526,USD,4.0
Real3,885509,USD,30.56
Real3,887013,USD,64.61
Real3,885515,USD,2.4
Real3,890331,USD,34.08
Real3,885533,USD,130.25
Real3,885544,USD,314.57
Real3,885548,USD,269.17
Real3,885556,USD,4.72
Real3,885557,USD,34.86
Real3,885574,USD,226.0
Real3,890850,USD,42.76
Real3,885597,USD,97.47
Real3,885600,USD,1.76
Real3,885609,USD,111.71
Real3,886991,USD,56.84
Real3,890304,USD,175.66
Real3,890472,USD,7.25
Real3,885611,USD,186.57
Real3,892401,USD,85.82
Real3,885651,USD,754.46
Real3,885653,USD,5.75
Real3,885666,USD,10.38
Real3,885670,USD,0.54
Real3,885685,USD,9.84
Real3,885688,USD,2.4
Real3,885691,USD,14.68
Real3,885706,USD,52.32
Real3,885718,USD,27.15
Real3,885721,USD,0.35
Real3,885726,USD,94.5
Real3,885817,USD,1321.72
Real3,885818,USD,2785.96
Real3,885730,USD,15.09
Real3,885738,USD,53.86
Real3,885744,USD,534.98
Real3,885751,USD,1.55
Real3,885773,USD,247.73
Real3,892208,USD,25.45
Real3,885782,USD,33.58
Real3,885810,USD,102.12
Real3,885859,USD,249.67
Real3,885866,USD,56.12
Real3,885870,USD,55.29
Real3,885875,USD,74.25
Real3,885888,USD,0.36
Real3,885904,USD,0.28
Real3,885917,USD,6.72
Real3,885925,USD,2.94
Real3,886254,USD,9.26
Real3,885932,USD,2538.92
Real3,885943,USD,170.0
Real3,885963,USD,42.08
Real3,886005,USD,487.24
Real3,890190,USD,267.58
Real3,886017,USD,39.58
Real3,886021,USD,806.5
Real3,886033,USD,680.0
Real3,886042,USD,1.99
Real3,886054,AUD,57.19
Real3,886064,USD,112.86
Real3,886669,USD,15.91
Real3,886082,USD,11.7
Real3,886097,USD,1054.67
Real3,886146,USD,1117.47
Real3,886156,USD,40.45
Real3,886202,USD,181.11
Real3,886496,USD,231.0
Real3,886725,USD,344.28
Real3,888391,USD,202.85
Real3,888724,USD,99.5
Real3,891937,USD,1.76
Real3,892169,USD,4.9
Real3,892600,USD,51.12
Real3,886231,USD,428.2
Real3,886234,USD,0.5
Real3,886262,USD,7977.73
Real9,19002126,USD,477.81
Real3,886322,USD,896.17
Real3,891650,USD,29.33
Real3,886334,USD,1.4
Real3,888978,USD,13639.18
Real3,886356,USD,46.32
Real3,888489,USD,104.9
Real3,886357,USD,8.15
Real3,886358,USD,31.63
Real3,886359,USD,12.37
Real3,886360,USD,380.92
Real3,886525,USD,54.66
Real3,886369,USD,2.44
Real3,886391,USD,8.66
Real3,886412,USD,7.78
Real3,886415,USD,9.51
Real3,886426,USD,47.93
Real3,886429,USD,57.74
Real3,886431,USD,2.36
Real3,886436,USD,38.98
Real3,886465,USD,1137.46
Real3,886470,USD,3.86
Real9,19002079,USD,15.55
Real3,886476,USD,4.82
Real3,886492,USD,40.15
Real3,886590,USD,0.24
Real3,886592,USD,1.28
Real3,891062,USD,0.72
Real3,886599,USD,5.04
Real3,886619,VND,40075.1
Real3,886627,GBP,0.06
Real3,886629,USD,12.95
Real3,886637,USD,52.64
Real3,886638,USD,115.15
Real3,886642,USD,4.18
Real3,890887,USD,27.94
Real3,890889,USD,78.97
Real3,891552,USD,14.74
Real3,886670,USD,127.36
Real3,889513,USD,47.16
Real3,886696,USD,9.16
Real3,886699,USD,1376.57
Real3,886706,USD,0.35
Real3,886711,USD,160.82
Real3,886720,USD,489.06
Real3,887398,USD,10.85
Real3,888548,USD,4.8
Real3,891336,USD,44.0
Real3,892256,USD,25.3
Real3,886726,USD,6.0
Real3,886801,USD,9.3
Real3,886804,USD,121.58
Real3,886809,USD,62.82
Real3,886825,USD,24.28
Real3,886828,USD,7.42
Real3,886829,USD,55.72
Real3,886830,USD,49.56
Real3,886833,USD,5.84
Real9,19003919,USD,0.38
Real3,886926,USD,19323.77
Real3,886935,USD,91.73
Real3,891352,USD,66.89
Real3,886941,USD,40.24
Real3,886965,USD,54.66
Real3,886966,USD,82.05
Real3,886967,USD,85.44
Real3,886974,USD,2.41
Real3,887002,USD,48.9
Real3,887025,USD,70.13
Real3,887038,USD,0.4
Real3,888710,USD,0.43
Real3,887056,USD,50.28
Real3,887074,USD,0.07
Real3,887117,USD,317.52
Real3,887942,USD,325.58
Real3,887149,USD,28.9
Real3,887150,USD,4.05
Real3,887162,USD,10.44
Real3,887186,USD,1.05
Real3,887192,USD,0.12
Real3,887197,USD,4.2
Real3,887213,USD,34.96
Real3,887216,CNY,2442.96
Real3,887227,USD,9.09
Real3,887238,USD,0.49
Real3,887256,USD,3839.5
Real3,891647,USD,23.69
Real3,887257,USD,171.1
Real3,887275,USD,1285.2
Real3,887279,USD,267.33
Real3,887287,USD,6.08
Real3,887290,USD,269.99
Real3,887308,USD,184.57
Real3,887321,USD,193.0
Real3,887334,USD,16.32
Real3,887343,VND,89210.7
Real3,887359,USD,43.77
Real3,887362,USD,653.0
Real3,887437,USD,71.12
Real3,887445,USD,14.66
Real3,887456,USD,0.71
Real3,887472,USD,97.51
Real3,887486,USD,335.34
Real3,887507,USD,38.27
Real3,887510,USD,4.53
Real3,887520,USD,117.49
Real3,887524,USD,0.08
Real3,887527,USD,6.69
Real3,887528,USD,19.45
Real3,887532,USD,86.52
Real3,887545,USD,0.08
Real3,887553,USD,43.99
Real3,887554,USD,36.64
Real3,887593,USD,431.43
Real3,887616,USD,2.1
Real3,887626,USD,19.95
Real3,887979,USD,6.6
Real3,887666,USD,111.25
Real3,887678,USD,10.78
Real3,887679,USD,120.13
Real3,887691,USD,15.68
Real3,887758,USD,13.83
Real3,887774,USD,12.04
Real3,887780,USD,76.65
Real3,887789,USD,0.04
Real3,887792,USD,15.27
Real3,887803,USD,0.7
Real3,887842,USD,2.91
Real3,887856,USD,140.0
Real3,887893,USD,59.85
Real3,887901,USD,46.12
Real3,887918,USD,185.42
Real3,887932,USD,2.8
Real3,887933,USD,24.4
Real3,887938,USD,212.79
Real9,19004087,USD,0.98
Real3,887941,AUD,218.26
Real3,891067,AUD,366.32
Real3,891794,AUD,241.06
Real9,19001485,USD,8.92
Real3,887981,USD,5.53
Real3,888004,USD,55.99
Real3,888026,USD,466.3
Real3,888049,USD,56.2
Real3,888061,USD,9.96
Real3,888100,USD,1.99
Real3,888101,CNY,301.3
Real3,888123,USD,145.51
Real3,888152,USD,12.15
Real3,889674,USD,86.52
Real3,888141,IDR,766797.36
Real3,892346,USD,12.4
Real3,888142,THB,5471.28
Real3,888162,USD,7.3
Real3,888168,USD,37.84
Real3,888196,USD,246.08
Real3,888199,USD,430.99
Real3,889493,USD,788.79
Real3,888217,USD,4.5
Real3,888221,USD,3.78
Real3,888222,USD,35.29
Real3,888236,USD,115.97
Real3,888245,USD,6.39
Real3,888251,USD,48.1
Real3,888310,USD,6.4
Real3,888316,USD,13.26
Real3,891315,USD,47.44
Real3,888358,USD,18.5
Real3,888375,USD,91.5
Real3,888389,USD,0.07
Real3,888406,USD,66.45
Real3,891090,EUR,44.47
Real3,888411,USD,67.45
Real3,889606,USD,65.92
Real3,888416,USD,90.56
Real3,888419,USD,35.88
Real3,891561,USD,25.98
Real3,888418,USD,11.12
Real3,888422,USD,3.03
Real3,888425,USD,135.36
Real3,889361,USD,59.43
Real9,19001443,USD,0.18
Real3,888430,USD,13.31
Real3,888448,USD,11.85
Real3,888450,USD,21.07
Real3,888470,USD,16.29
Real3,888478,USD,0.31
Real3,888479,CNY,228.11
Real3,888500,USD,309.61
Real3,888501,USD,4.94
Real3,888512,USD,15.69
Real3,888522,USD,101.44
Real3,888530,USD,19.06
Real3,888589,USD,0.84
Real3,888594,USD,1.09
Real3,888595,USD,456.75
Real3,892519,USD,55.54
Real3,888601,USD,0.18
Real3,888619,USD,542.25
Real3,888641,USD,2132.75
Real3,888650,USD,99.08
Real3,888663,USD,77.93
Real3,888674,USD,319.32
Real3,888680,USD,15.53
Real3,888709,USD,41.22
Real3,888720,USD,4.87
Real3,888749,USD,22.14
Real3,888752,USD,4518.26
Real3,888754,USD,134.4
Real3,892111,USD,34.8
Real3,892365,USD,153.0
Real3,888758,USD,1.68
Real3,888768,USD,17.13
Real3,888918,USD,16.0
Real3,888933,USD,1.6
Real3,888942,USD,25.47
Real3,888944,USD,49.36
Real3,888960,USD,4.7
Real3,888968,USD,21.12
Real3,888971,USD,17.72
Real3,888975,USD,1.47
Real3,888976,USD,103.51
Real3,888980,USD,4.18
Real3,888981,USD,341.53
Real3,889191,USD,72.5
Real3,889965,USD,84.7
Real3,889003,USD,11.82
Real3,889005,USD,105.2
Real3,889014,USD,9.08
Real3,889050,USD,25.27
Real3,889065,USD,3.0
Real3,889069,USD,9.29
Real3,889079,USD,827.95
Real3,889134,USD,37.03
Real3,889136,USD,55.93
Real3,889146,USD,167.98
Real3,889153,USD,21.14
Real3,889171,USD,2.33
Real3,889200,USD,20.7
Real9,19001659,USD,0.9
Real3,889207,USD,126.14
Real3,889225,USD,126.6
Real3,889232,USD,1.2
Real3,889252,USD,7.23
Real3,889263,USD,22.3
Real3,889264,USD,11.86
Real3,889277,USD,1.61
Real9,19002686,USD,7.6
Real3,889302,USD,4.19
Real3,889307,USD,29.48
Real9,19002517,USD,159.94
Real3,889349,USD,761.35
Real3,889360,USD,635.46
Real3,889362,USD,4.61
Real3,889364,USD,0.22
Real3,889369,USD,12.45
Real3,889379,USD,19.33
Real3,889382,IDR,34277.72
Real3,889390,USD,0.11
Real3,889392,USD,0.8
Real3,891354,USD,0.53
Real3,891356,USD,2.58
Real3,889401,USD,1.44
Real3,889439,USD,126.3
Real3,892089,USD,1.6
Real3,889443,USD,6.14
Real3,889445,USD,1435.01
Real3,889449,USD,2.2
Real3,889469,USD,11.25
Real3,889472,USD,231.87
Real3,889477,USD,1.1
Real3,889478,USD,2168.92
Real3,889489,USD,0.64
Real3,889494,USD,272.26
Real3,891143,USD,5.31
Real3,889507,USD,105.2
Real3,889512,USD,10.73
Real3,889515,USD,83.23
Real3,889519,USD,21.29
Real3,889538,USD,1.04
Real3,890011,USD,0.4
Real3,889546,USD,1.68
Real3,889555,USD,5.23
Real3,889556,USD,46.45
Real3,889557,USD,264.76
Real3,889579,USD,5.91
Real3,889582,USD,27.26
Real3,889583,USD,15.09
Real3,889584,USD,17.06
Real3,891484,USD,28.91
Real3,889589,USD,136.8
Real3,889598,USD,103.9
Real3,889618,USD,196.33
Real3,892266,IDR,348765.58
Real3,889635,USD,6.74
Real3,889638,USD,11.66
Real3,889649,USD,4.67
Real3,889654,USD,26.72
Real3,889689,USD,3.34
Real3,889712,USD,11.04
Real3,889900,USD,22.32
Real3,889912,USD,0.1
Real3,889916,USD,1.6
Real3,889920,USD,35.52
Real3,889936,USD,15.23
Real3,889944,USD,50.54
Real3,889962,USD,94.8
Real3,889963,USD,341.5
Real3,889989,USD,6.35
Real3,889999,USD,284.71
Real3,890009,USD,94.47
Real3,892929,USD,8.5
Real9,19002777,USD,88.2
Real3,890018,USD,14.88
Real3,890022,USD,9.37
Real3,890033,USD,25.72
Real3,890043,USD,26.54
Real3,890052,USD,35.3
Real3,890059,USD,2.77
Real9,19001901,USD,0.45
Real3,890061,USD,5.71
Real3,890072,USD,119.31
Real3,890076,USD,100.21
Real3,890081,USD,5.28
Real3,890083,USD,32.95
Real3,890087,USD,98.28
Real3,890092,USD,392.25
Real3,890101,USD,1.46
Real3,890107,USD,5.55
Real3,890109,USD,1.78
Real9,19002363,RUB,240.44
Real3,890115,USD,8.99
Real3,890117,USD,8.23
Real3,890121,USD,111.52
Real3,892170,USD,85.12
Real3,890126,USD,101.67
Real3,890138,USD,274.21
Real3,890144,USD,2210.49
Real9,19000599,USD,1230.95
Real3,890145,USD,18.72
Real3,890146,USD,1.6
Real3,890149,USD,582.15
Real3,890160,USD,9.65
Real3,890161,USD,3.8
Real3,890171,USD,71.27
Real3,891243,USD,40.17
Real3,890174,VND,289237.7
Real3,891864,USD,144.0
Real3,891865,USD,139.2
Real3,891866,USD,160.8
Real3,891867,USD,135.15
Real3,891868,USD,1296.66
Real3,890180,USD,903.97
Real9,19004053,USD,117.84
Real3,890182,USD,9.74
Real3,890186,USD,569.29
Real3,890187,USD,32.8
Real3,890188,USD,5.18
Real3,890205,USD,32.0
Real3,890211,USD,3786.08
Real3,890217,USD,81.9
Real3,890218,USD,0.33
Real3,890220,GBP,24.22
Real3,890232,USD,77.1
Real3,890236,USD,12.0
Real3,890244,USD,53.56
Real3,890770,USD,646.98
Real3,890256,USD,61.57
Real3,890261,USD,31.08
Real3,890268,USD,3.7
Real3,890270,USD,10.89
Real3,890291,USD,11.16
Real3,891164,USD,162.54
Real9,19003529,USD,1.76
Real3,890293,USD,467.72
Real3,890309,USD,24.88
Real3,890310,USD,85.48
Real3,890313,USD,49.08
Real3,892171,USD,21.42
Real3,890316,USD,26.87
Real3,890325,USD,3.94
Real9,19000707,USD,5.5
Real3,892088,USD,84.0
Real9,19003435,USD,16.6
Real3,890343,USD,0.24
Real3,890345,USD,9.57
Real3,890352,USD,10.47
Real3,890355,USD,1.2
Real3,890358,USD,50.06
Real3,890359,USD,18.31
Real3,890360,USD,266.7
Real3,890365,USD,44.32
Real3,890382,USD,13.92
Real3,890389,USD,52.43
Real3,890392,USD,58.64
Real3,890394,USD,123.78
Real3,890395,USD,104.6
Real3,890396,USD,1.57
Real3,890401,USD,2.16
Real3,890403,USD,237.6
Real3,892073,USD,809.31
Real3,890406,USD,3.98
Real3,890410,USD,5154.53
Real3,892237,USD,1251.55
Real3,890411,USD,171.57
Real3,890417,USD,35.68
Real3,890419,USD,24.4
Real3,890421,USD,20.61
Real3,890425,USD,271.9
Real3,890427,USD,41.2
Real3,890428,USD,12.49
Real9,19002208,USD,1.58
Real3,890433,USD,76.93
Real3,890434,USD,9.6
Real3,890435,USD,1.93
Real3,890436,USD,66.93
Real3,890437,USD,52659.78
Real3,890490,USD,12.49
Real3,890910,USD,38.38
Real3,891717,USD,2.78
Real3,892323,USD,17.66
Real3,890486,USD,335.34
Real3,890487,USD,21.34
Real3,890623,USD,1.55
Real3,890494,USD,128.82
Real3,890498,USD,4.78
Real3,891616,USD,5.27
Real3,890501,USD,59.95
Real3,891501,USD,6.79
Real3,890512,USD,2.35
Real3,890513,USD,11.85
Real3,890516,USD,60.07
Real3,890521,INR,1775.05
Real3,890525,USD,142.76
Real3,890526,USD,73.35
Real3,890545,USD,3.93
Real3,890551,USD,0.07
Real3,890550,USD,38.4
Real3,890555,USD,0.64
Real3,890557,USD,1.62
Real3,890558,USD,2.4
Real3,890559,USD,2.4
Real3,890564,USD,253.75
Real3,890575,USD,132.36
Real3,890579,USD,246.15
Real3,890580,USD,179.87
Real3,890581,USD,257.51
Real3,890582,USD,5.03
Real3,890583,USD,4.63
Real3,890584,USD,1.26
Real3,890590,USD,488.04
Real3,892185,USD,41.66
Real3,892295,USD,163.45
Real3,890592,USD,21.92
Real3,890594,USD,2664.02
Real3,891547,USD,751.2
Real3,890595,USD,58.47
Real3,890596,USD,23.36
Real9,19001889,USD,3.5
Real3,890598,USD,12.62
Real3,890600,USD,90.54
Real3,890604,USD,6.73
Real3,890605,USD,26.96
Real3,890606,USD,304.79
Real3,892267,USD,193.7
Real9,19003599,USD,12.95
Real3,890609,USD,233.6
Real3,892095,USD,1464.0
Real3,890610,USD,60.64
Real3,890615,USD,2.32
Real3,890622,USD,55.0
Real3,890624,USD,58.34
Real3,890626,USD,8.65
Real3,890906,USD,149.91
Real9,19002266,USD,19.01
Real3,890675,USD,6.8
Real3,890678,USD,33.12
Real3,890682,USD,28.24
Real3,890690,USD,35.91
Real3,890691,USD,360.04
Real3,892657,USD,184.35
Real3,890705,USD,199.86
Real3,890708,USD,1343.12
Real3,890759,USD,162.64
Real3,891273,USD,46.8
Real3,891387,USD,16.0
Real3,891590,USD,483.11
Real3,890711,USD,220.09
Real3,890712,USD,8.15
Real3,890722,USD,33.53
Real3,890723,USD,13.14
Real3,890757,USD,49.42
Real3,890760,USD,109.56
Real3,890764,USD,73.8
Real3,890761,USD,0.16
Real3,890767,USD,320.91
Real3,890900,USD,525.93
Real3,890778,USD,39.61
Real3,890780,USD,1.2
Real3,890802,USD,307.9
Real3,890792,USD,242.59
Real3,890795,USD,377.99
Real3,891385,USD,5.78
Real3,890830,USD,16.1
Real3,890835,USD,1.6
Real3,890837,USD,0.95
Real3,890838,USD,4.16
Real3,890843,USD,0.52
Real3,890844,USD,3.88
Real3,891465,USD,8.48
Real3,890848,USD,5.64
Real3,890856,USD,22.4
Real3,892303,USD,134.67
Real3,890860,USD,31.18
Real3,890868,USD,2.05
Real9,19001429,USD,44.24
Real3,890880,USD,2.36
Real3,890882,USD,36.34
Real3,891774,USD,42.18
Real3,890890,VND,43327.64
Real3,891208,USD,5.49
Real3,890896,USD,52.03
Real9,19001736,USD,22.05
Real3,890904,USD,35.83
Real3,890909,USD,17.77
Real3,890917,USD,17.71
Real3,890918,USD,90.81
Real3,892123,USD,21.86
Real3,890935,USD,40.19
Real3,890946,USD,18.95
Real3,890950,USD,213.68
Real3,890951,USD,34.11
Real3,890952,USD,34.34
Real3,890953,USD,11.78
Real3,890955,USD,10.82
Real3,891908,USD,50.85
Real3,892228,USD,6.97
Real3,890954,USD,1.2
Real3,890958,USD,147.6
Real3,890962,USD,31.36
Real3,891009,USD,22.46
Real3,890966,CNY,7865.89
Real3,890976,USD,0.56
Real3,890998,USD,659.37
Real3,890999,USD,82.78
Real3,891000,USD,38.96
Real3,891002,USD,1.67
Real3,891003,IDR,9287788.21
Real3,891010,USD,10.04
Real3,891034,USD,12.71
Real3,891021,USD,4.04
Real3,891023,USD,0.64
Real3,891026,USD,148.15
Real3,891030,USD,193.36
Real3,891027,USD,16.17
Real3,891029,USD,174.7
Real3,891033,USD,649.96
Real3,891049,USD,396.32
Real3,891051,USD,1.86
Real3,891061,USD,447.79
Real3,891064,USD,46.5
Real3,891070,USD,92.32
Real3,892710,USD,478.0
Real3,891075,USD,83.46
Real3,891078,USD,150.75
Real3,891084,USD,52.79
Real3,891088,USD,17.18
Real3,892829,USD,0.89
Real3,891092,USD,25.23
Real3,891096,USD,31.47
Real3,891099,USD,180.16
Real3,891101,USD,1737.67
Real3,892049,USD,29.42
Real3,891102,CNY,6872.62
Real3,891110,USD,1920.38
Real3,892357,USD,696.65
Real3,891115,USD,79.9
Real3,891119,USD,39.18
Real3,891129,USD,103.34
Real3,891203,USD,13.12
Real3,891130,USD,27.82
Real3,891131,USD,1.7
Real3,891658,USD,409.87
Real3,891135,USD,86.67
Real3,891137,USD,65.76
Real3,891141,USD,1.49
Real3,891148,USD,75.77
Real3,891155,USD,18.61
Real3,891157,USD,1188.75
Real3,891163,USD,75.0
Real3,891168,USD,143.41
Real3,891183,USD,1145.06
Real3,891185,IDR,39660.94
Real3,891191,USD,4.55
Real3,891194,USD,15.02
Real3,891195,USD,17.0
Real3,891204,EUR,17.58
Real3,891206,USD,56.02
Real3,891209,USD,31.61
Real3,891214,USD,76.43
Real3,891216,USD,282.12
Real9,19002332,USD,326.13
Real3,891220,USD,5.16
Real9,19002924,USD,2.97
Real3,891224,USD,3.25
Real3,891226,USD,8.17
Real3,891229,USD,1.36
Real3,891230,USD,675.92
Real3,891232,USD,328.13
Real3,891235,USD,35.74
Real3,891237,USD,14.39
Real9,19003609,USD,33.43
Real3,891250,USD,191.75
Real3,891253,USD,332.8
Real3,891260,USD,45.04
Real3,891262,USD,36.41
Real3,891264,USD,221.47
Real9,19003421,USD,61.6
Real3,891265,USD,70.41
Real3,891575,USD,88.79
Real3,892819,USD,63.32
Real3,892852,USD,54.21
Real3,891268,USD,53.76
Real3,891269,VND,13721543.47
Real3,891270,USD,206.5
Real9,19002660,USD,1079.29
Real3,891272,USD,194.17
Real3,891278,USD,713.15
Real3,891280,USD,20.73
Real3,891363,USD,0.16
Real9,19002792,USD,3.08
Real9,19002885,USD,4.54
Real3,891284,USD,2200.0
Real3,891285,GBP,49.38
Real3,891306,USD,48.44
Real3,891308,USD,15.89
Real3,891312,USD,1363.64
Real3,891321,USD,38.57
Real3,891333,USD,232.32
Real3,891335,USD,2.19
Real3,891339,USD,4.88
Real9,19003600,USD,0.35
Real3,891345,USD,1066.36
Real3,892018,USD,327.47
Real3,892062,USD,26.14
Real3,891349,USD,7.1
Real3,891353,USD,100.3
Real3,891360,USD,4.46
Real3,891369,USD,0.74
Real3,891370,USD,64.09
Real3,891380,USD,48.05
Real3,891381,USD,27.92
Real3,891386,RUB,141.17
Real3,891390,USD,934.46
Real3,891391,USD,209.95
Real3,891395,USD,33.2
Real3,891396,USD,251.34
Real3,891397,USD,7.5
Real3,891404,USD,47.46
Real3,891412,USD,408.62
Real3,891413,USD,307.95
Real3,891414,USD,68.18
Real3,891415,USD,28.01
Real3,891416,USD,461.2
Real3,891517,USD,434.8
Real3,892498,USD,5.24
Real3,892528,USD,5.38
Real3,891421,USD,543.31
Real3,891426,USD,252.32
Real3,891428,USD,10.7
Real3,891430,USD,15.67
Real3,891431,USD,330.88
Real3,892526,USD,397.22
Real3,891433,USD,9.76
Real3,891435,USD,251.6
Real3,891437,USD,147.52
Real3,891450,USD,2691.04
Real3,891457,USD,2.0
Real3,891535,USD,18.24
Real3,891458,USD,0.54
Real3,891459,USD,37.65
Real3,891460,USD,0.32
Real3,891461,USD,10.42
Real3,891462,USD,39.5
Real3,891464,USD,37.23
Real3,891475,USD,4.61
Real3,891481,USD,0.14
Real3,891485,USD,43.42
Real3,891492,USD,4.21
Real3,891493,USD,4.6
Real3,891496,USD,14.48
Real3,891502,USD,1.15
Real3,891503,USD,69.0
Real3,891507,USD,21.93
Real3,891521,USD,22.03
Real3,891524,USD,0.8
Real3,891527,USD,0.8
Real3,891526,USD,2.59
Real9,19002500,USD,14.04
Real3,891545,USD,39.91
Real3,891548,USD,4058.21
Real3,891553,USD,53.65
Real3,891556,USD,152.75
Real3,891557,USD,257.0
Real3,891564,USD,0.67
Real3,891565,USD,10.69
Real3,891568,USD,40.26
Real3,891571,USD,10.4
Real3,891572,USD,28.6
Real3,891573,USD,1.03
Real3,891579,USD,6.2
Real3,891588,USD,1.6
Real3,891589,USD,23.46
Real3,891591,USD,33.88
Real3,891598,USD,258.88
Real3,891604,USD,517.44
Real3,891605,USD,5.5
Real3,891606,USD,1.51
Real3,891609,USD,262.04
Real3,891897,USD,212.43
Real3,891904,USD,43.24
Real3,891612,USD,395.0
Real9,19003066,USD,98.0
Real3,891617,USD,17.5
Real3,891619,USD,12.92
Real3,891622,USD,90.2
Real3,891623,USD,42.62
Real3,891624,USD,240.92
Real3,891931,USD,242.24
Real3,891626,USD,0.36
Real3,891640,USD,7.37
Real3,891641,USD,236.03
Real3,891642,USD,524.8
Real9,19003407,USD,536.3
Real3,891644,USD,2810.75
Real9,19003083,USD,748.17
Real3,891651,USD,2.07
Real3,891654,USD,4.33
Real3,891656,USD,0.71
Real3,891660,USD,49.63
Real3,891670,USD,24.73
Real3,891671,USD,70.32
Real3,891677,USD,1.38
Real3,891678,USD,4.56
Real3,891681,USD,0.7
Real3,891685,USD,73.5
Real9,19003489,USD,12.71
Real3,891688,USD,67.13
Real3,891695,USD,433.52
Real3,891699,USD,125.98
Real3,891700,USD,5.67
Real3,891701,USD,123.8
Real3,891707,USD,68.5
Real3,891708,USD,62.73
Real3,891709,USD,143.31
Real3,892887,USD,45.16
Real3,891719,USD,136.5
Real3,891720,USD,176.8
Real3,891722,USD,64.31
Real3,891724,USD,22.45
Real3,891729,USD,3.9
Real3,891740,USD,654.96
Real9,19003165,USD,215.91
Real3,891744,USD,20.88
Real3,891850,USD,29.64
Real3,891748,USD,350.06
Real3,892382,USD,4.52
Real3,892520,USD,20.34
Real3,892882,USD,1.8
Real3,891754,AUD,0.92
Real3,891755,USD,1.53
Real3,891760,USD,2.0
Real3,891762,USD,64.16
Real3,891763,USD,16.1
Real9,19002971,USD,1.82
Real3,891765,USD,164.54
Real3,892250,USD,70.8
Real3,891766,USD,80.64
Real3,891767,USD,100.64
Real3,891768,USD,1.44
Real9,19002409,USD,422.52
Real9,19002514,USD,336.52
Real9,19003396,USD,185.25
Real3,891785,USD,51.03
Real3,891789,JPY,154.36
Real3,891793,USD,7.48
Real3,891795,USD,171.6
Real3,891797,USD,384.1
Real3,891804,USD,654.16
Real9,19003220,USD,215.07
Real9,19003221,USD,213.32
Real9,19003274,USD,215.46
Real9,19003502,USD,64.76
Real3,891807,USD,4.2
Real3,891808,THB,2063.13
Real9,19002953,THB,11.4
Real3,891819,USD,10.33
Real3,891823,USD,498.0
Real3,891825,USD,0.34
Real3,891827,USD,551.76
Real3,891829,USD,222.27
Real3,892402,USD,13.0
Real3,891836,USD,910.18
Real3,891838,USD,63.97
Real3,891840,USD,416.87
Real3,891843,USD,671.54
Real3,891851,USD,8.3
Real3,891852,USD,22.56
Real3,891853,USD,20.04
Real3,891856,USD,363.16
Real9,19001759,USD,108.85
Real3,891876,CNY,276.5
Real3,891877,AUD,307.92
Real3,891878,CNY,1420.36
Real3,891883,USD,1.58
Real3,891886,USD,156.6
Real3,891887,GBP,73.01
Real3,891888,USD,27.5
Real3,891893,USD,17.0
Real3,891894,USD,1794.22
Real3,892541,USD,1230.56
Real3,892543,USD,543.68
Real3,891895,USD,407.83
Real3,891896,USD,149.24
Real3,891901,USD,4.44
Real3,891906,USD,172.04
Real9,19003319,USD,0.53
Real3,891907,USD,41.73
Real3,891909,USD,17.93
Real3,891910,USD,40.91
Real3,891911,USD,65.99
Real3,891912,USD,34.53
Real3,891913,USD,14.96
Real3,891914,USD,3.23
Real3,891919,USD,23.16
Real3,891920,USD,53.71
Real9,19003150,USD,33.05
Real3,891922,USD,0.91
Real3,891923,USD,2.6
Real9,19003312,USD,124.94
Real3,891928,USD,13.96
Real3,891935,USD,13.77
Real3,891939,USD,134.6
Real3,892378,USD,157.11
Real3,891941,USD,66.03
Real3,891943,USD,646.04
Real3,891945,USD,67.88
Real3,891951,USD,6.16
Real3,891952,USD,10.85
Real3,891953,USD,174.14
Real3,891954,USD,18.0
Real3,891956,USD,143.6
Real3,891964,USD,15.52
Real3,891965,USD,4.08
Real3,891972,USD,165.28
Real3,891975,USD,135.68
Real3,891978,USD,124.47
Real3,891979,USD,576.0
Real3,892798,USD,216.18
Real3,891982,USD,110.02
Real3,891992,USD,2.21
Real3,891995,USD,1017.6
Real3,892189,USD,0.44
Real3,891996,USD,92.64
Real3,892000,USD,31.48
Real3,892001,USD,379.58
Real9,19003313,USD,34.34
Real9,19003315,USD,2.94
Real9,19003316,USD,24.36
Real3,892006,USD,10.7
Real3,892008,USD,46.03
Real3,892010,USD,27.86
Real9,19003720,USD,5.56
Real3,892011,USD,59.94
Real3,892012,USD,29.77
Real3,892017,USD,456.0
Real3,892276,USD,9.09
Real3,892606,INR,18884.34
Real3,892023,USD,712.52
Real9,19001666,USD,489.12
Real9,19003067,USD,0.35
Real3,892024,USD,354.48
Real3,892027,USD,6.75
Real9,19003400,USD,89.7
Real9,19003696,USD,8.74
Real3,892052,IDR,984219.6
Real3,892092,USD,22.26
Real3,892053,USD,3.28
Real3,892054,USD,40.47
Real3,892058,VND,4061873.67
Real3,892059,USD,105.32
Real3,892060,USD,230.71
Real3,892068,USD,281.99
Real3,892071,USD,2805.85
Real3,892072,USD,103.35
Real3,892074,USD,5.93
Real3,892075,USD,262.87
Real3,892080,USD,17.22
Real3,892081,USD,4.0
Real3,892082,USD,493.48
Real3,892843,USD,28.95
Real9,19003534,USD,3944.54
Real3,892085,USD,2.16
Real9,19003178,USD,22.65
Real9,19003431,USD,0.8
Real9,19003433,USD,4.83
Real3,892093,USD,233.12
Real3,892094,USD,12.22
Real3,892099,USD,105.05
Real3,892110,USD,2.72
Real3,892114,USD,33.77
Real3,892116,USD,23.0
Real3,892117,USD,71.4
Real3,892122,USD,1469.23
Real3,892125,USD,63.04
Real3,892127,USD,80.0
Real3,892560,USD,675.5
Real3,892672,USD,36.0
Real3,892129,USD,14.04
Real3,892131,USD,28.37
Real3,892359,USD,3.16
Real3,892410,USD,9.13
Real3,892910,USD,1.33
Real9,19003463,USD,0.14
Real3,892133,USD,48.98
Real3,892135,USD,23.9
Real3,892350,USD,28.24
Real3,892142,USD,1696.77
Real3,892150,USD,416.96
Real3,892143,USD,7.76
Real3,892154,USD,70.0
Real3,892157,USD,281.99
Real9,19002650,USD,106.29
Real3,892159,USD,67.63
Real3,892162,USD,68.57
Real3,892166,USD,157.25
Real3,892168,USD,30.16
Real3,892174,USD,152.99
Real3,892179,USD,15.24
Real3,892180,USD,204.26
Real3,892183,USD,3.17
Real3,892184,USD,78.6
Real3,892186,CNY,8499.56
Real3,892196,USD,87.0
Real3,892210,USD,4.66
Real9,19003579,USD,509.95
Real3,892212,USD,93.4
Real3,892214,USD,0.54
Real3,892218,USD,130.26
Real3,892221,USD,240.59
Real3,892222,USD,86.56
Real3,892227,USD,42.04
Real3,892241,USD,65.19
Real3,892244,USD,8.08
Real3,892247,USD,270.97
Real3,892254,USD,3.5
Real3,892257,USD,55.88
Real9,19003616,USD,1.65
Real3,892258,USD,7.14
Real3,892264,USD,60.35
Real3,892265,USD,24.08
Real3,892268,USD,2498.34
Real3,892270,USD,119.6
Real3,892271,USD,8.89
Real9,19003350,USD,8.82
Real3,892275,USD,3.31
Real3,892283,USD,0.18
Real3,892292,USD,1366.16
Real3,892301,USD,7.53
Real3,892319,USD,60.8
Real3,892325,USD,6.51
Real3,892327,USD,57.65
Real3,892380,USD,28.61
Real3,892328,USD,40.98
Real3,892330,USD,446.31
Real3,892334,USD,16732.96
Real3,892336,USD,0.6
Real3,892341,USD,57.68
Real3,892348,USD,697.14
Real3,892714,USD,263.8
Real3,892351,USD,7.05
Real3,892352,USD,1431.07
Real3,892355,USD,10.46
Real3,892358,USD,585.9
Real9,19003203,USD,1016.76
Real9,19003620,USD,227.5
Real9,19003734,USD,805.0
Real9,19003981,USD,367.5
Real3,892369,USD,670.8
Real3,892373,USD,592.68
Real3,892381,USD,4.85
Real3,892384,USD,13.17
Real3,892388,USD,40.82
Real3,892389,USD,5.64
Real3,892391,USD,69.87
Real3,892394,USD,25.41
Real3,892399,USD,45.63
Real3,892400,USD,148.72
Real3,892406,JPY,959.07
Real3,892413,USD,222.6
Real3,892415,USD,33.97
Real3,892431,USD,1.34
Real3,892433,USD,154.67
Real3,892442,USD,44.81
Real3,892447,USD,516.45
Real3,892449,USD,151.12
Real3,892460,USD,17.2
Real3,892464,USD,79.16
Real9,19000070,USD,266.0
Real9,19000575,USD,5.39
Real9,19000626,USD,5.39
Real9,19000627,USD,5.39
Real9,19000628,USD,5.39
Real9,19000629,USD,5.39
Real9,19000814,USD,2578.04
Real9,19002441,USD,5.33
Real9,19002442,USD,5.25
Real9,19002443,USD,89.95
Real3,892473,USD,4.17
Real3,892474,USD,0.32
Real3,892475,USD,32.46
Real3,892483,USD,2.68
Real3,892488,USD,181.2
Real3,892496,JPY,5747.84
Real3,892511,USD,12.98
Real3,892518,USD,72.0
Real3,892523,USD,36.88
Real3,892530,USD,42.33
Real3,892532,USD,23.22
Real3,892545,USD,15.85
Real3,892546,USD,28.43
Real9,19004022,USD,19.61
Real3,892555,USD,31.01
Real3,892556,USD,26.39
Real3,892558,USD,3760.0
Real3,892671,USD,33212.4
Real3,892562,USD,9.9
Real3,892565,USD,57.72
Real3,892576,USD,119.4
Real3,892579,USD,25.1
Real3,892589,USD,23.09
Real3,892590,USD,21.15
Real3,892595,USD,4.71
Real3,892597,USD,2.88
Real9,19003964,USD,0.07
Real3,892604,USD,63.96
Real3,892611,USD,12.93
Real3,892612,USD,35.6
Real3,892615,USD,141.74
Real3,892618,USD,18.78
Real3,892621,USD,50.72
Real3,892633,USD,14.36
Real3,892636,USD,41.62
Real3,892637,USD,30.92
Real3,892638,USD,145.29
Real3,892640,USD,11.34
Real3,892642,USD,562.2
Real3,892646,USD,46.12
Real3,892647,USD,80.19
Real3,892659,USD,12.49
Real3,892660,USD,0.04
Real3,892661,USD,208.96
Real3,892665,USD,21.22
Real3,892668,USD,10.62
Real3,892669,USD,37.19
Real3,892673,USD,1.77
Real3,892679,USD,88.74
Real3,892680,USD,31.34
Real3,892682,USD,4.29
Real3,892683,USD,28.7
Real3,892693,USD,36.0
Real3,892694,USD,69.75
Real9,19002315,USD,1092.32
Real3,892695,USD,0.62
Real9,19002992,USD,2604.55
Real3,892699,USD,14.06
Real3,892706,USD,5.86
Real3,892717,USD,12.03
Real3,892722,USD,15.37
Real3,892727,USD,7.97
Real3,892731,USD,36.44
Real3,892767,USD,6.33
Real3,892732,USD,25.45
Real3,892734,USD,57.95
Real3,892736,USD,15.4
Real3,892738,USD,39.87
Real3,892745,USD,19.32
Real3,892749,USD,0.16
Real3,892750,USD,53.7
Real3,892752,USD,28.91
Real3,892754,USD,507.6
Real3,892777,USD,0.18
Real3,892788,USD,255.71
Real3,892794,USD,1024.5
Real9,19003146,USD,4830.08
Real3,892795,USD,62.84
Real3,892801,USD,187.21
Real3,892802,USD,2.4
Real3,892810,USD,2.38
Real3,892814,USD,1.19
Real3,892817,USD,7.07
Real3,892823,USD,2.79
Real3,892838,USD,3.01
Real3,892853,USD,18.64
Real3,892854,USD,23.95
Real3,892897,USD,0.6
Real3,892856,USD,22.2
Real3,892860,USD,1.02
Real3,892863,USD,2.74
Real3,892872,USD,9.5
Real3,892878,USD,25.87
Real3,892885,USD,32.76
Real3,892894,USD,56.6
Real3,892906,USD,1.1
Real3,892913,USD,3.22
Real3,892914,USD,7.0
Real3,892918,USD,51.25
Real3,892927,USD,1.71
Real9,19001468,USD,146.12
Real9,19000048,USD,3.53
Real9,19000053,USD,309.29
Real9,19000057,USD,6.13
Real9,19000928,USD,19.04
Real9,19000930,USD,5.33
Real9,19000931,USD,5.33
Real9,19003904,USD,136.86
Real9,19000118,USD,0.63
Real9,19000160,USD,87.46
Real9,19000166,USD,0.18
Real9,19000190,USD,12.98
Real9,19000199,USD,26.05
Real9,19000201,USD,8.57
Real9,19000203,USD,0.18
Real9,19000213,USD,6.92
Real9,19000225,USD,1.75
Real9,19000226,USD,2.73
Real9,19000344,USD,974.43
Real9,19000351,USD,9.91
Real9,19000357,USD,4.2
Real9,19000372,USD,5.74
Real9,19004127,USD,1.04
Real9,19004128,USD,1.04
Real9,19004150,USD,0.52
Real9,19004152,USD,0.52
Real9,19000388,USD,9.8
Real9,19000406,USD,176.65
Real9,19000831,USD,5.25
Real9,19000832,USD,5.25
Real9,19000833,USD,5.33
Real9,19000841,USD,91.91
Real9,19000407,USD,2.2
Real9,19000428,USD,3.92
Real9,19000445,USD,9.38
Real9,19000448,USD,0.64
Real9,19000450,USD,0.84
Real9,19000463,USD,8.89
Real9,19000466,USD,2.46
Real9,19000487,USD,94.15
Real9,19001340,USD,7.0
Real9,19000488,USD,9.86
Real9,19000508,USD,2816.08
Real9,19000513,USD,316.49
Real9,19002153,USD,1.26
Real9,19000524,USD,255.0
Real9,19000527,IDR,1160.09
Real9,19000530,USD,110.95
Real9,19000581,USD,5.56
Real9,19000604,USD,4.07
Real9,19000612,USD,82.0
Real9,19000625,USD,0.07
Real9,19002835,USD,2.17
Real9,19003780,USD,46.55
Real9,19000631,EUR,125.08
Real9,19000633,USD,10.45
Real9,19000639,USD,5.39
Real9,19000736,USD,5.39
Real9,19000805,USD,5.33
Real9,19000806,USD,5.25
Real9,19000818,USD,5.29
Real9,19000819,USD,5.33
Real9,19000820,USD,5.25
Real9,19000821,USD,5.33
Real9,19000824,USD,5.33
Real9,19002433,USD,42.74
Real9,19000646,USD,3.88
Real9,19000662,USD,0.14
Real9,19000674,USD,2.49
Real9,19000688,USD,5.32
Real9,19000675,USD,5.39
Real9,19000889,USD,5.33
Real9,19000890,USD,5.33
Real9,19000891,USD,5.33
Real9,19000677,USD,0.04
Real9,19000680,USD,3.78
Real9,19000682,USD,14.87
Real9,19000690,USD,2.2
Real9,19000709,USD,14.92
Real9,19000720,USD,53.59
Real9,19000735,USD,5.39
Real9,19000851,USD,5.33
Real9,19000739,USD,5.39
Real9,19000740,USD,5.39
Real9,19000741,USD,5.39
Real9,19000742,USD,5.39
Real9,19000749,USD,13.09
Real9,19000751,USD,5.39
Real9,19000754,USD,5.47
Real9,19000755,USD,5.47
Real9,19000893,USD,5.33
Real9,19000894,USD,5.33
Real9,19000759,USD,89.36
Real9,19000761,USD,0.35
Real9,19000762,USD,61.36
Real9,19000768,USD,87.5
Real9,19000921,USD,5.33
Real9,19000922,USD,66.5
Real9,19000778,USD,5.47
Real9,19000779,USD,5.47
Real9,19000780,USD,5.47
Real9,19000781,USD,5.47
Real9,19000782,USD,5.47
Real9,19000783,USD,5.47
Real9,19000784,USD,5.47
Real9,19000785,USD,5.47
Real9,19000786,USD,5.47
Real9,19000787,USD,5.33
Real9,19000788,USD,5.33
Real9,19000789,USD,5.47
Real9,19000790,USD,5.33
Real9,19000791,USD,5.33
Real9,19000792,USD,5.33
Real9,19000795,USD,5.33
Real9,19000796,USD,5.33
Real9,19000798,USD,5.33
Real9,19000799,USD,5.33
Real9,19000801,USD,5.29
Real9,19000802,USD,5.25
Real9,19000834,USD,5.33
Real9,19000835,USD,5.33
Real9,19000836,USD,5.33
Real9,19000837,USD,5.33
Real9,19000838,USD,5.33
Real9,19000847,USD,25.34
Real9,19000804,USD,27.94
Real9,19000811,USD,1392.83
Real9,19000817,USD,5.25
Real9,19000848,USD,5.33
Real9,19000849,USD,5.33
Real9,19000853,USD,5.33
Real9,19000860,USD,0.74
Real9,19000872,USD,1751.12
Real9,19000882,USD,9.28
Real9,19000884,USD,13.06
Real9,19001401,USD,6.26
Real9,19002152,USD,51.9
Real9,19000901,USD,707.18
Real9,19002504,USD,926.98
Real9,19000912,USD,22.05
Real9,19000936,USD,23.18
Real9,19000939,USD,62.2
Real9,19000942,USD,2.21
Real9,19000966,USD,0.07
Real9,19001479,USD,0.25
Real9,19000989,USD,304.85
Real9,19001000,USD,0.81
Real9,19001011,USD,77.35
Real9,19002259,USD,248.56
Real9,19003552,USD,518.11
Real9,19001025,USD,149.45
Real9,19001026,USD,281.85
Real9,19001044,USD,20.27
Real9,19001045,USD,640.75
Real9,19001057,USD,1.75
Real9,19001062,USD,0.84
Real9,19001074,USD,1.16
Real9,19001077,USD,27.16
Real9,19001078,USD,12.85
Real9,19001083,USD,12.57
Real9,19001084,USD,241.25
Real9,19001087,USD,629.74
Real9,19001091,USD,3.85
Real9,19002855,USD,116.34
Real9,19001111,USD,0.07
Real9,19001112,USD,54.71
Real9,19001114,USD,70.66
Real9,19001125,USD,33.18
Real9,19001126,USD,195.58
Real9,19001140,USD,128.38
Real9,19001157,USD,15.23
Real9,19003419,USD,303.41
Real9,19001133,USD,3.5
Real9,19001138,USD,30.6
Real9,19002267,USD,4.06
Real9,19002724,USD,1.6
Real9,19002726,USD,4.0
Real9,19002729,USD,4.84
Real9,19002730,USD,1.68
Real9,19002731,USD,9.38
Real9,19002732,USD,4.4
Real9,19002733,USD,4.62
Real9,19002734,USD,7.92
Real9,19002959,USD,4.56
Real9,19002960,USD,3.44
Real9,19002961,USD,2.66
Real9,19002962,USD,2.52
Real9,19001145,USD,463.53
Real9,19001147,USD,176.71
Real9,19001196,USD,1.34
Real9,19001202,USD,2.38
Real9,19001533,USD,1.96
Real9,19003871,USD,0.28
Real9,19003957,USD,4.0
Real9,19001208,USD,14.0
Real9,19001211,USD,10.47
Real9,19001212,USD,0.21
Real9,19001218,USD,1.44
Real9,19001222,USD,49.95
Real9,19001224,USD,4.23
Real9,19001235,USD,1596.49
Real9,19001248,USD,5.33
Real9,19001249,USD,5.33
Real9,19001264,USD,5.6
Real9,19001279,USD,23.8
Real9,19001282,USD,13.02
Real9,19001284,USD,43.58
Real9,19001312,VND,3836284.65
Real9,19001316,USD,33.92
Real9,19001329,USD,0.16
Real9,19001330,USD,0.11
Real9,19001341,USD,22.4
Real9,19001372,USD,90.01
Real9,19001381,USD,34.27
Real9,19001421,USD,2.56
Real9,19001424,IDR,17832.02
Real9,19001439,USD,1.09
Real9,19001466,USD,31.12
Real9,19001475,USD,14.25
Real9,19001492,USD,0.77
Real9,19001493,USD,1.96
Real9,19001503,USD,21.65
Real9,19001505,USD,12.77
Real9,19001512,USD,5.33
Real9,19002312,USD,9.74
Real9,19003076,USD,0.7
Real9,19001530,USD,92.68
Real9,19001547,USD,0.57
Real9,19001554,USD,58.66
Real9,19001567,USD,0.04
Real9,19001570,USD,39.28
Real9,19001579,USD,27.59
Real9,19001586,USD,60.66
Real9,19002478,USD,68.89
Real9,19001587,USD,27.13
Real9,19001620,USD,0.87
Real9,19003322,USD,2.14
Real9,19001636,USD,29.92
Real9,19001640,USD,65.9
Real9,19001646,USD,20.3
Real9,19001669,USD,282.2
Real9,19001688,USD,11.79
Real9,19001715,USD,23.0
Real9,19001724,USD,0.11
Real9,19001734,USD,7.94
Real9,19001740,USD,4.27
Real9,19001749,USD,242.41
Real9,19001766,USD,1.78
Real9,19001777,USD,465.57
Real9,19001789,USD,118.99
Real9,19001799,USD,15.4
Real9,19001806,USD,662.37
Real9,19001812,USD,2.31
Real9,19001813,USD,128.28
Real9,19001815,USD,564.48
Real9,19001829,RUB,1232.27
Real9,19001833,USD,2.21
Real9,19001834,USD,0.56
Real9,19001842,USD,0.04
Real9,19001843,USD,9.2
Real9,19001845,USD,2.42
Real9,19001847,USD,19.27
Real9,19002779,USD,18.2
Real9,19001849,USD,7.95
Real9,19001863,USD,46.56
Real9,19001864,USD,0.22
Real9,19001865,USD,5.25
Real9,19001869,USD,2.38
Real9,19001884,USD,0.95
Real9,19001916,USD,7.74
Real9,19002852,USD,5.61
Real9,19003760,USD,6.9
Real9,19003770,USD,2.73
Real9,19003792,USD,1.51
Real9,19001892,USD,78.23
Real9,19001902,USD,37.81
Real9,19001904,USD,9.94
Real9,19001907,USD,15.26
Real9,19001932,USD,39.27
Real9,19001934,USD,164.51
Real9,19001939,USD,10.01
Real9,19001948,USD,16.63
Real9,19002041,USD,9.66
Real9,19001973,USD,24.71
Real9,19001982,USD,179.97
Real9,19001986,EUR,1.15
Real9,19002004,USD,0.39
Real9,19002010,THB,1288.31
Real9,19002395,THB,180.93
Real9,19004217,THB,91.59
Real9,19002011,USD,2.14
Real9,19002013,USD,18.41
Real9,19002014,USD,2.21
Real9,19002018,USD,7.6
Real9,19002020,USD,10.8
Real9,19002044,USD,19.32
Real9,19002045,USD,1525.13
Real9,19003436,USD,284.9
Real9,19002047,USD,5.99
Real9,19002063,USD,239.23
Real9,19002067,USD,454.09
Real9,19002070,USD,17.01
Real9,19002078,USD,4.55
Real9,19002081,USD,25.62
Real9,19004084,USD,2.14
Real9,19002089,USD,159.99
Real9,19002094,USD,37.63
Real9,19002101,USD,52.13
Real9,19002108,USD,280.42
Real9,19002111,USD,221.62
Real9,19002116,USD,16.28
Real9,19002133,USD,32.93
Real9,19002140,USD,2.32
Real9,19002141,USD,0.29
Real9,19002142,USD,157.95
Real9,19002148,USD,475.02
Real9,19002155,USD,1.68
Real9,19002160,USD,206.57
Real9,19003727,USD,9.73
Real9,19002162,USD,11.34
Real9,19002197,USD,103.14
Real9,19002696,USD,60.94
Real9,19002952,USD,42.71
Real9,19002204,USD,1.47
Real9,19002205,USD,50.75
Real9,19002206,USD,3413.54
Real9,19002209,USD,7.74
Real9,19002212,USD,0.64
Real9,19002222,USD,632.62
Real9,19002223,USD,0.84
Real9,19002225,USD,1.16
Real9,19002226,USD,86.94
Real9,19002230,USD,3.56
Real9,19002248,USD,1073.66
Real9,19002256,USD,24.57
Real9,19002344,USD,24.79
Real9,19002345,USD,24.71
Real9,19002261,USD,3.71
Real9,19002264,USD,6.82
Real9,19002276,USD,11.21
Real9,19002278,USD,24.33
Real9,19002282,USD,154.28
Real9,19002290,AUD,27.69
Real9,19002299,USD,0.78
Real9,19002304,USD,37.11
Real9,19002307,USD,577.04
Real9,19003056,USD,16.87
Real9,19002308,USD,34.87
Real9,19002311,USD,0.21
Real9,19002343,USD,87.12
Real9,19002333,USD,60.38
Real9,19002334,USD,8.9
Real9,19002339,USD,9.72
Real9,19002341,USD,3.22
Real9,19002350,USD,123.34
Real9,19002359,USD,78.44
Real9,19002364,USD,15.22
Real9,19003758,USD,179.63
Real9,19002377,USD,35.32
Real9,19002382,GBP,0.06
Real9,19002387,USD,1187.09
Real9,19003138,USD,385.84
Real9,19002402,CNY,26.35
Real9,19002405,USD,58.77
Real9,19002428,USD,0.07
Real9,19002430,USD,7.21
Real9,19002431,USD,1.02
Real9,19002444,USD,958.59
Real9,19002446,USD,3.5
Real9,19002448,USD,0.29
Real9,19002450,USD,2.0
Real9,19002461,USD,3.32
Real9,19002464,USD,39.03
Real9,19002484,USD,51.21
Real9,19002485,USD,44.31
Real9,19003468,USD,646.17
Real9,19002466,USD,508.2
Real9,19002477,USD,6.97
Real9,19002495,USD,108.95
Real9,19002509,USD,1193.15
Real9,19002512,USD,3.85
Real9,19002523,USD,21.7
Real9,19002524,USD,230.37
Real9,19002525,USD,19.6
Real9,19003247,USD,0.28
Real9,19003763,USD,23.83
Real9,19003769,USD,69.82
Real9,19002526,USD,449.05
Real9,19002539,USD,0.08
Real9,19002937,USD,8.55
Real9,19002540,USD,17.89
Real9,19002548,USD,0.18
Real9,19002673,USD,25.9
Real9,19002569,USD,4.73
Real9,19003831,USD,5.18
Real9,19003834,USD,0.92
Real9,19002570,USD,178.68
Real9,19002577,USD,15.76
Real9,19002580,USD,1773.38
Real9,19002583,USD,0.42
Real9,19002586,USD,78.89
Real9,19002595,USD,49.11
Real9,19002599,USD,10.99
Real9,19002600,USD,3.36
Real9,19002603,USD,25.24
Real9,19002604,USD,850.5
Real9,19003591,USD,486.5
Real9,19003917,USD,80.5
Real9,19004000,USD,223.02
Real9,19002608,USD,35.95
Real9,19002614,USD,3.18
Real9,19002616,USD,16.56
Real9,19002618,USD,14.98
Real9,19003563,USD,341.43
Real9,19003642,USD,55.44
Real9,19003644,USD,63.53
Real9,19003766,USD,72.7
Real9,19004062,USD,15.16
Real9,19004106,USD,2.2
Real9,19002629,USD,5.81
Real9,19002632,USD,616.66
Real9,19004189,USD,45.4
Real9,19002643,USD,2.45
Real9,19002646,USD,2.11
Real9,19002647,USD,63.63
Real9,19002651,USD,0.35
Real9,19002654,USD,39.27
Real9,19002655,USD,336.56
Real9,19002659,USD,363.93
Real9,19002674,USD,34.76
Real9,19002682,USD,2.31
Real9,19002684,USD,43.3
Real9,19002692,USD,5.36
Real9,19002693,USD,818.23
Real9,19002695,USD,219.76
Real9,19003989,USD,0.36
Real9,19002702,USD,14.0
Real9,19002703,USD,85.43
Real9,19002707,USD,308.8
Real9,19002713,USD,14.04
Real9,19002714,USD,0.18
Real9,19002735,USD,620.58
Real9,19002740,USD,31.86
Real9,19002746,USD,182.0
Real9,19003268,USD,1102.51
Real9,19002747,USD,14.11
Real9,19002750,USD,161.24
Real9,19002751,USD,542.5
Real9,19002760,USD,1010.66
Real9,19003499,USD,1310.93
Real9,19002764,USD,7.7
Real9,19002778,USD,97.03
Real9,19002920,USD,130.2
Real9,19002780,USD,20.71
Real9,19002784,USD,8.89
Real9,19002810,USD,8.86
Real9,19002814,USD,231.66
Real9,19002816,USD,7.38
Real9,19002818,USD,45.33
Real9,19002826,USD,2116.66
Real9,19002986,USD,3.92
Real9,19003189,USD,28.25
Real9,19003369,USD,48.58
Real9,19002834,VND,544788.08
Real9,19002842,USD,5.11
Real9,19002859,USD,178.56
Real9,19002865,USD,5.36
Real9,19002868,USD,8.67
Real9,19002870,USD,30.91
Real9,19002871,USD,65.17
Real9,19002872,USD,1351.28
Real9,19002873,USD,195.5
Real9,19002875,USD,23.1
Real9,19002878,USD,226.06
Real9,19002884,USD,19.6
Real9,19003345,USD,396.2
Real9,19003738,USD,30.8
Real9,19003924,USD,17.32
Real9,19004034,USD,35.0
Real9,19002890,USD,1.58
Real9,19002891,USD,21.28
Real9,19002892,USD,19.12
Real9,19002895,USD,12.57
Real9,19002896,IDR,167513.9
Real9,19002901,USD,9.1
Real9,19002908,USD,959.08
Real9,19002911,USD,24.54
Real9,19002921,USD,2.98
Real9,19002926,USD,23.45
Real9,19002930,USD,27.83
Real9,19002939,USD,218.01
Real9,19002942,USD,10.01
Real9,19002943,USD,220.7
Real9,19002970,USD,12.25
Real9,19002977,USD,0.22
Real9,19002982,CNY,11875.89
Real9,19003370,USD,4.26
Real9,19003789,USD,3.28
Real9,19002997,USD,12.63
Real9,19003611,USD,22.75
Real9,19003012,USD,24.96
Real9,19003013,USD,242.55
Real9,19003014,USD,204.47
Real9,19003018,USD,2371.25
Real9,19003019,USD,459.94
Real9,19003025,USD,376.25
Real9,19003026,USD,616.0
Real9,19003092,USD,78.05
Real9,19003120,USD,66.5
Real9,19003029,USD,215.95
Real9,19003032,USD,185.5
Real9,19003035,USD,26.94
Real9,19003036,USD,5.5
Real9,19003038,USD,125.52
Real9,19003041,USD,8.72
Real9,19003042,USD,28.16
Real9,19003049,USD,4.13
Real9,19003052,USD,50.27
Real9,19003062,USD,13.72
Real9,19003078,THB,9325.42
Real9,19003086,USD,500.68
Real9,19003091,THB,90.38
Real9,19003096,USD,2.8
Real9,19003101,USD,22.06
Real9,19003102,USD,11.44
Real9,19003103,USD,23.09
Real9,19003104,USD,22.5
Real9,19003105,USD,28.74
Real9,19003106,USD,62.3
Real9,19003107,USD,92.96
Real9,19003111,RUB,10994.69
Real9,19003113,GBP,1.32
Real9,19003117,USD,11.2
Real9,19003121,USD,1.27
Real9,19003125,USD,3.48
Real9,19003126,USD,99.37
Real9,19003131,USD,20.5
Real9,19003132,VND,90255.66
Real9,19003139,USD,15.05
Real9,19003143,USD,4.24
Real9,19003144,USD,0.35
Real9,19003148,USD,3.5
Real9,19003149,USD,32.38
Real9,19003153,USD,63.56
Real9,19003166,USD,105.7
Real9,19003293,USD,48.93
Real9,19003168,USD,1136.28
Real9,19003761,USD,237.93
Real9,19003172,USD,0.81
Real9,19003173,USD,4.41
Real9,19003184,USD,0.04
Real9,19003188,USD,85.75
Real9,19003200,USD,11.55
Real9,19003205,USD,45.85
Real9,19003219,USD,7.73
Real9,19003229,USD,0.14
Real9,19003376,USD,50.27
Real9,19003379,USD,12.06
Real9,19003231,USD,3303.65
Real9,19003235,USD,6.86
Real9,19003237,USD,34.52
Real9,19003238,USD,249.93
Real9,19003243,USD,54.57
Real9,19003482,USD,101.99
Real9,19003252,USD,0.08
Real9,19003253,USD,4.23
Real9,19003258,USD,10.5
Real9,19003276,USD,56.84
Real9,19003278,USD,121.54
Real9,19003283,USD,84.03
Real9,19003285,USD,0.32
Real9,19003289,USD,13.93
Real9,19003340,USD,9.73
Real9,19003292,USD,13.82
Real9,19003300,USD,2.24
Real9,19003301,USD,285.67
Real9,19003309,USD,447.41
Real9,19003314,USD,165.12
Real9,19003318,USD,34.51
Real9,19003327,USD,1.54
Real9,19003334,USD,252.32
Real9,19003614,USD,221.58
Real9,19003339,USD,1.9
Real9,19003342,USD,189.41
Real9,19003356,USD,27.31
Real9,19003358,USD,1.97
Real9,19003375,USD,139.19
Real9,19003377,USD,31.07
Real9,19003378,USD,351.81
Real9,19003386,USD,66.93
Real9,19003388,USD,1508.38
Real9,19003399,USD,10.15
Real9,19003414,USD,92.64
Real9,19003415,USD,111.26
Real9,19003452,USD,83.89
Real9,19004021,USD,10.61
Real9,19003416,USD,210.38
Real9,19003417,USD,58.8
Real9,19003420,USD,31.44
Real9,19003447,USD,3783.26
Real9,19003450,USD,150.85
Real9,19003455,USD,91.56
Real9,19003462,USD,34.55
Real9,19003464,USD,11.69
Real9,19003474,USD,2.38
Real9,19003475,INR,1326.06
Real9,19003476,USD,2.1
Real9,19003477,USD,58.18
Real9,19003480,USD,1.9
Real9,19003498,USD,16.73
Real9,19003586,USD,44.7
Real9,19004004,USD,2.38
Real9,19003500,USD,164.64
Real9,19003520,USD,36.79
Real9,19003508,USD,27.02
Real9,19003516,USD,8.72
Real9,19003517,USD,16.0
Real9,19003518,USD,24.61
Real9,19003618,USD,22.4
Real9,19003537,USD,1279.67
Real9,19003540,USD,6.19
Real9,19003543,USD,21.64
Real9,19003544,USD,4.06
Real9,19003545,USD,176.47
Real9,19003551,USD,0.74
Real9,19003554,USD,29.26
Real9,19003557,VND,764329.61
Real9,19003561,USD,65.88
Real9,19003562,USD,53.07
Real9,19003575,USD,4.13
Real9,19003592,USD,1.79
Real9,19003594,USD,45.68
Real9,19003610,USD,40.78
Real9,19003621,USD,9.91
Real9,19003626,USD,22.54
Real9,19003630,USD,66.91
Real9,19003632,USD,932.34
Real9,19003646,USD,15.18
Real9,19003648,USD,34.9
Real9,19003649,USD,1.68
Real9,19003652,USD,72.59
Real9,19003653,USD,12.14
Real9,19003657,USD,1505.0
Real9,19003671,USD,507.5
Real9,19003674,USD,92.61
Real9,19004166,USD,20.55
Real9,19003676,USD,108.85
Real9,19003686,USD,13.52
Real9,19003691,THB,2255.14
Real9,19003692,USD,995.89
Real9,19003697,USD,1.16
Real9,19003718,USD,31.71
Real9,19003726,USD,1.58
Real9,19003731,USD,101.16
Real9,19003737,USD,16.44
Real9,19003890,USD,14.6
Real9,19003743,USD,1.96
Real9,19003744,USD,3.86
Real9,19003750,USD,14.07
Real9,19003753,USD,255.21
Real9,19003754,USD,150.5
Real9,19003762,USD,2.83
Real9,19003764,USD,46.87
Real9,19003767,USD,49.57
Real9,19003771,USD,10.18
Real9,19004005,USD,1.92
Real9,19004091,USD,14.35
Real9,19004216,USD,3.5
Real9,19003775,USD,21.91
Real9,19003787,USD,316.74
Real9,19003790,USD,120.4
Real9,19003796,USD,34.24
Real9,19003802,VND,764329.52
Real9,19003806,USD,35.92
Real9,19003809,USD,166.58
Real9,19003813,IDR,60198.07
Real9,19003814,IDR,217431.39
Real9,19003857,IDR,66738.36
Real9,19003818,USD,29.12
Real9,19003830,USD,2.75
Real9,19003837,JPY,2453.65
Real9,19003856,USD,26.57
Real9,19003861,USD,62.83
Real9,19003875,USD,26.25
Real9,19003886,USD,15.81
Real9,19003909,USD,62.86
Real9,19003910,USD,287.7
Real9,19004012,USD,216.3
Real9,19003921,USD,26.47
Real9,19003922,USD,43.79
Real9,19003927,USD,0.07
Real9,19003929,USD,185.85
Real9,19003936,USD,4.19
Real9,19003950,USD,14.57
Real9,19003952,USD,24.86
Real9,19003953,VND,520394.6
Real9,19003959,USD,1.09
Real9,19003966,USD,4.45
Real9,19003970,USD,1.26
Real9,19003982,USD,86.1
Real9,19003983,USD,1.48
Real9,19004018,USD,33.85
Real9,19004024,USD,66.36
Real9,19004040,USD,32.17
Real9,19004044,USD,41.3
Real9,19004051,USD,6.3
Real9,19004059,USD,441.0
Real9,19004060,USD,367.5
Real9,19004064,USD,56.0
Real9,19004061,USD,255.5
Real9,19004070,USD,41.37
Real9,19004071,USD,12.29
Real9,19004082,USD,7.85
Real9,19004086,USD,11.4
Real9,19004097,USD,0.08
Real9,19004098,USD,53.2
Real9,19004110,USD,32.48
Real9,19004111,USD,36.4
Real9,19004114,USD,6.1
Real9,19004133,USD,16.66
Real9,19004134,USD,1.4
Real9,19004139,USD,8.19
Real9,19004142,USD,1.54
Real9,19004145,USD,42.5
Real9,19004146,USD,65.58
Real9,19004148,USD,7.0
Real9,19004153,USD,9.72
Real9,19004227,USD,0.36
Real9,19004156,THB,32.1
Real9,19004158,USD,42.38
Real9,19004159,USD,8.68
Real9,19004160,USD,0.07
Real9,19004165,USD,0.77
Real9,19004169,USD,31.5
Real9,19004180,USD,2.8
Real9,19004183,USD,3.85
Real9,19004184,USD,4.97
Real9,19004188,USD,182.42
Real9,19004202,USD,1.96
Real9,19004205,USD,0.45
Real9,19004210,USD,8.75
Real9,19004220,USD,7.84
