{
  "count": 286,
  "next": "http://api.my-events.site/api/v1/events/?limit=10&offset=11",
  "previous": "http://api.my-events.site/api/v1/events/?limit=10",
  "results": [
    {
      "id": 27,
      "provider": 1,
      "name": "My super cool event o",
      "uri": "https://www.eventbrite.com/e/wynwood-shop-wynwood-basel-week-2019-tickets-38448288867?aff=ebapi",
      "category": {
        "id": 8,
        "name": "Performing & Visual Arts",
        "provider": 1
      },
      "organizer": {
        "id": 21,
        "name": "Wynwood Shop",
        "uri": "",
        "logo_uri": "",
        "provider": 1
      },
      "start_time": "2019-12-05T20:00:00Z",
      "finish_time": "2019-12-09T02:00:00Z",
      "ticket_price_currency": "USD",
      "min_ticket_price": "2.0000",
      "max_ticket_price": "15.0000",
      "logo_uri": "https://img.evbuc.com/https%3A%2F%2Fcdn.evbuc.com%2Fimages%2F45639379%2F184205301796%2F1%2Foriginal.jpg?h=200&w=450&auto=compress&rect=121%2C0%2C948%2C474&s=58b6b581e5cb4470a7c72897fd81b572"
    },
    {
      "id": 71,
      "provider": 1,
      "name": "Baloon Festival",
      "uri": "https://www.eventbrite.com/e/charlestons-hot-air-balloon-festival-victory-cup-polo-match-tickets-53303033809?aff=ebapi",
      "category": {
        "id": 2,
        "name": "strin",
        "provider": 1
      },
      "organizer": {
        "id": 54,
        "name": "The Victory Cup",
        "uri": "",
        "logo_uri": "https://cdn.evbuc.com/images/32545955/211234311650/2/logo.jpg",
        "provider": 1
      },
      "start_time": "2019-10-18T20:00:00Z",
      "finish_time": "2019-10-20T01:00:00Z",
      "ticket_price_currency": "USD",
      "min_ticket_price": "22.0000",
      "max_ticket_price": "555.0000",
      "logo_uri": "https://img.evbuc.com/https%3A%2F%2Fcdn.evbuc.com%2Fimages%2F53546967%2F211234311650%2F1%2Foriginal.jpg?h=200&w=450&auto=compress&rect=0%2C49%2C960%2C480&s=2f6ffcd7ee69cb4ad6f919f2e8ec4333"
    },
    {
      "id": 15,
      "provider": 1,
      "name": "Fair me",
      "uri": "https://www.eventbrite.com/e/kopa-hus-utomlands-stockholm-registrering-5131538570?aff=ebapi",
      "category": {
        "id": 5,
        "name": "Home & Lifestyle",
        "provider": 1
      },
      "organizer": {
        "id": 12,
        "name": "Fair Media International AB",
        "uri": "",
        "logo_uri": "",
        "provider": 1
      },
      "start_time": "2019-10-12T08:30:00Z",
      "finish_time": "2019-10-13T15:00:00Z",
      "ticket_price_currency": "CAD",
      "min_ticket_price": "1.0000",
      "max_ticket_price": "5.5000",
      "logo_uri": "https://img.evbuc.com/https%3A%2F%2Fcdn.evbuc.com%2Fimages%2F940078%2F40398062694%2F1%2Foriginal.png?h=200&w=450&auto=compress&s=8a6fdcff8d0e53e216d628dc5a3b225f"
    },
    {
      "id": 6,
      "provider": 1,
      "name": "9th Annual Atlanta Hip Hop Day Festival",
      "uri": "https://www.eventbrite.com/e/9th-annual-atlanta-hip-hop-day-festival-tickets-1880852681?aff=ebapi",
      "category": {
        "id": 1,
        "name": "Music",
        "provider": 1
      },
      "organizer": {
        "id": 6,
        "name": "M.C. W.A.R. Promotions, LLC",
        "uri": "",
        "logo_uri": "https://cdn.evbuc.com/images/140493/6719790553/1/logo.png",
        "provider": 1
      },
      "start_time": "2019-10-05T15:00:00Z",
      "finish_time": "2019-10-07T01:00:00Z",
      "ticket_price_currency": "USD",
      "min_ticket_price": "1.0000",
      "max_ticket_price": "2500.0000",
      "logo_uri": "https://img.evbuc.com/https%3A%2F%2Fcdn.evbuc.com%2Fimages%2F49161728%2F6719790553%2F1%2Foriginal.png?h=200&w=450&auto=compress&s=27417a016349b3ff2b59bbd128735496"
    },
    {
      "id": 47,
      "provider": 1,
      "name": "Köpa Hus Utomlands - Malmö 33",
      "uri": "https://www.eventbrite.com/e/kopa-hus-utomlands-malmo-registrering-5132248694?aff=ebapi",
      "category": {
        "id": 13,
        "name": "Other",
        "provider": 1
      },
      "organizer": {
        "id": 12,
        "name": "Fair Media International AB",
        "uri": "",
        "logo_uri": "",
        "provider": 1
      },
      "start_time": "2019-09-28T08:30:00Z",
      "finish_time": "2019-09-29T15:00:00Z",
      "ticket_price_currency": "USD",
      "min_ticket_price": "3.0000",
      "max_ticket_price": "55.0000",
      "logo_uri": "https://img.evbuc.com/https%3A%2F%2Fcdn.evbuc.com%2Fimages%2F940528%2F40398062694%2F1%2Foriginal.png?h=200&w=450&auto=compress&s=99faf9e6699d78016d0d2acb9617e315"
    },
    {
      "id": 139,
      "provider": 1,
      "name": "schauinsland Muddy Angel Run2 - KÖLN Samstag",
      "uri": "https://www.eventbrite.co.uk/e/schauinsland-muddy-angel-run-koln-samstag-2019-tickets-49644758810?aff=ebapi",
      "category": {
        "id": 7,
        "name": "Sports & Fitness",
        "provider": 1
      },
      "organizer": {
        "id": 49,
        "name": "Muddy Angel Run",
        "uri": "",
        "logo_uri": "https://cdn.evbuc.com/images/19856198/171015311682/2/logo.png",
        "provider": 1
      },
      "start_time": "2019-09-20T22:01:00Z",
      "finish_time": "2019-10-22T01:01:00Z",
      "ticket_price_currency": "EUR",
      "min_ticket_price": "1.0000",
      "max_ticket_price": "53.7800",
      "logo_uri": "https://img.evbuc.com/https%3A%2F%2Fcdn.evbuc.com%2Fimages%2F55506863%2F171015311682%2F1%2Foriginal.20190122-090114?h=200&w=450&auto=compress&rect=0%2C5%2C500%2C250&s=637fd6d75c95f485e21af610fe017f04"
    },
    {
      "id": 113,
      "provider": 1,
      "name": "BMW PGA CHAMPIONSHIP 2020",
      "uri": "https://www.eventbrite.co.uk/e/bmw-pga-championship-2019-tickets-45768846853?aff=ebapi",
      "category": {
        "id": 7,
        "name": "Sports & Fitness",
        "provider": 1
      },
      "organizer": {
        "id": 99,
        "name": "European Tour ",
        "uri": "",
        "logo_uri": "https://cdn.evbuc.com/images/21538583/162320622939/2/logo.jpg",
        "provider": 1
      },
      "start_time": "2019-09-18T07:00:00Z",
      "finish_time": "2019-09-22T18:00:00Z",
      "ticket_price_currency": "GBP",
      "min_ticket_price": "10.0000",
      "max_ticket_price": "110.0000",
      "logo_uri": "https://img.evbuc.com/https%3A%2F%2Fcdn.evbuc.com%2Fimages%2F44392577%2F162320622939%2F1%2Foriginal.jpg?h=200&w=450&auto=compress&rect=0%2C100%2C400%2C200&s=098b5f8d14f9f49b74a156afbb83d0aa"
    },
    {
      "id": 117,
      "provider": 1,
      "name": "Cheam Celebration of Food test edit",
      "uri": "https://www.eventbrite.co.uk/e/cheam-celebration-of-food-drink-tickets-50486711112?aff=ebapi",
      "category": {
        "id": 2,
        "name": "strin",
        "provider": 1
      },
      "organizer": {
        "id": 105,
        "name": "Cheam Celebration of Food & Drink",
        "uri": "",
        "logo_uri": "",
        "provider": 1
      },
      "start_time": "2019-09-15T09:00:00Z",
      "finish_time": "2019-09-15T18:00:00Z",
      "ticket_price_currency": "GBP",
      "min_ticket_price": "2.0000",
      "max_ticket_price": "21.0000",
      "logo_uri": "https://img.evbuc.com/https%3A%2F%2Fcdn.evbuc.com%2Fimages%2F50106278%2F272951921780%2F1%2Foriginal.jpg?h=200&w=450&auto=compress&rect=0%2C64%2C2048%2C1024&s=dd7860b2a5dcdd0bc39e30df3c31b60c"
    },
    {
      "id": 19,
      "provider": 1,
      "name": "Köpa Hus Utomlands - Göteborg",
      "uri": "https://www.eventbrite.com/e/kopa-hus-utomlands-goteborg-registrering-5132048094?aff=ebapi",
      "category": null,
      "organizer": {
        "id": 12,
        "name": "Fair Media International AB",
        "uri": "",
        "logo_uri": "",
        "provider": 1
      },
      "start_time": "2019-09-14T08:30:00Z",
      "finish_time": "2019-09-15T15:00:00Z",
      "ticket_price_currency": "USD",
      "min_ticket_price": "0.0000",
      "max_ticket_price": "0.0000",
      "logo_uri": "https://img.evbuc.com/https%3A%2F%2Fcdn.evbuc.com%2Fimages%2F940374%2F40398062694%2F1%2Foriginal.png?h=200&w=450&auto=compress&s=3e4880f15767d3389a2b5b1db9c3475e"
    },
    {
      "id": 145,
      "provider": 1,
      "name": "XLETIX Challenge - NORDDEUTSCHLAND Samstag 2019",
      "uri": "https://www.eventbrite.de/e/xletix-challenge-norddeutschland-samstag-2019-tickets-49642652510?aff=ebapi",
      "category": {
        "id": 7,
        "name": "Sports & Fitness",
        "provider": 1
      },
      "organizer": {
        "id": 132,
        "name": "XLETIX GmbH",
        "uri": "",
        "logo_uri": "https://cdn.evbuc.com/images/13006864/78928072919/2/logo.jpg",
        "provider": 1
      },
      "start_time": "2019-09-13T22:01:00Z",
      "finish_time": "2019-10-19T01:01:00Z",
      "ticket_price_currency": "EUR",
      "min_ticket_price": "26.8800",
      "max_ticket_price": "93.0600",
      "logo_uri": "https://img.evbuc.com/https%3A%2F%2Fcdn.evbuc.com%2Fimages%2F49980884%2F78928072919%2F1%2Foriginal.jpg?h=200&w=450&auto=compress&rect=0%2C258%2C2000%2C1000&s=29dab532e88551d346fcc05124237e89"
    }
  ]
}