{
	"info": {
		"_postman_id": "b82af154-bf05-426b-8e96-0203aa479e95",
		"name": "spring-security",
		"schema": "https://schema.getpostman.com/json/collection/v2.1.0/collection.json"
	},
	"item": [
		{
			"name": "http://localhost:9090/sign-up",
			"request": {
				"method": "POST",
				"header": [
					{
						"key": "Content-Type",
						"value": "application/json"
					}
				],
				"body": {
					"mode": "raw",
					"raw": "{\n\t\"username\": \"Dmitry\",\n\t\"email\": \"dmitry.v.gavrilenko@gmail.com\",\n\t\"password\": \"test\",\n\t\"authority\": \"ROLE_ADMIN\"\n\t\n}"
				},
				"url": {
					"raw": "http://localhost:9090/sign-up",
					"protocol": "http",
					"host": [
						"localhost"
					],
					"port": "9090",
					"path": [
						"sign-up"
					]
				}
			},
			"response": []
		},
		{
			"name": "http://localhost:9090/sign-in",
			"request": {
				"method": "POST",
				"header": [
					{
						"key": "Content-Type",
						"value": "application/json"
					}
				],
				"body": {
					"mode": "raw",
					"raw": "{\n\t\"username\": \"Dmitry\",\n\t\"email\": \"dmitry.v.gavrilenko@gmail.com\",\n\t\"password\": \"test\",\n\t\"authority\": \"ROLE_ADMIN\"\n\t\n}"
				},
				"url": {
					"raw": "http://localhost:9090/sign-in",
					"protocol": "http",
					"host": [
						"localhost"
					],
					"port": "9090",
					"path": [
						"sign-in"
					]
				}
			},
			"response": []
		},
		{
			"name": "http://localhost:9090/user-info",
			"request": {
				"method": "POST",
				"header": [
					{
						"key": "Authorization",
						"value": "eyJhbGciOiJIUzUxMiJ9.eyJleHAiOjE1NDcxMzExMjAsIm5hbWUiOiJEbWl0cnkiLCJlbWFpbCI6ImRtaXRyeS52LmdhdnJpbGVua29AZ21haWwuY29tIiwiYXV0aG9yaXR5IjoiUk9MRV9BRE1JTiJ9.Uk8UrTHa5bh-DXQ3Jy3TWaV8lby0Zagwo5FY_acohxwsszggRNXaKcMQOvQD6EZ3KQZleVw4aqDB_3M4GdDlSw"
					},
					{
						"key": "Content-Type",
						"value": "application/json"
					}
				],
				"body": {
					"mode": "raw",
					"raw": "{\n\t\"username\": \"Dmitry\",\n\t\"email\": \"dmitry.v.gavrilenko@gmail.com\",\n\t\"password\": \"test\",\n\t\"authority\": \"ROLE_ADMIN\"\n\t\n}"
				},
				"url": {
					"raw": "http://localhost:9090/user-info",
					"protocol": "http",
					"host": [
						"localhost"
					],
					"port": "9090",
					"path": [
						"user-info"
					]
				}
			},
			"response": []
		}
	]
}