[
  {
    "key": "R060000000",
    "id": "2116",
    "name": "BABY BURRITO BOWL",
    "summary": "Unsere Burrito Bowl für Babys enthält neben Süßkartoffel und Vollkornreis schwarze Bohnen. Hierzulande ist die schwarze Bohne kaum auf einem Speiseplan zu finden. Dabei steckt sie voller Protein und Eisen und hat einen schönen würzig-nussigen Geschmack.",
    "servings": {
      "count": "1",
      "unit": "KIND"
    },
    "time": {
      "prepTime": "5",
      "cookTime": "20",
      "totalTime": "25",
      "customTime": "0",
      "customTimeLabel": ""
    },
    "equipment": [
      "Mixer / Pürierstab",
      "Dampfgarer oder Dampfgareinsatz"
    ],
    "ingredientSets": [
      {
        "name": "",
        "ingredients": [
          {
            "name": "gekochte schwarze Bohnen",
            "amount": "20",
            "unit": "g",
            "notes": "(Schwarze Bohnen nach Packungsbeilage eingeweicht und gekocht. Alternativ können auch vorgekochte schwarze Bohnen genommen werden)"
          },
          {
            "name": "Süßkartoffel",
            "amount": "100",
            "unit": "g",
            "notes": ""
          },
          {
            "name": "Baby Instant Vollkornreis",
            "amount": "2",
            "unit": "EL",
            "notes": "(ca. 25 g)"
          },
          {
            "name": "Orangensaft",
            "amount": "1-2",
            "unit": "TL",
            "notes": "(Für den Babybrei verwenden wir immer frische Orangen)"
          },
          {
            "name": "Leinöl",
            "amount": "1",
            "unit": "EL",
            "notes": "(mit DHA und EPA angereichert)"
          },
          {
            "name": "Noriflocken",
            "amount": "1",
            "unit": "Msp.",
            "notes": ""
          },
          {
            "name": "Wasser",
            "amount": "50",
            "unit": "ml",
            "notes": ""
          }
        ]
      }
    ],
    "instructionSets": [
      {
        "name": "",
        "instructions": [
          "Süßkartoffel schälen und klein schneiden.",
          "Dann die Süßkartoffel ca. 20 Minuten weichgaren.",
          "Danach Süßkartoffel mit 50 ml Garflüssigkeit und gekochten schwarze Bohnen pürieren. 2 EL Baby Instantreis unterrühren.",
          "Frischen Orangensaft, Noriflocken und Leinöl unterrühren."
        ]
      }
    ],
    "imageUrl": "https://nutrilini.com/wp-content/uploads/2022/07/nutrilini.incode-systems.com-baby-burrito-bowl.jpg",
    "videoUrl": "",
    "notes": ""
  },
  {
    "key": "R060000021",
    "id": "2193",
    "name": "BABY POPEYE BOWL",
    "summary": "Die Baby Popeye Bowl ist unsere Beikost-Varinate der gebratenen Reisnudeln Popeye mit Tofu. Diese kleine Brei-Bowl enthält Apfel, Blumenkohl, Tofu, Spinat, Nori-Alge und Zitrone und verleiht echte Seemannskräfte. Dabei sind hier fast die gleichen Zutaten wie in der Variante für die Großen drin. Das macht die Zubereitung einfacher und Mama und Baby können das gleiche Geschmackserlebnis teilen.",
    "servings": {
      "count": "1",
      "unit": "KIND"
    },
    "time": {
      "prepTime": "5",
      "cookTime": "15",
      "totalTime": "0",
      "customTime": "0",
      "customTimeLabel": ""
    },
    "equipment": [
      "Mixer / Pürierstab",
      "Dampfgarer oder Dampfgareinsatz"
    ],
    "ingredientSets": [
      {
        "name": "",
        "ingredients": [
          {
            "name": "Apfel",
            "amount": "40",
            "unit": "g",
            "notes": ""
          },
          {
            "name": "Blumenkohl",
            "amount": "80",
            "unit": "g",
            "notes": ""
          },
          {
            "name": "Babyspinat",
            "amount": "20",
            "unit": "g",
            "notes": ""
          },
          {
            "name": "Tofu",
            "amount": "20",
            "unit": "g",
            "notes": "(gerne Seidentofu, ungewürzt.)"
          },
          {
            "name": "Instant Reisflocken oder gekochte Reisnudeln",
            "amount": "25",
            "unit": "g",
            "notes": "(für die größeren Babys kochen wir Reisnudeln damit wir den Brei schön stückig bekommen)"
          },
          {
            "name": "Zitrone / Limette",
            "amount": "¼",
            "unit": "TL",
            "notes": ""
          },
          {
            "name": "Nori-Alge klein geschreddert",
            "amount": "1",
            "unit": "Msp.",
            "notes": ""
          },
          {
            "name": "Wasser",
            "amount": "50",
            "unit": "ml",
            "notes": ""
          },
          {
            "name": "Leinöl",
            "amount": "1",
            "unit": "EL",
            "notes": "(mit DHA und EPA angereichert)"
          }
        ]
      }
    ],
    "instructionSets": [
      {
        "name": "",
        "instructions": [
          "Alle Zutaten (außer Reisnudeln / Instant Reisflocken und Nori-Algen) stückig schneiden und 15 Minuten dampfgaren.",
          "Ggf. Reisnudeln nach Packungsanleitung kochen.",
          "Eventuell ein paar Blumenkohlröschen als Fingerfood separieren.",
          "Gemüse, Apfel, Tofu, Nori-Algen, Zitronensaft mit der Garflüssigkeit (ca 50 ml), Instantflocken bzw. Reisnudeln zusammenmischen und alles pürieren.",
          "Nachdem der Brei etwas abgekühlt ist, Leinöl unterrühren."
        ]
      }
    ],
    "imageUrl": "https://nutrilini.com/wp-content/uploads/2020/06/Spinat_Blumenkohl_Tofu_Brei_nutrilini.jpeg",
    "videoUrl": "",
    "notes": ""
  },
  {
    "key": "R060100020",
    "id": "2191",
    "name": "HASELNUSS ERDBEERE HAFER ODER HIRSE PORRIDGE - VEGAN",
    "summary": "Unser Haselnuss-Erdbeer-Porridge enthält viel gute Energie und Nährstoffe, die Euer Kleines für den Start in den Tag braucht. Dabei schmeckt der fruchtig-nussige Brei mit Erdbeeren und Haselnuss herrlich nach Sommer. Ihr könnt das Porridge je nach Geschmack mit Haferflocken zubereiten oder auch mit Hirseflocken.",
    "servings": {
      "count": "1",
      "unit": "KIND"
    },
    "time": {
      "prepTime": "5",
      "cookTime": "0",
      "totalTime": "5",
      "customTime": "0",
      "customTimeLabel": ""
    },
    "equipment": [],
    "ingredientSets": [
      {
        "name": "",
        "ingredients": [
          {
            "name": "Erdbeeren",
            "amount": "2",
            "unit": "",
            "notes": "(ca. 30 g)"
          },
          {
            "name": "Haselnussmus",
            "amount": "1",
            "unit": "TL",
            "notes": ""
          },
          {
            "name": "Instant Hafer- oder Hirseflocken",
            "amount": "20",
            "unit": "g",
            "notes": ""
          },
          {
            "name": "Haferdrink",
            "amount": "200",
            "unit": "ml",
            "notes": "(mit Calcium und B2 angereichert)"
          }
        ]
      }
    ],
    "instructionSets": [
      {
        "name": "",
        "instructions": [
          "Instant Flocken nach Packungsbeilage mit Haferdrink anrühren.",
          "Haselnussmus unterrühren.",
          "Erdbeeren kleinschneiden und unterrühren."
        ]
      }
    ],
    "imageUrl": "https://nutrilini.com/wp-content/uploads/2022/05/Haselnuss-Erdbeer-Porridge_Beikost.jpg",
    "videoUrl": "",
    "notes": ""
  },
  {
    "key": "R060500006",
    "id": "1517",
    "name": "PASTINAKEN SPINAT BREI - BEIKOSTSTART",
    "summary": "Der Brei aus Pastinake und Spinat ist einer von Babys Lieblingsbreien. Denn die Pastinake schmeckt süßlich-würzig und ist so eines von Babys Lieblingsgemüsen. Der Spinat gibt dem Brei eine tolle Farbe und bringt jede Menge wichtige Nährstoffe mit.",
    "servings": {
      "count": "1",
      "unit": "KIND"
    },
    "time": {
      "prepTime": "5",
      "cookTime": "7",
      "totalTime": "12",
      "customTime": "0",
      "customTimeLabel": ""
    },
    "equipment": [
      "Dampfgareinsatz",
      "Pürierstab",
      "Thermomix"
    ],
    "ingredientSets": [
      {
        "name": "",
        "ingredients": [
          {
            "name": "Pastinake",
            "amount": "20",
            "unit": "g",
            "notes": ""
          },
          {
            "name": "Demeter Spinat",
            "amount": "20",
            "unit": "g",
            "notes": ""
          },
          {
            "name": "der Garflüssigkeit",
            "amount": "15",
            "unit": "ml",
            "notes": ""
          },
          {
            "name": "Rapsöl",
            "amount": "½",
            "unit": "TL",
            "notes": ""
          }
        ]
      }
    ],
    "instructionSets": [
      {
        "name": "",
        "instructions": [
          "Pastinake schälen und schneiden.",
          "Spinat waschen.",
          "Pastinakenstücke im Dampfgareinsatz mit Wasser dämpfen oder mit wenig Wasser köcheln, nach 4 Minuten Spinat hinzugeben und weitere 3 Minuten dämpfen.",
          "Gemüse mit ca. 15 ml Garflüssigkeit (bei Bedarf auch etwas mehr oder weniger) pürieren.",
          "Nachdem der Brei etwas abgekühlt ist, Rapsöl unterrühren."
        ]
      },
      {
        "name": "Zubereitung mit dem Thermomix",
        "instructions": [
          "Pastinake schälen und Spinat waschen.",
          "Pastinake im Mixtopf 7 sec. auf Stufe 5 zerkleinern.",
          "Anschließend Pastinakenstückchen in den Varomaaufsatz geben und 200 ml Wasser in den Mixtopf füllen.",
          "Die Pastinake auf Varoma und Stufe 1 für 10 min. garen. Danach den Spinat hinzugeben und weitere 4 min. garen.",
          "Dann den Varoma-Einsatz abnehmen und die Garflüssigkeit in eine Schüssel umfüllen. Anschließend die Gemüsemischung wieder in den Mixtopf geben und etwas Garflüssigkeit hinzufügen.",
          "Alle Zutaten 60 sec. lang auf Stufe 10 zu einem feinen Gemüsebrei pürieren.",
          "Zum Schluss Brei in ein Schüsselchen füllen und Rapsöl unterrühren."
        ]
      }
    ],
    "imageUrl": "https://nutrilini.com/wp-content/uploads/2020/04/Pastinaken-SPinat-Brei-nutrilini.jpg",
    "videoUrl": "",
    "notes": "Einfrieren: nicht ideal wegen Nitritbildung. Auch bereits gekochter Spinat kann eingefroren werden. Hier ist es nur enorm wichtig, dass Du den Spinat schnell zum Abkühlen bringst und ihn dann sofort einfrierst. Schnell deshalb, weil Bakterien bei Zimmertemperatur das in dem Spinat enthaltene Nitrat in das giftige Nitrit umwandeln."
  },
  {
    "key": "R060300006",
    "id": "4885",
    "name": "PASTINAKEN SPINAT BREI - ALS SNACK FÜR GRÖßERE BABYS",
    "summary": "Der Brei aus Pastinake und Spinat ist einer von Babys Lieblingsbreien. Denn die Pastinake schmeckt süßlich-würzig und ist so eines von Babys Lieblingsgemüsen. Der Spinat gibt dem Brei eine tolle Farbe und bringt jede Menge wichtige Nährstoffe mit.",
    "servings": {
      "count": "1",
      "unit": "KIND"
    },
    "time": {
      "prepTime": "5",
      "cookTime": "7",
      "totalTime": "12",
      "customTime": "0",
      "customTimeLabel": ""
    },
    "equipment": [
      "Dampfgareinsatz",
      "Pürierstab",
      "Thermomix"
    ],
    "ingredientSets": [
      {
        "name": "",
        "ingredients": [
          {
            "name": "Pastinake",
            "amount": "50",
            "unit": "g",
            "notes": ""
          },
          {
            "name": "Demeter Spinat",
            "amount": "50",
            "unit": "g",
            "notes": ""
          },
          {
            "name": "der Garflüssigkeit",
            "amount": "50",
            "unit": "ml",
            "notes": ""
          },
          {
            "name": "Rapsöl",
            "amount": "1",
            "unit": "TL",
            "notes": ""
          }
        ]
      }
    ],
    "instructionSets": [
      {
        "name": "",
        "instructions": [
          "Pastinake schälen und schneiden.",
          "Spinat waschen.",
          "Pastinakenstücke im Dampfgareinsatz mit Wasser dämpfen oder mit wenig Wasser köcheln, nach 4 Minuten Spinat hinzugeben und weitere 3 Minuten dämpfen.",
          "Gemüse mit ca. 50 ml Garflüssigkeit (je nach Bedarf auch etwas mehr oder weniger) pürieren.",
          "Nachdem der Brei etwas abgekühlt ist, Rapsöl unterrühren."
        ]
      },
      {
        "name": "Zubereitung mit dem Thermomix",
        "instructions": [
          "Pastinake schälen und Spinat waschen.",
          "Pastinake im Mixtopf 7 sec. auf Stufe 5 zerkleinern.",
          "Anschließend Pastinakenstückchen in den Varomaaufsatz geben und 200 ml Wasser in den Mixtopf füllen.",
          "Die Pastinake auf Varoma und Stufe 1 für 10 min. garen. Danach den Spinat hinzugeben und weitere 4 min. garen.",
          "Dann den Varoma-Einsatz abnehmen und die Garflüssigkeit in eine Schüssel umfüllen. Anschließend die Gemüsemischung wieder in den Mixtopf geben und etwas Garflüssigkeit hinzufügen.",
          "Alle Zutaten 60 sec. lang auf Stufe 10 zu einem feinen Gemüsebrei pürieren.",
          "Zum Schluss Brei in ein Schüsselchen füllen und Rapsöl unterrühren."
        ]
      }
    ],
    "imageUrl": "https://nutrilini.com/wp-content/uploads/2020/04/Pastinaken-SPinat-Brei-nutrilini.jpg",
    "videoUrl": "",
    "notes": "Einfrieren: nicht ideal wegen Nitritbildung. Auch bereits gekochter Spinat kann eingefroren werden. Hier ist es nur enorm wichtig, dass Du den Spinat schnell zum Abkühlen bringst und ihn dann sofort einfrierst. Schnell deshalb, weil Bakterien bei Zimmertemperatur das in dem Spinat enthaltene Nitrat in das giftige Nitrit umwandeln."
  },
  {
    "key": "R060600018",
    "id": "1826",
    "name": "KARTOFFEL ROTE BEETE BREI - BEIKOSTSTART",
    "summary": "Der Brei aus Kartoffel und Rote Beete ist ein echter Hingucker in puncto Farbe. Dabei schmeckt er auch durch die milde Süße der Kartoffel und der Roten Beete den Kleinsten und ist dabei gut verdaulich.",
    "servings": {
      "count": "1",
      "unit": "KIND"
    },
    "time": {
      "prepTime": "5",
      "cookTime": "10",
      "totalTime": "15",
      "customTime": "0",
      "customTimeLabel": ""
    },
    "equipment": [
      "Mixer / Pürierstab",
      "Dampfgarer oder Dampfgareinsatz"
    ],
    "ingredientSets": [
      {
        "name": "",
        "ingredients": [
          {
            "name": "Kartoffel",
            "amount": "50",
            "unit": "g",
            "notes": ""
          },
          {
            "name": "Rote Beete",
            "amount": "100",
            "unit": "g",
            "notes": ""
          },
          {
            "name": "Leinöl",
            "amount": "1",
            "unit": "EL",
            "notes": "(mit DHA und EPA angereichert)"
          },
          {
            "name": "Wasser",
            "amount": "50",
            "unit": "ml",
            "notes": "(Garflüssigkeit)"
          }
        ]
      }
    ],
    "instructionSets": [
      {
        "name": "",
        "instructions": [
          "Kartoffel und Rote Beete schälen und klein schneiden.",
          "Gemüsestücke im Dampfgareinsatz mit Wasser 10-15 Minuten dämpfen. Ohne Dampfgareinsatz in einem Topf mit wenig Wasser bei niedriger Hitze 10-15 Minuten dünsten.",
          "Gegarte Kartoffel und Rote Beete mit Garflüssigkeit pürieren.",
          "Nachdem der Brei etwas abgekühlt ist, Leinöl unterrühren."
        ]
      }
    ],
    "imageUrl": "https://nutrilini.com/wp-content/uploads/2020/04/DSC00808.jpg",
    "videoUrl": "https://youtu.be/wMDvGAl65k8",
    "notes": ""
  },
  {
    "key": "R060000015",
    "id": "1811",
    "name": "KOHLRABI KARTOFFEL HAFERFLOCKEN BREI",
    "summary": "Dieser Brei eignet sich für Babys ab 6 Monaten. Auch wenn die Kombination vielleicht ungewöhnlich klingt. Unsere Kleinen sind von Konsistenz und Geschmack überzeugt und mögen den Brei.",
    "servings": {
      "count": "1",
      "unit": "KIND"
    },
    "time": {
      "prepTime": "5",
      "cookTime": "15",
      "totalTime": "20",
      "customTime": "0",
      "customTimeLabel": ""
    },
    "equipment": [
      "Mixer / Pürierstab",
      "Dampfgarer oder Dampfgareinsatz"
    ],
    "ingredientSets": [
      {
        "name": "",
        "ingredients": [
          {
            "name": "Kohlrabi",
            "amount": "100",
            "unit": "g",
            "notes": ""
          },
          {
            "name": "Kartoffel",
            "amount": "50",
            "unit": "g",
            "notes": ""
          },
          {
            "name": "Haferflocken",
            "amount": "20",
            "unit": "g",
            "notes": ""
          },
          {
            "name": "Leinöl",
            "amount": "1",
            "unit": "EL",
            "notes": "(mit DHA und EPA angereichert)"
          },
          {
            "name": "Noriflocken",
            "amount": "1",
            "unit": "Msp.",
            "notes": ""
          },
          {
            "name": "Wasser",
            "amount": "50",
            "unit": "ml",
            "notes": "(Garflüssigkeit)"
          },
          {
            "name": "Apfelsaft",
            "amount": "5",
            "unit": "ml",
            "notes": ""
          }
        ]
      }
    ],
    "instructionSets": [
      {
        "name": "",
        "instructions": [
          "Kohlrabi und Kartoffeln schälen und klein schneiden.",
          "Dann Gemüsestücke im Dampfgareinsatz mit Wasser dämpfen oder mit wenig Wasser in eim Topf auf niedriger Hitze dünsten. Die Kochzeit variiert je nach Gemüsesorte. Kartoffeln brauchen 10-15 Minuten, der Kohlrabi 8-10 Minuten.",
          "Das gegarte Gemüse mit 50 ml Garflüssigkeit (je nach Bedarf auch weniger oder mehr), den Haferflocken und dem Apfelsaft pürieren.",
          "Wenn der Brei etwas abgekühlt ist, Noriflocken und Leinöl unterrühren."
        ]
      }
    ],
    "imageUrl": "https://nutrilini.com/wp-content/uploads/2020/04/DSC00667.jpg",
    "videoUrl": "https://youtu.be/Z6uet3qTbZI",
    "notes": ""
  },
  {
    "key": "R060400017",
    "id": "1821",
    "name": "BIRNE HAFERFLOCKEN BREI",
    "summary": "Unser Birne Haferflocken Brei ist unser Einstieg in die Obst-Getreide-Breie. Die Birne ist gemeinsam mit dem Apfel eine der ersten Obstsorten, mit denen Babys Bekanntschaft machen. Die Birne gibt dem Brei eine mild Süße, die Haferflocken Sämigkeit. Unsere Kleinen sind überzeugt.",
    "servings": {
      "count": "1",
      "unit": "KIND"
    },
    "time": {
      "prepTime": "5",
      "cookTime": "6",
      "totalTime": "11",
      "customTime": "0",
      "customTimeLabel": ""
    },
    "equipment": [
      "Mixer / Pürierstab",
      "Dampfgareinsatz / Dampfgarer"
    ],
    "ingredientSets": [
      {
        "name": "",
        "ingredients": [
          {
            "name": "Birne",
            "amount": "150",
            "unit": "g",
            "notes": ""
          },
          {
            "name": "Haferflocken",
            "amount": "20",
            "unit": "g",
            "notes": ""
          },
          {
            "name": "Wasser",
            "amount": "50",
            "unit": "ml",
            "notes": "(Garflüssigkeit)"
          },
          {
            "name": "Rapsöl",
            "amount": "1",
            "unit": "TL",
            "notes": ""
          }
        ]
      }
    ],
    "instructionSets": [
      {
        "name": "",
        "instructions": [
          "Birne waschen, schälen und in Stücke schneiden.",
          "Birnenstücke im Dampfgareinsatz 6 min. mit Wasser dämpfen. Ohne Dampfgareinsatz Birne in einem Topf mit etwas Wasser bei niedriger Hitze 6 min. dünsten.",
          "Anschließend Birne mit Haferflocken und 50 ml Garwasser (je nach Bedarf etwas weniger oder mehr) pürieren.",
          "Nachdem der Brei etwas abgekühlt ist, Rapsöl unterrühren."
        ]
      }
    ],
    "imageUrl": "https://nutrilini.com/wp-content/uploads/2020/04/DSC00788-2.jpg",
    "videoUrl": "https://youtu.be/eaLS75v9zig",
    "notes": ""
  },
  {
    "key": "R060300014",
    "id": "1793",
    "name": "APFEL BREI",
    "summary": "Der Apfel Brei ist unser Start in die Obstbreie. Babys lieben ihn und lernen dadurch eine unserer wichtigsten regionalen Obstsorten kennen und lieben.",
    "servings": {
      "count": "1",
      "unit": "KIND"
    },
    "time": {
      "prepTime": "5",
      "cookTime": "8",
      "totalTime": "13",
      "customTime": "0",
      "customTimeLabel": ""
    },
    "equipment": [
      "Mixer / Pürierstab",
      "Dampfgarer oder Dampfgareinsatz"
    ],
    "ingredientSets": [
      {
        "name": "",
        "ingredients": [
          {
            "name": "Apfel",
            "amount": "100",
            "unit": "g",
            "notes": ""
          },
          {
            "name": "Rapsöl",
            "amount": "1",
            "unit": "TL",
            "notes": ""
          }
        ]
      }
    ],
    "instructionSets": [
      {
        "name": "",
        "instructions": [
          "Apfel waschen, ggf. schälen und klein schneiden.",
          "Apfelstücke im Dampfgareinsatz mit Wasser 8 Minuten dämpfen. Ohne Dampfgarer Apfel in einem Topf bei niedriger Hitze 8 Minuten dünsten.",
          "Gegarten Apfel pürieren.",
          "Nachdem der Brei etwas abgekühlt ist, Rapsöl unterrühren."
        ]
      }
    ],
    "imageUrl": "https://nutrilini.com/wp-content/uploads/2020/04/Apfelbrei-15.jpg",
    "videoUrl": "https://youtu.be/uL_0E62Lw5E",
    "notes": ""
  },
  {
    "key": "R060500012",
    "id": "1782",
    "name": "KOHLRABI BREI - BEIKOSTSTART",
    "summary": "Kohlrabi ist ideal für den Beikoststart. Denn Kinder lieben seinen süßlichen Geschmack und er ist gut verdaulich.",
    "servings": {
      "count": "1",
      "unit": "KIND"
    },
    "time": {
      "prepTime": "5",
      "cookTime": "8",
      "totalTime": "13",
      "customTime": "0",
      "customTimeLabel": ""
    },
    "equipment": [
      "Mixer / Pürierstab",
      "Dampfgarer oder Dampfgareinsatz"
    ],
    "ingredientSets": [
      {
        "name": "",
        "ingredients": [
          {
            "name": "Kohlrabi",
            "amount": "40",
            "unit": "g",
            "notes": ""
          },
          {
            "name": "Rapsöl",
            "amount": "½",
            "unit": "TL",
            "notes": ""
          },
          {
            "name": "Wasser",
            "amount": "15",
            "unit": "ml",
            "notes": "(Garflüssigkeit)"
          }
        ]
      }
    ],
    "instructionSets": [
      {
        "name": "",
        "instructions": [
          "Kohlrabi waschen, schälen und klein schneiden.",
          "Kohlrabi im Dampfgareinsatz mit Wasser für 6-8 Minuten dämpfen. Ohne Dampfgarer in einem Topf mit wenig Wasser bei niedriger Hitze 6-8 Minuten dünsten.",
          "Gegarten Kohlrabi mit 50 ml Garflüssigkeit (je nach Bedarf auch mehr oder weniger) pürieren.",
          "Nachdem der Brei etwas abgekühlt ist, Rapsöl unterrühren."
        ]
      }
    ],
    "imageUrl": "https://nutrilini.com/wp-content/uploads/2020/04/Kohlrabi-Brei-nutrilini.jpg",
    "videoUrl": "https://www.youtube.com/watch?v=TTUIXFGebs4",
    "notes": ""
  },
  {
    "key": "R060300012",
    "id": "4901",
    "name": "KOHLRABI BREI - ALS SNACK FÜR GRÖßERE BABYS",
    "summary": "Kohlrabi ist ideal für den Beikoststart. Denn Kinder lieben seinen süßlichen Geschmack und er ist gut verdaulich. Für größere Babys eignet sich der Kohlrabi Brei noch als kleine Gemüsemahlzeit für zwischendurch.",
    "servings": {
      "count": "1",
      "unit": "KIND"
    },
    "time": {
      "prepTime": "5",
      "cookTime": "8",
      "totalTime": "13",
      "customTime": "0",
      "customTimeLabel": ""
    },
    "equipment": [
      "Mixer / Pürierstab",
      "Dampfgarer oder Dampfgareinsatz"
    ],
    "ingredientSets": [
      {
        "name": "",
        "ingredients": [
          {
            "name": "Kohlrabi",
            "amount": "100",
            "unit": "g",
            "notes": ""
          },
          {
            "name": "Rapsöl",
            "amount": "1",
            "unit": "TL",
            "notes": ""
          },
          {
            "name": "Wasser",
            "amount": "50",
            "unit": "ml",
            "notes": "(Garflüssigkeit)"
          }
        ]
      }
    ],
    "instructionSets": [
      {
        "name": "",
        "instructions": [
          "Kohlrabi waschen, schälen und klein schneiden.",
          "Kohlrabi im Dampfgareinsatz mit Wasser für 6-8 Minuten dämpfen. Ohne Dampfgarer in einem Topf mit wenig Wasser bei niedriger Hitze 6-8 Minuten dünsten.",
          "Gegarten Kohlrabi mit 50 ml Garflüssigkeit (je nach Bedarf auch mehr oder weniger) pürieren.",
          "Nachdem der Brei etwas abgekühlt ist, Rapsöl unterrühren."
        ]
      }
    ],
    "imageUrl": "https://nutrilini.com/wp-content/uploads/2020/04/Kohlrabi-Brei-nutrilini.jpg",
    "videoUrl": "https://www.youtube.com/watch?v=TTUIXFGebs4",
    "notes": ""
  },
  {
    "key": "R060300013",
    "id": "1788",
    "name": "AVOCADO KARTOFFEL BREI",
    "summary": "Mit dem Avocado Kartoffel Brei stellen unserem Baby Avocado vor. Avocado gilt als Butter der Natur, ist aber allein als Brei zu energiereich. Also kombinieren wir die köstliche Frucht mit Kartoffeln.",
    "servings": {
      "count": "1",
      "unit": "KIND"
    },
    "time": {
      "prepTime": "5",
      "cookTime": "10",
      "totalTime": "15",
      "customTime": "0",
      "customTimeLabel": ""
    },
    "equipment": [
      "Mixer / Pürierstab",
      "Dampfgarer oder Dampfgareinsatz"
    ],
    "ingredientSets": [
      {
        "name": "",
        "ingredients": [
          {
            "name": "Avocado",
            "amount": "30",
            "unit": "g",
            "notes": ""
          },
          {
            "name": "Kartoffel",
            "amount": "70",
            "unit": "g",
            "notes": ""
          },
          {
            "name": "Rapsöl",
            "amount": "1",
            "unit": "TL",
            "notes": ""
          },
          {
            "name": "Wasser",
            "amount": "50",
            "unit": "ml",
            "notes": "(Garflüssigkeit)"
          }
        ]
      }
    ],
    "instructionSets": [
      {
        "name": "",
        "instructions": [
          "Avocado und Kartoffel schälen und in Stücke schneiden.",
          "Avocado in heißem Dampfbbad ca. 3 min. garen.",
          "Kartoffelstücke mit Wasser ca. 10 min. garen.",
          "Die gegarte Avocado und Kartoffel mit Garflüssigkeit (je nach Bedarf etwas mehr oder weniger) pürieren.",
          "Nachdem der Brei etwas abgeühlt ist, Rapsöl untermischen."
        ]
      }
    ],
    "imageUrl": "https://nutrilini.com/wp-content/uploads/2020/06/Kartoffel-Avocado-Brei-BBeikost-nutrilini.jpeg",
    "videoUrl": "https://www.youtube.com/watch?v=TTUIXFGebs4",
    "notes": ""
  },
  {
    "key": "R060500007",
    "id": "1705",
    "name": "KÜRBIS BREI - BEIKOSTSTART",
    "summary": "Der Hokkaido-Kürbis ist neben der Karotte das beliebteste Einstiegsgemüse für die Beikost. Der gegarte Kürbis schmeckt süßlich-mild und ist sehr gut bekömmlich.",
    "servings": {
      "count": "1",
      "unit": "KIND"
    },
    "time": {
      "prepTime": "5",
      "cookTime": "12",
      "totalTime": "17",
      "customTime": "0",
      "customTimeLabel": ""
    },
    "equipment": [
      "Mixer / Pürierstab",
      "Dampfgarer oder Dampfgareinsatz"
    ],
    "ingredientSets": [
      {
        "name": "",
        "ingredients": [
          {
            "name": "Kürbis",
            "amount": "40",
            "unit": "g",
            "notes": ""
          },
          {
            "name": "Wasser",
            "amount": "15",
            "unit": "ml",
            "notes": "(Garflüssigkeit)"
          },
          {
            "name": "Rapsöl",
            "amount": "½",
            "unit": "TL",
            "notes": ""
          }
        ]
      }
    ],
    "instructionSets": [
      {
        "name": "",
        "instructions": [
          "Kürbis waschen, ggf schälen und ggf schneiden.",
          "Kürbis im Dampfgareinsatz mit Wasser dämpfen und für 10-12 Minuten garen lassen. Ohne Dampfgareinsatz in einem Topf mit wenig Wasser bei niedriger Hitze 10-12 Minuten dünsten.",
          "Gegarten Kürbis mit etwas Garflüssigkeit (je nach Bedarf etwas mehr oder weniger) pürieren.",
          "Nachdem der Brei etwas abgekühlt ist, das Rapsöl unterrühren."
        ]
      }
    ],
    "imageUrl": "https://nutrilini.com/wp-content/uploads/2022/06/nutrilini.incode-systems.com-kuerbisbrei-scaled-1.jpg",
    "videoUrl": "https://www.youtube.com/watch?v=TTUIXFGebs4",
    "notes": ""
  },
  {
    "key": "R060300007",
    "id": "4908",
    "name": "KÜRBIS BREI - ALS SNACK FÜR GRÖßERE BABYS",
    "summary": "Der Hokkaido-Kürbis ist neben der Karotte das beliebteste Einstiegsgemüse für die Beikost. Der gegarte Kürbis schmeckt süßlich-mild und ist sehr gut bekömmlich.",
    "servings": {
      "count": "1",
      "unit": "KIND"
    },
    "time": {
      "prepTime": "5",
      "cookTime": "12",
      "totalTime": "17",
      "customTime": "0",
      "customTimeLabel": ""
    },
    "equipment": [
      "Mixer / Pürierstab",
      "Dampfgarer oder Dampfgareinsatz"
    ],
    "ingredientSets": [
      {
        "name": "",
        "ingredients": [
          {
            "name": "Kürbis",
            "amount": "100",
            "unit": "g",
            "notes": ""
          },
          {
            "name": "Wasser",
            "amount": "50",
            "unit": "ml",
            "notes": "(Garflüssigkeit)"
          },
          {
            "name": "Rapsöl",
            "amount": "1",
            "unit": "TL",
            "notes": ""
          }
        ]
      }
    ],
    "instructionSets": [
      {
        "name": "",
        "instructions": [
          "Kürbis waschen, ggf schälen und ggf schneiden.",
          "Kürbis im Dampfgareinsatz mit Wasser dämpfen und für 10-12 Minuten garen lassen. Ohne Dampfgareinsatz in einem Topf mit wenig Wasser bei niedriger Hitze 10-12 Minuten dünsten.",
          "Gegarten Kürbis mit etwas Garflüssigkeit (je nach Bedarf etwas mehr oder weniger) pürieren.",
          "Nachdem der Brei etwas abgekühlt ist, das Rapsöl unterrühren."
        ]
      }
    ],
    "imageUrl": "https://nutrilini.com/wp-content/uploads/2022/06/nutrilini.incode-systems.com-kuerbisbrei-scaled-1.jpg",
    "videoUrl": "https://www.youtube.com/watch?v=TTUIXFGebs4",
    "notes": ""
  },
  {
    "key": "R060100019",
    "id": "4916",
    "name": "ABENDBREI-GRIEß MIT VERSTECKTEM GEMÜSE mit Pre-Milch",
    "summary": "Hier mal eine herzhafte Variante des ansonsten süßen Grießbreis. Der Abendbrei eignet sich wunderbar, noch etwas Gemüse in Babys Essen unterzubringen. Besonders gut ist bei unseren Kleinen der etwas stückigere Brei angekommen, weil der Brei so etwas Biss durch die Gemüsestückchen bekommt.",
    "servings": {
      "count": "1",
      "unit": "KIND"
    },
    "time": {
      "prepTime": "5",
      "cookTime": "10",
      "totalTime": "10",
      "customTime": "0",
      "customTimeLabel": ""
    },
    "equipment": [
      "Mit einem Zerkleinerer geht's schneller. Ansonsten ein scharfes Messer verwenden, um das Gemüse kleinzuschneiden.",
      "Dampfgarer oder Dampfgareinsatz"
    ],
    "ingredientSets": [
      {
        "name": "",
        "ingredients": [
          {
            "name": "Gemüse: gerne Kürbis, Karotte, Süsskartoffel oder Zucchini",
            "amount": "30",
            "unit": "g",
            "notes": ""
          },
          {
            "name": "Wasser",
            "amount": "50",
            "unit": "ml",
            "notes": "(Garflüssigkeit)"
          },
          {
            "name": "Pre-Milch",
            "amount": "200",
            "unit": "ml",
            "notes": "(z.B. Humana Anfangsmilchl)"
          },
          {
            "name": "Instant Getreideflocken",
            "amount": "20",
            "unit": "g",
            "notes": ""
          },
          {
            "name": "Bourbon Vanille",
            "amount": "1",
            "unit": "Prise",
            "notes": "Nach Geschmack mehr"
          }
        ]
      }
    ],
    "instructionSets": [
      {
        "name": "",
        "instructions": [
          "Gemüse putzen und klein schneiden.",
          "Gemüsestücke im Dampfgarer je nach Gemüsesorte 8-10 Minuten weichgaren. Ohne Dampfgareinsatz in einem Topf mit etwas Wasser bei niedriger Hitze 8-10 Minuten dünsten.",
          "Anschließend gegartes Gemüse mit etwas Garflüssigkeit pürieren oder bei größeren Babys stückig lassen.",
          "Die Pre-Milch nach Packungsanweisung anrühren und erwärmen. Den Getreidebrei mit einem Schneebesen einrühren und Gemüse unterheben.",
          "Zum Schluss Vanille einrühren."
        ]
      }
    ],
    "imageUrl": "https://nutrilini.com/wp-content/uploads/2022/06/nutrilini.incode-systems.com-abendbrei-griess.jpg",
    "videoUrl": "",
    "notes": ""
  },
  {
    "key": "R060300015",
    "id": "1509",
    "name": "KÜRBIS STICKS",
    "summary": "Unsere Kürbis Sticks sind wunderbar für Babys geeignet, erste eigene Erfahrungen mit festem Essen zu machen. Die Sticks haben genau die richtige Größe und Konsistenz, damit die Kleinen sie gut in die Hand nehmen können. Dazu schmecken sie herrlich nach süßlich-mildem Kürbis.",
    "servings": {
      "count": "1",
      "unit": "KIND"
    },
    "time": {
      "prepTime": "5",
      "cookTime": "15",
      "totalTime": "20",
      "customTime": "0",
      "customTimeLabel": ""
    },
    "equipment": [
      "Dampfgareinsatz oder Dampfgarer"
    ],
    "ingredientSets": [
      {
        "name": "",
        "ingredients": [
          {
            "name": "Hokkaido-Kürbis",
            "amount": "1/4",
            "unit": "",
            "notes": "(ca. 175 g)"
          },
          {
            "name": "Rapsöl zum Bestreichen",
            "amount": "½",
            "unit": "TL",
            "notes": "(optional)"
          }
        ]
      }
    ],
    "instructionSets": [
      {
        "name": "",
        "instructions": [
          "Kürbis schälen und in dünne Streifen schneiden.",
          "In einem Dampfgareinsatz 15 Minuten dämpfen.",
          "Wenn gewünscht, zum Schluss mit Rapsöl bestreichen."
        ]
      }
    ],
    "imageUrl": "https://nutrilini.com/wp-content/uploads/2022/06/nutrilini.incode-systems.com-kuerbissticks.jpg",
    "videoUrl": "https://www.youtube.com/watch?v=URBPLHlZULA",
    "notes": ""
  },
  {
    "key": "R060400018",
    "id": "4753",
    "name": "APFEL HIRSE BREI",
    "summary": "Unser Apfel Hirse Brei ist eine gut bekömmliche, glutenfreie Variation des Obst-Getreides-Breis. Der Brei kann bereits ab dem 5. Monat gegeben werden. Dann am besten Hirse-Instantflocken in Bio-Qualität verwenden. Sind die Kleinen etwas älter, kann auf die Hirsekörnchen umgestiegen werden. Die geben dem Brei eine schöne Konsistenz, die sehr spannend für die Kleinen ist.",
    "servings": {
      "count": "1",
      "unit": "KIND"
    },
    "time": {
      "prepTime": "5",
      "cookTime": "10",
      "totalTime": "15",
      "customTime": "0",
      "customTimeLabel": ""
    },
    "equipment": [
      "Mixer / Pürierstab",
      "Dampfgarer oder Dampfgareinsatz"
    ],
    "ingredientSets": [
      {
        "name": "",
        "ingredients": [
          {
            "name": "Apfel",
            "amount": "150",
            "unit": "g",
            "notes": ""
          },
          {
            "name": "Hirseflocken",
            "amount": "20",
            "unit": "g",
            "notes": "(ab dem 10. Monat Hirsekörnchen)"
          },
          {
            "name": "Wasser",
            "amount": "50",
            "unit": "ml",
            "notes": ""
          },
          {
            "name": "Rapsöl",
            "amount": "1",
            "unit": "TL",
            "notes": ""
          }
        ]
      }
    ],
    "instructionSets": [
      {
        "name": "",
        "instructions": [
          "Apfel waschen, schälen und klein schneiden.",
          "Apfelstücke im Dampfgareinsatz mit Wasser dämpfen oder in einem Topf mit wenig Wasser bei niedriger Hitze ca. 10 min. dünsten.",
          "Hirse nach Packungseinleitung mit Wasser zubereiten.",
          "Apfel mit ca. 50 ml Garflüssigkeit (je nach Bedarf mehr mehr oder weniger) pürieren und mit der Hirse mischen.",
          "Nachdem der Brei etwas abgekühlt ist Rapsöl unterrühren."
        ]
      }
    ],
    "imageUrl": "https://nutrilini.com/wp-content/uploads/2022/06/nutrilini.incode-systems.com-apfel-hirse-brei-medium.jpg",
    "videoUrl": "https://www.youtube.com/watch?v=1m6IqfY7C8M",
    "notes": ""
  },
  {
    "key": "R060000023",
    "id": "4796",
    "name": "KOHLRABI GRÜNKERN BREI",
    "summary": "Der Kohlrabi Grünkern Brei ist unsere besondere Rezeptidee für den Getreide-Kartoffel-Gemüse-Brei. Der Grünkern schmeckt herzhaft-nussig, der Kohlrabi mild-süßlich. So erlebt Dein Baby eine spannende Geschmacksvielfalt.",
    "servings": {
      "count": "1",
      "unit": "KIND"
    },
    "time": {
      "prepTime": "5",
      "cookTime": "15",
      "totalTime": "20",
      "customTime": "0",
      "customTimeLabel": ""
    },
    "equipment": [
      "Mixer / Pürierstab",
      "Dampfgarer oder Dampfgareinsatz"
    ],
    "ingredientSets": [
      {
        "name": "",
        "ingredients": [
          {
            "name": "Kartoffeln",
            "amount": "50",
            "unit": "g",
            "notes": ""
          },
          {
            "name": "Kohlrabi",
            "amount": "100",
            "unit": "g",
            "notes": ""
          },
          {
            "name": "Grünkern (Vollkorn)",
            "amount": "20",
            "unit": "g",
            "notes": ""
          },
          {
            "name": "Rapsöl",
            "amount": "1",
            "unit": "EL",
            "notes": ""
          },
          {
            "name": "Wasser",
            "amount": "50",
            "unit": "ml",
            "notes": "(Garflüssigkeit)"
          },
          {
            "name": "Noriflocken",
            "amount": "1",
            "unit": "Msp",
            "notes": ""
          }
        ]
      }
    ],
    "instructionSets": [
      {
        "name": "",
        "instructions": [
          "Den Grünkern nach Packungsanweisung zubereiten.",
          "Kartoffeln und Kohlrabi waschen, schälen und klein schneiden.",
          "Dann das Gemüse im Dampfgareinsatz für 10-15 Minuten garen lassen. Ohne Dampfgareinsatz das Gemüse in einem Topf bei niedriger Hitze 10-15 Minuten dünsten.",
          "Anschließend Gemüse und Grünkern mit Garflüssigkeit (je nach Bedarf etwas weniger oder mehr) pürieren.",
          "Nachdem der Brei abgekühlt ist, Rapsöl und Noriflocken untermischen."
        ]
      }
    ],
    "imageUrl": "https://nutrilini.com/wp-content/uploads/2020/04/DSC00781.jpg",
    "videoUrl": "https://youtu.be/xcSvO0PIWDY",
    "notes": ""
  },
  {
    "key": "R060000022",
    "id": "4790",
    "name": "KÜRBIS MANGOLD BUCHWEIZEN BREI",
    "summary": "Der Kürbis Mangold Buchweizen Brei ist eine echte Nährstoffbombe. Vor allem im farbenfrohen Mangold stecken viele Vitamine und Mineralstoffe. Dazu gesellt sich lecker-nussiger Buchweizen. Der Brei kann schon ab 6 Monaten gegeben werden.",
    "servings": {
      "count": "1",
      "unit": "KIND"
    },
    "time": {
      "prepTime": "10",
      "cookTime": "15",
      "totalTime": "25",
      "customTime": "0",
      "customTimeLabel": ""
    },
    "equipment": [
      "Mixer / Pürierstab",
      "Dampfgarer oder Dampfgareinsatz"
    ],
    "ingredientSets": [
      {
        "name": "",
        "ingredients": [
          {
            "name": "Kürbis",
            "amount": "50",
            "unit": "g",
            "notes": "(z.B. Hokkaido)"
          },
          {
            "name": "Mangold",
            "amount": "100",
            "unit": "g",
            "notes": "(gern bunt)"
          },
          {
            "name": "Buchweizen",
            "amount": "20",
            "unit": "g",
            "notes": ""
          },
          {
            "name": "Wasser",
            "amount": "50",
            "unit": "ml",
            "notes": ""
          },
          {
            "name": "Leinöl",
            "amount": "1",
            "unit": "EL",
            "notes": "(mit DHA und EPA angereichert)"
          },
          {
            "name": "Noriflocken",
            "amount": "1",
            "unit": "Msp.",
            "notes": ""
          }
        ]
      }
    ],
    "instructionSets": [
      {
        "name": "",
        "instructions": [
          "Den Buchweizen nach Packungsanweisung zubereiten.",
          "Den Kürbis waschen, schälen und in Stücke schneiden. Auch den Mangold waschen, putzen und in Stücke schneiden.",
          "Dann das Gemüse im Dampfgareinsatz für 10-15 Minuten garen. Ohne Dampfgareinsatz in einem Topf mit wenig Wasser bei niedriger Hitze 10-15 Minuten dünsten.",
          "Schließlich das gegarte Gemüse mit dem Buchweizen vermischen, 50 ml Garflüssigkeit (je nach Bedarf auch etwas mehr oder weniger) hinzugeben und pürieren.",
          "Nachdem der Brei abgekühlt ist, Leinöl und Noriflocken untermischen."
        ]
      }
    ],
    "imageUrl": "https://nutrilini.com/wp-content/uploads/2022/06/nutrilini.incode-systems.com-kuerbis-mangold-buchweizen-klein.jpg",
    "videoUrl": "https://youtu.be/ObOhsnhduWY",
    "notes": ""
  },
  {
    "key": "R060100007",
    "id": "4864",
    "name": "ERDBEER HAFER ODER HIRSE PORRIDGE (mit Kuhmilch)",
    "summary": "Unser Erdbeer Hafer oder Hirse Porridge enthält viel gute Energie und Nährstoffe, die Euer Kleines für den Start in den Tag braucht. Dabei schmeckt der süßliche Brei mit seinen Erdbeeren herrlich nach Sommer. Ihr könnt das Porridge je nach Geschmack mit Haferflocken zubereiten oder auch mit Hirseflocken.",
    "servings": {
      "count": "1",
      "unit": "KIND"
    },
    "time": {
      "prepTime": "5",
      "cookTime": "0",
      "totalTime": "5",
      "customTime": "0",
      "customTimeLabel": ""
    },
    "equipment": [],
    "ingredientSets": [
      {
        "name": "",
        "ingredients": [
          {
            "name": "Erdbeeren",
            "amount": "2",
            "unit": "",
            "notes": "(ca. 30 g)"
          },
          {
            "name": "Instant Hafer- oder Hirseflocken",
            "amount": "20",
            "unit": "g",
            "notes": ""
          },
          {
            "name": "Kuhmilch",
            "amount": "200",
            "unit": "ml",
            "notes": "(3,5% Fett)"
          }
        ]
      }
    ],
    "instructionSets": [
      {
        "name": "",
        "instructions": [
          "Instant Flocken nach Packungsbeilage mit Milch anrühren.",
          "Erdbeeren kleinschneiden und unterrühren. Gern ein paar Stücken übrig lassen und diese oben auf den Brei geben."
        ]
      }
    ],
    "imageUrl": "https://nutrilini.com/wp-content/uploads/2022/05/Haselnuss-Erdbeer-Porridge_Beikost.jpg",
    "videoUrl": "",
    "notes": ""
  },
  {
    "key": "R060100008",
    "id": "4874",
    "name": "HASELNUSS ERDBEER HAFER ODER HIRSE PORRIDGE (mit Formula) - VEGAN",
    "summary": "Unser Erdbeer Hafer oder Hirse Porridge enthält viel gute Energie und Nährstoffe, die Euer Kleines für den Start in den Tag braucht. Dabei schmeckt der fruchtige-nussige Brei mit seinen Erdbeeren und Haselnussmus herrlich nach Sommer. Ihr könnt das Porridge je nach Geschmack mit Haferflocken zubereiten oder auch mit Hirseflocken.",
    "servings": {
      "count": "1",
      "unit": "KIND"
    },
    "time": {
      "prepTime": "5",
      "cookTime": "0",
      "totalTime": "5",
      "customTime": "0",
      "customTimeLabel": ""
    },
    "equipment": [],
    "ingredientSets": [
      {
        "name": "",
        "ingredients": [
          {
            "name": "Erdbeeren",
            "amount": "2",
            "unit": "",
            "notes": "(ca. 30 g)"
          },
          {
            "name": "Instant Hafer- oder Hirseflocken",
            "amount": "20",
            "unit": "g",
            "notes": ""
          },
          {
            "name": "vegane Säuglingsmilch",
            "amount": "200",
            "unit": "ml",
            "notes": "(z.B. Bimbosan Bisoja 1 mit DHA)"
          },
          {
            "name": "Haselnussmus",
            "amount": "1",
            "unit": "TL",
            "notes": ""
          }
        ]
      }
    ],
    "instructionSets": [
      {
        "name": "",
        "instructions": [
          "Die Formula nach Packungsanleitung anrühren.",
          "Dann Instantflocken einrühren.",
          "Erdbeeren kleinschneiden und gemeinsam mit dem Haselnussmus in den Brei unterrühren."
        ]
      }
    ],
    "imageUrl": "https://nutrilini.com/wp-content/uploads/2022/05/Haselnuss-Erdbeer-Porridge_Beikost.jpg",
    "videoUrl": "",
    "notes": ""
  },
  {
    "key": "R060100009",
    "id": "4868",
    "name": "HASELNUSS ERDBEER HAFER ODER HIRSE PORRIDGE (mit Formula)",
    "summary": "Unser Erdbeer Hafer oder Hirse Porridge enthält viel gute Energie und Nährstoffe, die Euer Kleines für den Start in den Tag braucht. Dabei schmeckt der fruchtige-nussige Brei mit seinen Erdbeeren und Haselnussmus herrlich nach Sommer. Ihr könnt das Porridge je nach Geschmack mit Haferflocken zubereiten oder auch mit Hirseflocken.",
    "servings": {
      "count": "1",
      "unit": "KIND"
    },
    "time": {
      "prepTime": "5",
      "cookTime": "0",
      "totalTime": "5",
      "customTime": "0",
      "customTimeLabel": ""
    },
    "equipment": [],
    "ingredientSets": [
      {
        "name": "",
        "ingredients": [
          {
            "name": "Erdbeeren",
            "amount": "2",
            "unit": "",
            "notes": "(ca. 30 g)"
          },
          {
            "name": "Instant Hafer- oder Hirseflocken",
            "amount": "20",
            "unit": "g",
            "notes": ""
          },
          {
            "name": "Pre-Milch",
            "amount": "200",
            "unit": "ml",
            "notes": "(z.B. Humana Anfangsmilch Pre)"
          },
          {
            "name": "Haselnussmus",
            "amount": "1",
            "unit": "TL",
            "notes": ""
          }
        ]
      }
    ],
    "instructionSets": [
      {
        "name": "",
        "instructions": [
          "Pre-Milch nach Anleitung anrühren.",
          "Dann Instantflocken unterrühren.",
          "Erdbeeren kleinschneiden und gemeinsam mit dem Haselnussmus zum Milchbrei hinzufügen."
        ]
      }
    ],
    "imageUrl": "https://nutrilini.com/wp-content/uploads/2022/05/Haselnuss-Erdbeer-Porridge_Beikost.jpg",
    "videoUrl": "",
    "notes": ""
  },
  {
    "key": "R060100004",
    "id": "2052",
    "name": "ABENDBREI-GRIEß MIT VERSTECKTEM GEMÜSE mit Kuhmilch",
    "summary": "Hier mal eine herzhafte Variante des ansonsten süßen Grießbreis. Der Abendbrei eignet sich wunderbar, noch etwas Gemüse in Babys Essen unterzubringen. Besonders gut ist bei unseren Kleinen der etwas stückigere Brei angekommen, weil der Brei so etwas Biss durch die Gemüsestückchen bekommt.",
    "servings": {
      "count": "1",
      "unit": "KIND"
    },
    "time": {
      "prepTime": "5",
      "cookTime": "10",
      "totalTime": "10",
      "customTime": "0",
      "customTimeLabel": ""
    },
    "equipment": [
      "Mit einem Zerkleinerer geht's schneller. Ansonsten ein scharfes Messer verwenden, um das Gemüse kleinzuschneiden.",
      "Dampfgarer oder Dampfgareinsatz"
    ],
    "ingredientSets": [
      {
        "name": "",
        "ingredients": [
          {
            "name": "Gemüse: gerne Kürbis, Karotte, Süsskartoffel oder Zucchini",
            "amount": "30",
            "unit": "g",
            "notes": ""
          },
          {
            "name": "Wasser",
            "amount": "50",
            "unit": "ml",
            "notes": "(Garflüssigkeit)"
          },
          {
            "name": "Kuhmilch",
            "amount": "200",
            "unit": "ml",
            "notes": "(3,5% Fettanteil)"
          },
          {
            "name": "Instant Getreideflocken",
            "amount": "20",
            "unit": "g",
            "notes": ""
          },
          {
            "name": "Bourbon Vanille",
            "amount": "1",
            "unit": "Prise",
            "notes": "Nach Geschmack mehr"
          }
        ]
      }
    ],
    "instructionSets": [
      {
        "name": "",
        "instructions": [
          "Gemüse putzen und klein schneiden.",
          "Gemüsestücke im Dampfgarer je nach Gemüsesorte 8-10 Minuten weichgaren. Ohne Dampfgareinsatz in einem Topf mit etwas Wasser bei niedriger Hitze 8-10 Minuten dünsten.",
          "Anschließend gegartes Gemüse mit etwas Garflüssigkeit pürieren oder bei größeren Babys stückig lassen.",
          "200 ml Milch erwärmen, den Getreidebrei mit einem Schneebesen einrühren und Gemüse unterheben.",
          "Zum Schluss Vanille einrühren."
        ]
      }
    ],
    "imageUrl": "https://nutrilini.com/wp-content/uploads/2022/06/nutrilini.incode-systems.com-abendbrei-griess.jpg",
    "videoUrl": "",
    "notes": ""
  },
  {
    "key": "R060100005",
    "id": "4912",
    "name": "ABENDBREI-GRIEß MIT VERSTECKTEM GEMÜSE mit Haferdrink - VEGAN",
    "summary": "Hier mal eine herzhafte Variante des ansonsten süßen Grießbreis. Der Abendbrei eignet sich wunderbar, noch etwas Gemüse in Babys Essen unterzubringen. Besonders gut ist bei unseren Kleinen der etwas stückigere Brei angekommen, weil der Brei so etwas Biss durch die Gemüsestückchen bekommt.",
    "servings": {
      "count": "1",
      "unit": "KIND"
    },
    "time": {
      "prepTime": "5",
      "cookTime": "10",
      "totalTime": "10",
      "customTime": "0",
      "customTimeLabel": ""
    },
    "equipment": [
      "Mit einem Zerkleinerer geht's schneller. Ansonsten ein scharfes Messer verwenden, um das Gemüse kleinzuschneiden.",
      "Dampfgarer oder Dampfgareinsatz"
    ],
    "ingredientSets": [
      {
        "name": "",
        "ingredients": [
          {
            "name": "Gemüse: gerne Kürbis, Karotte, Süsskartoffel oder Zucchini",
            "amount": "30",
            "unit": "g",
            "notes": ""
          },
          {
            "name": "Wasser",
            "amount": "50",
            "unit": "ml",
            "notes": "(Garflüssigkeit)"
          },
          {
            "name": "Haferdrink",
            "amount": "200",
            "unit": "ml",
            "notes": "(mit Calcium und B2 angereichert)"
          },
          {
            "name": "Instant Getreideflocken",
            "amount": "20",
            "unit": "g",
            "notes": ""
          },
          {
            "name": "Rapsöl",
            "amount": "1",
            "unit": "TL",
            "notes": ""
          },
          {
            "name": "Bourbon Vanille",
            "amount": "1",
            "unit": "Prise",
            "notes": "Nach Geschmack mehr"
          }
        ]
      }
    ],
    "instructionSets": [
      {
        "name": "",
        "instructions": [
          "Gemüse putzen und klein schneiden.",
          "Gemüsestücke im Dampfgarer je nach Gemüsesorte 8-10 Minuten weichgaren. Ohne Dampfgareinsatz in einem Topf mit etwas Wasser bei niedriger Hitze 8-10 Minuten dünsten.",
          "Anschließend gegartes Gemüse mit etwas Garflüssigkeit pürieren oder bei größeren Babys stückig lassen.",
          "200 ml Milch erwärmen, den Getreidebrei mit einem Schneebesen einrühren und Gemüse unterheben. Dann Vanille einrühren.",
          "Nachdem der Brei etwas abgekühlt ist, Rapsöl unterrühren."
        ]
      }
    ],
    "imageUrl": "https://nutrilini.com/wp-content/uploads/2022/06/nutrilini.incode-systems.com-abendbrei-griess.jpg",
    "videoUrl": "",
    "notes": ""
  },
  {
    "key": "R060100006",
    "id": "4914",
    "name": "ABENDBREI-GRIEß MIT VERSTECKTEM GEMÜSE mit Formula - VEGAN",
    "summary": "Hier mal eine herzhafte Variante des ansonsten süßen Grießbreis. Der Abendbrei eignet sich wunderbar, noch etwas Gemüse in Babys Essen unterzubringen. Besonders gut ist bei unseren Kleinen der etwas stückigere Brei angekommen, weil der Brei so etwas Biss durch die Gemüsestückchen bekommt.",
    "servings": {
      "count": "1",
      "unit": "KIND"
    },
    "time": {
      "prepTime": "5",
      "cookTime": "10",
      "totalTime": "10",
      "customTime": "0",
      "customTimeLabel": ""
    },
    "equipment": [
      "Mit einem Zerkleinerer geht's schneller. Ansonsten ein scharfes Messer verwenden, um das Gemüse kleinzuschneiden.",
      "Dampfgarer oder Dampfgareinsatz"
    ],
    "ingredientSets": [
      {
        "name": "",
        "ingredients": [
          {
            "name": "Gemüse: gerne Kürbis, Karotte, Süsskartoffel oder Zucchini",
            "amount": "30",
            "unit": "g",
            "notes": ""
          },
          {
            "name": "Wasser",
            "amount": "50",
            "unit": "ml",
            "notes": "(Garflüssigkeit)"
          },
          {
            "name": "vegane Formula",
            "amount": "200",
            "unit": "ml",
            "notes": "(z.B. Bimbosan Bisoja 1 mit DHA)"
          },
          {
            "name": "Instant Getreideflocken",
            "amount": "20",
            "unit": "g",
            "notes": ""
          },
          {
            "name": "Rapsöl",
            "amount": "1",
            "unit": "TL",
            "notes": ""
          },
          {
            "name": "Bourbon Vanille",
            "amount": "1",
            "unit": "Prise",
            "notes": "Nach Geschmack mehr"
          }
        ]
      }
    ],
    "instructionSets": [
      {
        "name": "",
        "instructions": [
          "Gemüse putzen und klein schneiden.",
          "Gemüsestücke im Dampfgarer je nach Gemüsesorte 8-10 Minuten weichgaren. Ohne Dampfgareinsatz in einem Topf mit etwas Wasser bei niedriger Hitze 8-10 Minuten dünsten.",
          "Anschließend gegartes Gemüse mit etwas Garflüssigkeit pürieren oder bei größeren Babys stückig lassen.",
          "Die Formula nach Packungsanweisung anrühren und erwärmen, den Getreidebrei mit einem Schneebesen einrühren und Gemüse unterheben. Dann Vanille einrühren.",
          "Nachdem der Brei etwas abgekühlt ist, Rapsöl unterrühren."
        ]
      }
    ],
    "imageUrl": "https://nutrilini.com/wp-content/uploads/2022/06/nutrilini.incode-systems.com-abendbrei-griess.jpg",
    "videoUrl": "",
    "notes": ""
  },
  {
    "key": "R060300023",
    "id": "2642",
    "name": "KÜRBIS MANGO ORANGEN MANDEL QUETSCHIE",
    "summary": "Unser Kürbis-Mango-Orangen-Mandel-Quetschie ist perfekt als vollwertige Snackmahlzeit auf Ausflügen. Er kann aber auch zum Mittag oder zum Abendessen zusätzlich gereicht werden. Er enthält dank seiner Mischung aus Gemüse, Obst und Mandelmus wertvolle Nährstoffe, die Eure Kleinen brauchen. Dabei schmeckt er einfach lecker und sättigt schön. Und er ist im Handumdrehen zubereitet.",
    "servings": {
      "count": "1",
      "unit": "KIND"
    },
    "time": {
      "prepTime": "5",
      "cookTime": "10",
      "totalTime": "15",
      "customTime": "0",
      "customTimeLabel": ""
    },
    "equipment": [
      "Mixer / Pürierstab",
      "Dampfgarer oder Dampfgareinsatz"
    ],
    "ingredientSets": [
      {
        "name": "",
        "ingredients": [
          {
            "name": "Kürbis",
            "amount": "1/4",
            "unit": "",
            "notes": "(ca. 120 g)"
          },
          {
            "name": "Mango",
            "amount": "1/4",
            "unit": "",
            "notes": "(ca. 70 g)"
          },
          {
            "name": "Orange",
            "amount": "1/2",
            "unit": "",
            "notes": "(ca. 70 g)"
          },
          {
            "name": "Mandelmus",
            "amount": "1",
            "unit": "TL",
            "notes": ""
          }
        ]
      }
    ],
    "instructionSets": [
      {
        "name": "",
        "instructions": [
          "Den Kürbis entkernen, klein schneiden und ca. 15 min. dampfgaren. Ohne Dampfgareinsatz den Kürbis in einem Topf bei niedriger Hitze und in wenig Wasser 15 min. dünsten.",
          "Währenddessen Mango und Orange schälen und in Stücke schneiden.",
          "Den weichen Kürbis mit der Mango, Orange und dem Mandelmus zu einem Smoothie pürieren.",
          "In Quetschiebeutel füllen oder im Glas servieren."
        ]
      }
    ],
    "imageUrl": "https://nutrilini.com/wp-content/uploads/2022/05/Kuerbis-Quetschie.jpg",
    "videoUrl": "",
    "notes": ""
  },
  {
    "key": "R060600020",
    "id": "1816",
    "name": "KÜRBIS SÜßKARTOFFEL BREI",
    "summary": "Unser Gemüsebrei nicht nur für Lieberhaber von orange. Der Brei überzeugt nicht nur durch seine wundbare leuchtend-orangene Farbe. Kürbis und Süßkartoffel sind auch eine überraschend leckere Gemüsekombination. Dabei hat er außerdem schön sämige Konsistenz. Und kann bei den Kleinen vor allem durch seine milde Süße punkten.",
    "servings": {
      "count": "1",
      "unit": "KIND"
    },
    "time": {
      "prepTime": "5",
      "cookTime": "15",
      "totalTime": "20",
      "customTime": "0",
      "customTimeLabel": ""
    },
    "equipment": [
      "Mixer / Pürierstab"
    ],
    "ingredientSets": [
      {
        "name": "",
        "ingredients": [
          {
            "name": "Kürbis",
            "amount": "100",
            "unit": "g",
            "notes": ""
          },
          {
            "name": "Süßkartoffel",
            "amount": "50",
            "unit": "g",
            "notes": ""
          },
          {
            "name": "Wasser",
            "amount": "50",
            "unit": "ml",
            "notes": "(Garflüssigkeit)"
          },
          {
            "name": "Rapsöl",
            "amount": "1",
            "unit": "EL",
            "notes": ""
          }
        ]
      }
    ],
    "instructionSets": [
      {
        "name": "",
        "instructions": [
          "Kürbis und Süßkartoffel schälen und in Stücke schneiden.",
          "Gemüsestücke im Dampfgareinsatz mit Wasser für 15 Minuten dämpfen. Ohne Dampfgarer in einem Topf bei niedriger Hitze mit wenig Wasser 15 Minuten dünsten.",
          "Gegartes Gemüse mit Garflüssigkeit (je nach Bedarf auch etwas mehr oder weniger) pürieren.",
          "Nachdem der Brei abgekühlt ist, Rapsöl unterrühren."
        ]
      }
    ],
    "imageUrl": "https://nutrilini.com/wp-content/uploads/2020/04/DSC00691.jpg",
    "videoUrl": "https://youtu.be/Xrof1QuIlAo",
    "notes": ""
  },
  {
    "key": "R060300025",
    "id": "4780",
    "name": "DINKEL STICKS",
    "summary": "Die Dinkel Sticks sind unsere gesündere Alternative zu gekauften Knabbereien, die oft zu salzig, zu fettig und eher nährstoffarm sind. Hier stecken neben Dinkel wertvoller Amaranth und verstecktes Gemüse drin. Dank unserer Rezeptur sind sie sogar für Kleinkinder ab 10 Monaten geeignet.",
    "servings": {
      "count": "8",
      "unit": "Sticks"
    },
    "time": {
      "prepTime": "10",
      "cookTime": "15",
      "totalTime": "25",
      "customTime": "0",
      "customTimeLabel": ""
    },
    "equipment": [
      "Thermomix (geht aber auch ohne)"
    ],
    "ingredientSets": [
      {
        "name": "",
        "ingredients": [
          {
            "name": "Dinkelvollkornmehl",
            "amount": "100",
            "unit": "g",
            "notes": ""
          },
          {
            "name": "Amaranth",
            "amount": "10",
            "unit": "g",
            "notes": "(gepoppt)"
          },
          {
            "name": "Zucchini",
            "amount": "40",
            "unit": "g",
            "notes": ""
          },
          {
            "name": "warmes Wasser",
            "amount": "50",
            "unit": "ml",
            "notes": ""
          },
          {
            "name": "Rapsöl",
            "amount": "1",
            "unit": "TL",
            "notes": ""
          },
          {
            "name": "Rosmarin oder Thymian nach Geschmack",
            "amount": "",
            "unit": "",
            "notes": ""
          },
          {
            "name": "Olivenöl zum Bestreichen",
            "amount": "1",
            "unit": "EL",
            "notes": "(muss zum Backen geeignet sein)"
          }
        ]
      },
      {
        "name": "Optional",
        "ingredients": [
          {
            "name": "Salz nach Geschmack",
            "amount": "",
            "unit": "",
            "notes": ""
          },
          {
            "name": "geriebener Käse zum Bestreuen",
            "amount": "",
            "unit": "",
            "notes": ""
          },
          {
            "name": "Sesam zum Bestreuen",
            "amount": "",
            "unit": "",
            "notes": ""
          }
        ]
      }
    ],
    "instructionSets": [
      {
        "name": "",
        "instructions": [
          "Ofen auf 190 Grad Ober-/Unterhitze vorheizen.",
          "Zucchini klein raspeln, Kräuter fein hexeln.",
          "Mehl, gepoppten Amaranth, Zucchini, Kräuter, Rapsöl und warmes Wasser zu einem glatten Teig verkneten.",
          "Hände mit Mehl bestäuben und Sticks formen.",
          "Backblech mit Backpapier auslegen und Sticks darauf legen. Auf Wunsch Sticks etwas salzen.",
          "Für 15 Minuten im Ofen backen."
        ]
      },
      {
        "name": "Im Thermomix",
        "instructions": [
          "Zucchini in den Mixtopf geben und 4 bis 5 Sekunden auf Stufe 4 zerkleinern. Dann die zerkleinerte Zucchini aus dem Mixtopf nehmen.",
          "Anschließend Rosmarin oder Thymian mit ein bisschen Wasser für 15 Sekunden auf Stufe 10 klein hexeln.",
          "Dann Mehl, gepoppten Amaranth, Zucchini, Rapsöl und Wasser 1 min. auf Teigstufe kneten, auf Wunsch etwas Salz hinzufügen.",
          "Anschließend Hände mit Mehl bestäuben und Sticks formen.",
          "Backblech mit Backpapier auslegen und Sticks auf das Backblech legen. Dann für 15 min. im Ofen backen."
        ]
      }
    ],
    "imageUrl": "https://nutrilini.com/wp-content/uploads/2022/06/nutrilini.incode-systems.com-dinkel-sticks-baby-mit-dinkelstick-medium-2.jpg",
    "videoUrl": "",
    "notes": ""
  },
  {
    "key": "R060400019",
    "id": "4814",
    "name": "HIRSE BANANEN BREI MIT BLAUBEEREN",
    "summary": "Die Hirse ist ein glutenfreies Getreide und sehr bekömmlich für die Verdauung. Die kleinen goldenen Körner stecken voller gesunder Inhaltsstoffe und liefern essenzielle Aminosäuren, Eisen, Zink und B-Vitamine. Das macht die Hirse gerade in der Beikost so wertvoll. Wir empfehlen den Hirse-Bananbrei mit Blaubeeren ab 7 Monaten.",
    "servings": {
      "count": "1",
      "unit": "KIND"
    },
    "time": {
      "prepTime": "5",
      "cookTime": "10",
      "totalTime": "15",
      "customTime": "0",
      "customTimeLabel": ""
    },
    "equipment": [
      "Thermomix (muss aber nicht)"
    ],
    "ingredientSets": [
      {
        "name": "",
        "ingredients": [
          {
            "name": "Banane",
            "amount": "100",
            "unit": "g",
            "notes": ""
          },
          {
            "name": "Blaubeeren",
            "amount": "50",
            "unit": "g",
            "notes": "(TK oder frisch)"
          },
          {
            "name": "Wasser",
            "amount": "150",
            "unit": "ml",
            "notes": ""
          },
          {
            "name": "Hirseflocken",
            "amount": "20",
            "unit": "g",
            "notes": "(z.B. Holle Babybrei Hirse)"
          },
          {
            "name": "Mandelmus",
            "amount": "1",
            "unit": "TL",
            "notes": ""
          }
        ]
      }
    ],
    "instructionSets": [
      {
        "name": "",
        "instructions": [
          "Banane in Würfel schneiden und entweder mit etwas Wasser andünsten oder etwas Bratöl anbraten (gebraten schmeckt die Banane süßer und knuspriger – gut für ältere Kinder).",
          "Wasser im Topf zum Kochen bringen.",
          "Hirse einrühren, sobald sie cremig ist, gefrorene Blaubeeren hinzugeben. Falls frische Blaubeeren verwendet werden, diese erst am Ende hinzugeben.",
          "Mandelmus unterrühren.",
          "In den Teller füllen. Falls frische Blaubeeren verwendet werden, diese jetzt hinzugeben. Wenn gewünscht noch mit etwas Beikostöl verfeinern."
        ]
      },
      {
        "name": "Im Thermomix:",
        "instructions": [
          "Banane 10 Sek./Stufe 4 zerkleinern.",
          "Entweder mit etwas Wasser andünsten oder etwas Bratöl anbraten auf 100 Grad / Stufe 0,5/ 2 min. (gebraten schmeckt die Banane süßer und knuspriger – gut für ältere Kinder).",
          "Wasser hinzugeben, nach 1 min. Hirse einrühren, dann nach 20 Sekunden gefrorene Blaubeeren hinzugeben. Falls frische Blaubeeren verwendet werden, diese erst am Ende hinzugeben. Den Brei bei 90 Grad / Stufe 0,5 / 2 min. garen.",
          "Mandelmus hinzugeben und auf Stufe 2/ 10 Sekunden untermischen.",
          "In den Teller füllen. Falls frische Blaubeeren verwendet werden, diese jetzt hinzugeben. Wenn gewünscht noch mit etwas Beikostöl verfeinern."
        ]
      }
    ],
    "imageUrl": "https://nutrilini.com/wp-content/uploads/2022/06/nutrilini.incode-systems.com-hirse-bananen-blaubeerbrei-kinder-rezept-2.jpg",
    "videoUrl": "https://youtu.be/R7cxenf1KR0",
    "notes": ""
  },
  {
    "key": "R060300001",
    "id": "1511",
    "name": "KURKUMA BLUMENKOHL BITES",
    "summary": "Unsere Kurkuma Blumenkohl Bites sind kleine Happen, die voller Geschmack und Nährstoffe stecken. Blumenkohl ist z.B. sehr reich an Folat und Vitamin C. Dabei ist er sanft zu Babys Bäuchlein. Gut für die Verdauung ist auch der Kurkuma, der sanft regulierend und entzündungshemmend wirkt. Unsere Kurmkuma Blumenkohl Bites sind ab 10 Monaten geeignet.",
    "servings": {
      "count": "1",
      "unit": "KIND"
    },
    "time": {
      "prepTime": "5",
      "cookTime": "20",
      "totalTime": "25",
      "customTime": "0",
      "customTimeLabel": ""
    },
    "equipment": [],
    "ingredientSets": [
      {
        "name": "",
        "ingredients": [
          {
            "name": "Blumenkohl",
            "amount": "150",
            "unit": "g",
            "notes": ""
          },
          {
            "name": "Rapsöl",
            "amount": "1",
            "unit": "TL",
            "notes": ""
          },
          {
            "name": "Kurkuma",
            "amount": "1",
            "unit": "TL",
            "notes": ""
          }
        ]
      },
      {
        "name": "Optional (für die Großen)",
        "ingredients": [
          {
            "name": "Salz zum Würzen",
            "amount": "",
            "unit": "",
            "notes": ""
          }
        ]
      }
    ],
    "instructionSets": [
      {
        "name": "",
        "instructions": [
          "Blumenkohl in Röschen teilen.",
          "Kurkuma und Bratöl untermischen.",
          "Bei 180 Grad Umluft ca. 20 Minuten knusprig backen.",
          "Falls gewünscht für die Großen erst nach dem Backen salzen.",
          "Mit einem Dip servieren, aber schmeckt auch pur."
        ]
      }
    ],
    "imageUrl": "https://nutrilini.com/wp-content/uploads/2020/04/Kurkuma-BBlumenkohl-bites.png",
    "videoUrl": "https://www.youtube.com/watch?v=r5dhrjlfewM",
    "notes": "\u003cspan data-slate-fragment=\"JTVCJTdCJTIydHlwZSUyMiUzQSUyMnBhcmFncmFwaCUyMiUyQyUyMmNoaWxkcmVuJTIyJTNBJTVCJTdCJTIydGV4dCUyMiUzQSUyMkRhenUlMjBwYXNzdCUyMGVpbmUlMjBHdWFjYW1vbGUlMjBvZGVyJTIwdW5zZXIlMjBFcmJzZW5kaXAlMjIlN0QlNUQlN0QlNUQ=\"\u003eDazu passt hervorragend eine Guacamole oder unser nutrilini Erbsendip."
  },
  {
    "key": "R060300003",
    "id": "1513",
    "name": "BLUMENKOHLRÖSCHEN - GEDÄMPFT",
    "summary": "Blumenkohlröschen eignen sich hervorragend als Handessen für Babys, die ihr Essen gern selbst erkunden möchten. Der Blumenkohl schmeckt angenehm mild und ist sehr gut bekömmlich. Dabei steckt er voller guter Nährstoffe wie Vitamin C und Kalium. Die kleinen Röschen sehen dazu hübsch aus und lassen sich gut durch Babys kleine Hände erkunden. Die Blumenkohlröschen sind ab 8 Monaten geeignet.",
    "servings": {
      "count": "1",
      "unit": "KIND"
    },
    "time": {
      "prepTime": "5",
      "cookTime": "15",
      "totalTime": "20",
      "customTime": "0",
      "customTimeLabel": ""
    },
    "equipment": [
      "Dampfgareinsatz oder Dampfgarer"
    ],
    "ingredientSets": [
      {
        "name": "",
        "ingredients": [
          {
            "name": "Blumenkohl",
            "amount": "1/4",
            "unit": "",
            "notes": "(ca. gute 100 g)"
          },
          {
            "name": "Rapsöl",
            "amount": "1",
            "unit": "TL",
            "notes": "zum Einstreichen"
          }
        ]
      }
    ],
    "instructionSets": [
      {
        "name": "",
        "instructions": [
          "Blumenkohl in Röschen schneiden oder zupfen.",
          "In einem Dampfgareinsatz 15 Minuten dämpfen.",
          "Am Schluss mit Rapsöl einstreichen."
        ]
      }
    ],
    "imageUrl": "https://nutrilini.com/wp-content/uploads/2022/07/nutrilini.incode-systems.com-blumenkohl-gedaempft.jpg",
    "videoUrl": "https://www.youtube.com/watch?v=Q6vF0vDIPp4",
    "notes": ""
  }
]