{
  "protein": 30,
  "totalFat": 45,
  "saturatedFat": 12.5,
  "vitaminA": 30,
  "vitaminB2": 30,
  "vitaminB12": 30,
  "vitaminC": 30,
  "calcium": 30,
  "folate": 30,
  "iodine": 30,
  "iron": 30,
  "magnesium": 30,
  "zinc": 30,
  "omega3": 0.6,
  "omega6": 3.6,
  "epaDha": 30,
  "dha": 30
}