{
    "url": "https://www.hltv.org/events/6865/iem-sydney-2023",
    "hltv_id": 6865,
    "link": {
        "overview": null,
        "matches": null,
        "results": null
    },
    "name": "IEM Sydney 2023",
    "start_date": "2023-10-16",
    "end_date": "2023-10-22",
    "prize_pool": "$250,000",
    "teams_count": "16",
    "location": "Sydney, Australia",
    "stages": [
        {
            "name": "Single Elimination Bracket",
            "rounds": [
                "Quarter-finals",
                "Semi-finals",
                "Grand final"
            ]
        },
        {
            "name": "Group A",
            "rounds": [
                "Opening round",
                "Upper semi-finals",
                "Upper final",
                "Lower round 1",
                "Lower semi-finals",
                "Lower final",
                "Consolidation final",
                "Grand final"
            ]
        },
        {
            "name": "Group B",
            "rounds": [
                "Opening round",
                "Upper semi-finals",
                "Upper final",
                "Lower round 1",
                "Lower semi-finals",
                "Lower final",
                "Consolidation final",
                "Grand final"
            ]
        }
    ],
    "groups": null,
    "formats": [
        {
            "name": "Group stage",
            "description": "Double elimination Bo3\n- Opening matches Bo1\n- Group winners advance to the semi-finals;\n- 2nd and 3rd placed teams in each group proceed to the quarter-finals."
        },
        {
            "name": "Playoffs",
            "description": "Single elimination Bo3"
        }
    ],
    "placements": [
        {
            "place": "1st",
            "prizes": [
                {
                    "name": "$100,000",
                    "link": null
                },
                {
                    "name": "IEM Katowice 2024",
                    "link": null
                }
            ]
        },
        {
            "place": "2nd",
            "prizes": [
                {
                    "name": "$42,000",
                    "link": null
                }
            ]
        },
        {
            "place": "3-4th",
            "prizes": [
                {
                    "name": "$20,000",
                    "link": null
                }
            ]
        },
        {
            "place": "3-4th",
            "prizes": [
                {
                    "name": "$20,000",
                    "link": null
                }
            ]
        },
        {
            "place": "5-6th",
            "prizes": [
                {
                    "name": "$10,000",
                    "link": null
                }
            ]
        },
        {
            "place": "5-6th",
            "prizes": [
                {
                    "name": "$10,000",
                    "link": null
                }
            ]
        },
        {
            "place": "7-8th",
            "prizes": [
                {
                    "name": "$6,000",
                    "link": null
                }
            ]
        },
        {
            "place": "7-8th",
            "prizes": [
                {
                    "name": "$6,000",
                    "link": null
                }
            ]
        },
        {
            "place": "9-12th",
            "prizes": [
                {
                    "name": "$5,000",
                    "link": null
                }
            ]
        },
        {
            "place": "9-12th",
            "prizes": [
                {
                    "name": "$5,000",
                    "link": null
                }
            ]
        },
        {
            "place": "9-12th",
            "prizes": [
                {
                    "name": "$5,000",
                    "link": null
                }
            ]
        },
        {
            "place": "9-12th",
            "prizes": [
                {
                    "name": "$5,000",
                    "link": null
                }
            ]
        },
        {
            "place": "13-16th",
            "prizes": [
                {
                    "name": "$4,000",
                    "link": null
                }
            ]
        },
        {
            "place": "13-16th",
            "prizes": [
                {
                    "name": "$4,000",
                    "link": null
                }
            ]
        },
        {
            "place": "13-16th",
            "prizes": [
                {
                    "name": "$4,000",
                    "link": null
                }
            ]
        },
        {
            "place": "13-16th",
            "prizes": [
                {
                    "name": "$4,000",
                    "link": null
                }
            ]
        }
    ],
    "ratings": [
        {
            "team": "Vitality",
            "link": "/team/9565/vitality",
            "rank": "#1"
        },
        {
            "team": "ENCE",
            "link": "/team/4869/ence",
            "rank": "#2"
        },
        {
            "team": "G2",
            "link": "/team/5995/g2",
            "rank": "#3"
        },
        {
            "team": "FaZe",
            "link": "/team/6667/faze",
            "rank": "#6"
        },
        {
            "team": "Cloud9",
            "link": "/team/5752/cloud9",
            "rank": "#7"
        },
        {
            "team": "Natus Vincere",
            "link": "/team/4608/natus-vincere",
            "rank": "#8"
        },
        {
            "team": "GamerLegion",
            "link": "/team/9928/gamerlegion",
            "rank": "#9"
        },
        {
            "team": "MOUZ",
            "link": "/team/4494/mouz",
            "rank": "#10"
        },
        {
            "team": "Monte",
            "link": "/team/11811/monte",
            "rank": "#12"
        },
        {
            "team": "fnatic",
            "link": "/team/4991/fnatic",
            "rank": "#14"
        },
        {
            "team": "Apeks",
            "link": "/team/9806/apeks",
            "rank": "#16"
        },
        {
            "team": "Complexity",
            "link": "/team/5005/complexity",
            "rank": "#25"
        },
        {
            "team": "Grayhound",
            "link": "/team/8008/grayhound",
            "rank": "#31"
        },
        {
            "team": "BetBoom",
            "link": "/team/12394/betboom",
            "rank": "#36"
        },
        {
            "team": "Lynn Vision",
            "link": "/team/8840/lynn-vision",
            "rank": "#53"
        },
        {
            "team": "VERTEX",
            "link": "/team/10672/vertex",
            "rank": "#84"
        }
    ],
    "related_events": [
        {
            "name": "IEM Rio 2023",
            "link": "/events/6864/iem-rio-2023"
        },
        {
            "name": "IEM Sydney 2023 Europe Closed Qualifier",
            "link": "/events/7274/iem-sydney-2023-europe-closed-qualifier"
        },
        {
            "name": "IEM Sydney 2023 North America Closed Qualifier",
            "link": "/events/7277/iem-sydney-2023-north-america-closed-qualifier"
        },
        {
            "name": "IEM Sydney 2023 Asia Closed Qualifier",
            "link": "/events/7280/iem-sydney-2023-asia-closed-qualifier"
        },
        {
            "name": "IEM Sydney 2023 Oceania Closed Qualifier",
            "link": "/events/7283/iem-sydney-2023-oceania-closed-qualifier"
        }
    ],
    "upcoming_matches": null,
    "played_matches": null
}
