{
  "id": "5:65987960-1058-4606-854c-82a12dc153ae",
  "meta": [
    {
      "name": "bo",
      "value": "3"
    },
    {
      "name": "game_state",
      "value": "map"
    },
    {
      "name": "match_format",
      "value": "r13_o3"
    },
    {
      "name": "original_id",
      "value": "65987960-1058-4606-854c-82a12dc153ae"
    },
    {
      "name": "state_number",
      "value": "1"
    }
  ],
  "slug": "strife-vs-the-nomads-16-03",
  "betStop": false,
  "fixture": {
    "type": "MATCH",
    "score": "0:0",
    "title": "Strife vs The Nomads",
    "status": "LIVE",
    "sportId": "esports_counter_strike",
    "streams": [],
    "startTime": "2024-03-16T01:30:00+00:00",
    "tournament": {
      "id": "gin:1b7f7255-f0db-46af-a350-6564ce2de019",
      "logo": "cdn.gin.bet/tournaments/ESEA_League_lightmode65a4bf8a09a74625848642.png",
      "name": "ESEA Season 48: Advanced Division - North America",
      "slug": "esea-season-48-advanced-division-north-america-15-01",
      "dateEnd": "2024-03-14T22:00:00+00:00",
      "sportId": "esports_counter_strike",
      "masterId": "gin:1b7f7255-f0db-46af-a350-6564ce2de019",
      "dateStart": "2024-01-14T22:00:02+00:00",
      "prizePool": "20,300 USD",
      "countryCode": "WW-NAM",
      "description": "",
      "showTournamentInfo": true,
      "isLocalizationOverridden": true
    },
    "competitors": [
      {
        "id": "gt:98138",
        "score": [
          {
            "id": "map:1",
            "type": "map",
            "number": 1,
            "points": "5"
          },
          {
            "id": "total",
            "type": "total",
            "number": 0,
            "points": "0"
          }
        ]
      },
      {
        "id": "gt:90760c35-6a61-46eb-bbd9-e763b0aa1ff0",
        "score": [
          {
            "id": "map:1",
            "type": "map",
            "number": 1,
            "points": "7"
          },
          {
            "id": "total",
            "type": "total",
            "number": 0,
            "points": "0"
          }
        ]
      }
    ],
    "liveCoverage": true
  },
  "markets": [
    {
      "id": "1",
      "name": "Победитель",
      "odds": [
        {
          "id": "1",
          "name": "Strife",
          "value": "1.91",
          "status": "NOT_RESULTED",
          "isActive": true,
          "competitorId": "gt:90760c35-6a61-46eb-bbd9-e763b0aa1ff0",
          "competitorIds": [
            "gt:90760c35-6a61-46eb-bbd9-e763b0aa1ff0"
          ]
        },
        {
          "id": "2",
          "name": "The Nomads",
          "value": "1.83",
          "status": "NOT_RESULTED",
          "isActive": true,
          "competitorId": "gt:98138",
          "competitorIds": [
            "gt:98138"
          ]
        }
      ],
      "tags": [],
      "status": "ACTIVE",
      "typeId": 1,
      "priority": 1,
      "specifiers": []
    },
    {
      "id": "17h1_5",
      "name": "Фора по картам",
      "odds": [
        {
          "id": "1",
          "name": "Strife (+1.5)",
          "value": "1.34",
          "status": "NOT_RESULTED",
          "isActive": true,
          "competitorId": "gt:90760c35-6a61-46eb-bbd9-e763b0aa1ff0",
          "competitorIds": [
            "gt:90760c35-6a61-46eb-bbd9-e763b0aa1ff0"
          ]
        },
        {
          "id": "2",
          "name": "The Nomads (-1.5)",
          "value": "3.11",
          "status": "NOT_RESULTED",
          "isActive": true,
          "competitorId": "gt:98138",
          "competitorIds": [
            "gt:98138"
          ]
        }
      ],
      "tags": [
        "hcp"
      ],
      "status": "ACTIVE",
      "typeId": 17,
      "priority": 3,
      "specifiers": [
        {
          "name": "hcp",
          "value": "1.5"
        }
      ]
    },
    {
      "id": "7m1",
      "name": "1-я карта - Победитель (вкл. овертайм)",
      "odds": [
        {
          "id": "1",
          "name": "Strife",
          "value": "1.84",
          "status": "NOT_RESULTED",
          "isActive": true,
          "competitorId": "gt:90760c35-6a61-46eb-bbd9-e763b0aa1ff0",
          "competitorIds": [
            "gt:90760c35-6a61-46eb-bbd9-e763b0aa1ff0"
          ]
        },
        {
          "id": "2",
          "name": "The Nomads",
          "value": "1.90",
          "status": "NOT_RESULTED",
          "isActive": true,
          "competitorId": "gt:98138",
          "competitorIds": [
            "gt:98138"
          ]
        }
      ],
      "tags": [],
      "status": "ACTIVE",
      "typeId": 7,
      "priority": 3,
      "specifiers": [
        {
          "name": "mapnr",
          "value": "1"
        }
      ]
    },
    {
      "id": "17h-1_5",
      "name": "Фора по картам",
      "odds": [
        {
          "id": "1",
          "name": "Strife (-1.5)",
          "value": "3.04",
          "status": "NOT_RESULTED",
          "isActive": true,
          "competitorId": "gt:90760c35-6a61-46eb-bbd9-e763b0aa1ff0",
          "competitorIds": [
            "gt:90760c35-6a61-46eb-bbd9-e763b0aa1ff0"
          ]
        },
        {
          "id": "2",
          "name": "The Nomads (+1.5)",
          "value": "1.35",
          "status": "NOT_RESULTED",
          "isActive": true,
          "competitorId": "gt:98138",
          "competitorIds": [
            "gt:98138"
          ]
        }
      ],
      "tags": [
        "hcp"
      ],
      "status": "ACTIVE",
      "typeId": 17,
      "priority": 3,
      "specifiers": [
        {
          "name": "hcp",
          "value": "-1.5"
        }
      ]
    },
    {
      "id": "7m2",
      "name": "2-я карта - Победитель (вкл. овертайм)",
      "odds": [
        {
          "id": "1",
          "name": "Strife",
          "value": "2.01",
          "status": "NOT_RESULTED",
          "isActive": true,
          "competitorId": "gt:90760c35-6a61-46eb-bbd9-e763b0aa1ff0",
          "competitorIds": [
            "gt:90760c35-6a61-46eb-bbd9-e763b0aa1ff0"
          ]
        },
        {
          "id": "2",
          "name": "The Nomads",
          "value": "1.75",
          "status": "NOT_RESULTED",
          "isActive": true,
          "competitorId": "gt:98138",
          "competitorIds": [
            "gt:98138"
          ]
        }
      ],
      "tags": [],
      "status": "ACTIVE",
      "typeId": 7,
      "priority": 3,
      "specifiers": [
        {
          "name": "mapnr",
          "value": "2"
        }
      ]
    },
    {
      "id": "14t2_5",
      "name": "Тотал карт",
      "odds": [
        {
          "id": "1",
          "name": "Больше 2.5",
          "value": "2.65",
          "status": "NOT_RESULTED",
          "isActive": true,
          "competitorId": "",
          "competitorIds": []
        },
        {
          "id": "2",
          "name": "Меньше 2.5",
          "value": "1.44",
          "status": "NOT_RESULTED",
          "isActive": true,
          "competitorId": "",
          "competitorIds": []
        }
      ],
      "tags": [
        "total"
      ],
      "status": "ACTIVE",
      "typeId": 14,
      "priority": 5,
      "specifiers": [
        {
          "name": "total",
          "value": "2.5"
        }
      ]
    },
    {
      "id": "349",
      "name": "Точный счет карты",
      "odds": [
        {
          "id": "1",
          "name": "2:0",
          "value": "3.40",
          "status": "NOT_RESULTED",
          "isActive": true,
          "competitorId": "",
          "competitorIds": []
        },
        {
          "id": "2",
          "name": "2:1",
          "value": "3.58",
          "status": "NOT_RESULTED",
          "isActive": true,
          "competitorId": "",
          "competitorIds": []
        },
        {
          "id": "3",
          "name": "0:2",
          "value": "5.71",
          "status": "NOT_RESULTED",
          "isActive": true,
          "competitorId": "",
          "competitorIds": []
        },
        {
          "id": "4",
          "name": "1:2",
          "value": "2.50",
          "status": "NOT_RESULTED",
          "isActive": true,
          "competitorId": "",
          "competitorIds": []
        }
      ],
      "tags": [
        "score"
      ],
      "status": "ACTIVE",
      "typeId": 349,
      "priority": 7,
      "specifiers": []
    },
    {
      "id": "293m2r2",
      "name": "Карта 2 - Победитель пистолетного раунда",
      "odds": [
        {
          "id": "1",
          "name": "Strife 2-й",
          "value": "2.13",
          "status": "NOT_RESULTED",
          "isActive": true,
          "competitorId": "gt:90760c35-6a61-46eb-bbd9-e763b0aa1ff0",
          "competitorIds": [
            "gt:90760c35-6a61-46eb-bbd9-e763b0aa1ff0"
          ]
        },
        {
          "id": "2",
          "name": "The Nomads 2-й",
          "value": "1.66",
          "status": "NOT_RESULTED",
          "isActive": true,
          "competitorId": "gt:98138",
          "competitorIds": [
            "gt:98138"
          ]
        }
      ],
      "tags": [
        "roundnr"
      ],
      "status": "ACTIVE",
      "typeId": 293,
      "priority": 12,
      "specifiers": [
        {
          "name": "mapnr",
          "value": "2"
        },
        {
          "name": "roundnr",
          "value": "2"
        }
      ]
    },
    {
      "id": "293m2r1",
      "name": "Карта 2 - Победитель пистолетного раунда",
      "odds": [
        {
          "id": "1",
          "name": "Strife 1-й",
          "value": "2.32",
          "status": "NOT_RESULTED",
          "isActive": true,
          "competitorId": "gt:90760c35-6a61-46eb-bbd9-e763b0aa1ff0",
          "competitorIds": [
            "gt:90760c35-6a61-46eb-bbd9-e763b0aa1ff0"
          ]
        },
        {
          "id": "2",
          "name": "The Nomads 1-й",
          "value": "1.56",
          "status": "NOT_RESULTED",
          "isActive": true,
          "competitorId": "gt:98138",
          "competitorIds": [
            "gt:98138"
          ]
        }
      ],
      "tags": [
        "roundnr"
      ],
      "status": "ACTIVE",
      "typeId": 293,
      "priority": 12,
      "specifiers": [
        {
          "name": "mapnr",
          "value": "2"
        },
        {
          "name": "roundnr",
          "value": "1"
        }
      ]
    },
    {
      "id": "293m1r1",
      "name": "Карта 1 - Победитель пистолетного раунда",
      "odds": [
        {
          "id": "1",
          "name": "Strife 1-й",
          "value": "1.04",
          "status": "NOT_RESULTED",
          "isActive": true,
          "competitorId": "gt:90760c35-6a61-46eb-bbd9-e763b0aa1ff0",
          "competitorIds": [
            "gt:90760c35-6a61-46eb-bbd9-e763b0aa1ff0"
          ]
        },
        {
          "id": "2",
          "name": "The Nomads 1-й",
          "value": "9.58",
          "status": "NOT_RESULTED",
          "isActive": true,
          "competitorId": "gt:98138",
          "competitorIds": [
            "gt:98138"
          ]
        }
      ],
      "tags": [
        "roundnr"
      ],
      "status": "ACTIVE",
      "typeId": 293,
      "priority": 12,
      "specifiers": [
        {
          "name": "mapnr",
          "value": "1"
        },
        {
          "name": "roundnr",
          "value": "1"
        }
      ]
    },
    {
      "id": "293m1r2",
      "name": "Карта 1 - Победитель пистолетного раунда",
      "odds": [
        {
          "id": "1",
          "name": "Strife 2-й",
          "value": "2.22",
          "status": "NOT_RESULTED",
          "isActive": true,
          "competitorId": "gt:90760c35-6a61-46eb-bbd9-e763b0aa1ff0",
          "competitorIds": [
            "gt:90760c35-6a61-46eb-bbd9-e763b0aa1ff0"
          ]
        },
        {
          "id": "2",
          "name": "The Nomads 2-й",
          "value": "1.62",
          "status": "NOT_RESULTED",
          "isActive": true,
          "competitorId": "gt:98138",
          "competitorIds": [
            "gt:98138"
          ]
        }
      ],
      "tags": [
        "roundnr"
      ],
      "status": "ACTIVE",
      "typeId": 293,
      "priority": 12,
      "specifiers": [
        {
          "name": "mapnr",
          "value": "1"
        },
        {
          "name": "roundnr",
          "value": "2"
        }
      ]
    },
    {
      "id": "299h-2_5m1",
      "name": "1-я карта - Фора по раундам",
      "odds": [
        {
          "id": "1",
          "name": "Strife (-2.5)",
          "value": "2.57",
          "status": "NOT_RESULTED",
          "isActive": true,
          "competitorId": "gt:90760c35-6a61-46eb-bbd9-e763b0aa1ff0",
          "competitorIds": [
            "gt:90760c35-6a61-46eb-bbd9-e763b0aa1ff0"
          ]
        },
        {
          "id": "2",
          "name": "The Nomads (+2.5)",
          "value": "1.47",
          "status": "NOT_RESULTED",
          "isActive": true,
          "competitorId": "gt:98138",
          "competitorIds": [
            "gt:98138"
          ]
        }
      ],
      "tags": [
        "hcp"
      ],
      "status": "ACTIVE",
      "typeId": 299,
      "priority": 33,
      "specifiers": [
        {
          "name": "hcp",
          "value": "-2.5"
        },
        {
          "name": "mapnr",
          "value": "1"
        }
      ]
    },
    {
      "id": "299h-1_5m1",
      "name": "1-я карта - Фора по раундам",
      "odds": [
        {
          "id": "1",
          "name": "Strife (-1.5)",
          "value": "2.14",
          "status": "NOT_RESULTED",
          "isActive": true,
          "competitorId": "gt:90760c35-6a61-46eb-bbd9-e763b0aa1ff0",
          "competitorIds": [
            "gt:90760c35-6a61-46eb-bbd9-e763b0aa1ff0"
          ]
        },
        {
          "id": "2",
          "name": "The Nomads (+1.5)",
          "value": "1.66",
          "status": "NOT_RESULTED",
          "isActive": true,
          "competitorId": "gt:98138",
          "competitorIds": [
            "gt:98138"
          ]
        }
      ],
      "tags": [
        "hcp"
      ],
      "status": "ACTIVE",
      "typeId": 299,
      "priority": 33,
      "specifiers": [
        {
          "name": "hcp",
          "value": "-1.5"
        },
        {
          "name": "mapnr",
          "value": "1"
        }
      ]
    },
    {
      "id": "299h-2_5m2",
      "name": "2-я карта - Фора по раундам",
      "odds": [
        {
          "id": "1",
          "name": "Strife (-2.5)",
          "value": "2.65",
          "status": "NOT_RESULTED",
          "isActive": true,
          "competitorId": "gt:90760c35-6a61-46eb-bbd9-e763b0aa1ff0",
          "competitorIds": [
            "gt:90760c35-6a61-46eb-bbd9-e763b0aa1ff0"
          ]
        },
        {
          "id": "2",
          "name": "The Nomads (+2.5)",
          "value": "1.44",
          "status": "NOT_RESULTED",
          "isActive": true,
          "competitorId": "gt:98138",
          "competitorIds": [
            "gt:98138"
          ]
        }
      ],
      "tags": [
        "hcp"
      ],
      "status": "ACTIVE",
      "typeId": 299,
      "priority": 33,
      "specifiers": [
        {
          "name": "hcp",
          "value": "-2.5"
        },
        {
          "name": "mapnr",
          "value": "2"
        }
      ]
    },
    {
      "id": "299h-1_5m2",
      "name": "2-я карта - Фора по раундам",
      "odds": [
        {
          "id": "1",
          "name": "Strife (-1.5)",
          "value": "2.28",
          "status": "NOT_RESULTED",
          "isActive": true,
          "competitorId": "gt:90760c35-6a61-46eb-bbd9-e763b0aa1ff0",
          "competitorIds": [
            "gt:90760c35-6a61-46eb-bbd9-e763b0aa1ff0"
          ]
        },
        {
          "id": "2",
          "name": "The Nomads (+1.5)",
          "value": "1.58",
          "status": "NOT_RESULTED",
          "isActive": true,
          "competitorId": "gt:98138",
          "competitorIds": [
            "gt:98138"
          ]
        }
      ],
      "tags": [
        "hcp"
      ],
      "status": "ACTIVE",
      "typeId": 299,
      "priority": 33,
      "specifiers": [
        {
          "name": "hcp",
          "value": "-1.5"
        },
        {
          "name": "mapnr",
          "value": "2"
        }
      ]
    },
    {
      "id": "300m2t21_5",
      "name": "2-я карта - Тотал раундов",
      "odds": [
        {
          "id": "1",
          "name": "Больше 21.5",
          "value": "2.37",
          "status": "NOT_RESULTED",
          "isActive": true,
          "competitorId": "",
          "competitorIds": []
        },
        {
          "id": "2",
          "name": "Меньше 21.5",
          "value": "1.55",
          "status": "NOT_RESULTED",
          "isActive": true,
          "competitorId": "",
          "competitorIds": []
        }
      ],
      "tags": [
        "total"
      ],
      "status": "ACTIVE",
      "typeId": 300,
      "priority": 35,
      "specifiers": [
        {
          "name": "mapnr",
          "value": "2"
        },
        {
          "name": "total",
          "value": "21.5"
        }
      ]
    },
    {
      "id": "300m1t21_5",
      "name": "1-я карта - Тотал раундов",
      "odds": [
        {
          "id": "1",
          "name": "Больше 21.5",
          "value": "1.73",
          "status": "NOT_RESULTED",
          "isActive": true,
          "competitorId": "",
          "competitorIds": []
        },
        {
          "id": "2",
          "name": "Меньше 21.5",
          "value": "2.04",
          "status": "NOT_RESULTED",
          "isActive": true,
          "competitorId": "",
          "competitorIds": []
        }
      ],
      "tags": [
        "total"
      ],
      "status": "ACTIVE",
      "typeId": 300,
      "priority": 35,
      "specifiers": [
        {
          "name": "mapnr",
          "value": "1"
        },
        {
          "name": "total",
          "value": "21.5"
        }
      ]
    },
    {
      "id": "450m1",
      "name": "1-я карта - Точный счет",
      "odds": [
        {
          "id": "1",
          "name": "13:0",
          "value": "23.17",
          "status": "LOSS",
          "isActive": false,
          "competitorId": "",
          "competitorIds": []
        },
        {
          "id": "2",
          "name": "13:1",
          "value": "17.40",
          "status": "LOSS",
          "isActive": false,
          "competitorId": "",
          "competitorIds": []
        },
        {
          "id": "3",
          "name": "13:2",
          "value": "23.62",
          "status": "LOSS",
          "isActive": false,
          "competitorId": "",
          "competitorIds": []
        },
        {
          "id": "4",
          "name": "13:3",
          "value": "13.32",
          "status": "LOSS",
          "isActive": false,
          "competitorId": "",
          "competitorIds": []
        },
        {
          "id": "5",
          "name": "13:4",
          "value": "17.32",
          "status": "LOSS",
          "isActive": false,
          "competitorId": "",
          "competitorIds": []
        },
        {
          "id": "6",
          "name": "13:5",
          "value": "23.05",
          "status": "NOT_RESULTED",
          "isActive": true,
          "competitorId": "",
          "competitorIds": []
        },
        {
          "id": "7",
          "name": "13:6",
          "value": "8.89",
          "status": "NOT_RESULTED",
          "isActive": true,
          "competitorId": "",
          "competitorIds": []
        },
        {
          "id": "8",
          "name": "13:7",
          "value": "15.25",
          "status": "NOT_RESULTED",
          "isActive": true,
          "competitorId": "",
          "competitorIds": []
        },
        {
          "id": "9",
          "name": "13:8",
          "value": "18.82",
          "status": "NOT_RESULTED",
          "isActive": true,
          "competitorId": "",
          "competitorIds": []
        },
        {
          "id": "10",
          "name": "13:9",
          "value": "10.17",
          "status": "NOT_RESULTED",
          "isActive": true,
          "competitorId": "",
          "competitorIds": []
        },
        {
          "id": "11",
          "name": "13:10",
          "value": "4.74",
          "status": "NOT_RESULTED",
          "isActive": true,
          "competitorId": "",
          "competitorIds": []
        },
        {
          "id": "12",
          "name": "13:11",
          "value": "16.92",
          "status": "NOT_RESULTED",
          "isActive": true,
          "competitorId": "",
          "competitorIds": []
        },
        {
          "id": "13",
          "name": "13:12",
          "value": "18.51",
          "status": "LOSS",
          "isActive": false,
          "competitorId": "",
          "competitorIds": []
        },
        {
          "id": "14",
          "name": "0:13",
          "value": "7.06",
          "status": "LOSS",
          "isActive": false,
          "competitorId": "",
          "competitorIds": []
        },
        {
          "id": "15",
          "name": "1:13",
          "value": "10.08",
          "status": "LOSS",
          "isActive": false,
          "competitorId": "",
          "competitorIds": []
        },
        {
          "id": "16",
          "name": "2:13",
          "value": "17.77",
          "status": "LOSS",
          "isActive": false,
          "competitorId": "",
          "competitorIds": []
        },
        {
          "id": "17",
          "name": "3:13",
          "value": "12.64",
          "status": "LOSS",
          "isActive": false,
          "competitorId": "",
          "competitorIds": []
        },
        {
          "id": "18",
          "name": "4:13",
          "value": "23.51",
          "status": "LOSS",
          "isActive": false,
          "competitorId": "",
          "competitorIds": []
        },
        {
          "id": "19",
          "name": "5:13",
          "value": "28.39",
          "status": "LOSS",
          "isActive": false,
          "competitorId": "",
          "competitorIds": []
        },
        {
          "id": "20",
          "name": "6:13",
          "value": "23.66",
          "status": "LOSS",
          "isActive": false,
          "competitorId": "",
          "competitorIds": []
        },
        {
          "id": "21",
          "name": "7:13",
          "value": "22.41",
          "status": "NOT_RESULTED",
          "isActive": true,
          "competitorId": "",
          "competitorIds": []
        },
        {
          "id": "22",
          "name": "8:13",
          "value": "16.86",
          "status": "NOT_RESULTED",
          "isActive": true,
          "competitorId": "",
          "competitorIds": []
        },
        {
          "id": "23",
          "name": "9:13",
          "value": "10.13",
          "status": "NOT_RESULTED",
          "isActive": true,
          "competitorId": "",
          "competitorIds": []
        },
        {
          "id": "24",
          "name": "10:13",
          "value": "13.24",
          "status": "NOT_RESULTED",
          "isActive": true,
          "competitorId": "",
          "competitorIds": []
        },
        {
          "id": "25",
          "name": "11:13",
          "value": "12.49",
          "status": "NOT_RESULTED",
          "isActive": true,
          "competitorId": "",
          "competitorIds": []
        },
        {
          "id": "26",
          "name": "12:13",
          "value": "27.23",
          "status": "LOSS",
          "isActive": false,
          "competitorId": "",
          "competitorIds": []
        }
      ],
      "tags": [
        "score"
      ],
      "status": "ACTIVE",
      "typeId": 450,
      "priority": 37,
      "specifiers": [
        {
          "name": "mapnr",
          "value": "1"
        }
      ]
    },
    {
      "id": "450m2",
      "name": "2-я карта - Точный счет",
      "odds": [
        {
          "id": "1",
          "name": "13:0",
          "value": "22.34",
          "status": "NOT_RESULTED",
          "isActive": true,
          "competitorId": "",
          "competitorIds": []
        },
        {
          "id": "2",
          "name": "13:1",
          "value": "16.84",
          "status": "NOT_RESULTED",
          "isActive": true,
          "competitorId": "",
          "competitorIds": []
        },
        {
          "id": "3",
          "name": "13:2",
          "value": "22.72",
          "status": "NOT_RESULTED",
          "isActive": true,
          "competitorId": "",
          "competitorIds": []
        },
        {
          "id": "4",
          "name": "13:3",
          "value": "12.50",
          "status": "NOT_RESULTED",
          "isActive": true,
          "competitorId": "",
          "competitorIds": []
        },
        {
          "id": "5",
          "name": "13:4",
          "value": "15.42",
          "status": "NOT_RESULTED",
          "isActive": true,
          "competitorId": "",
          "competitorIds": []
        },
        {
          "id": "6",
          "name": "13:5",
          "value": "22.66",
          "status": "NOT_RESULTED",
          "isActive": true,
          "competitorId": "",
          "competitorIds": []
        },
        {
          "id": "7",
          "name": "13:6",
          "value": "9.10",
          "status": "NOT_RESULTED",
          "isActive": true,
          "competitorId": "",
          "competitorIds": []
        },
        {
          "id": "8",
          "name": "13:7",
          "value": "15.99",
          "status": "NOT_RESULTED",
          "isActive": true,
          "competitorId": "",
          "competitorIds": []
        },
        {
          "id": "9",
          "name": "13:8",
          "value": "19.75",
          "status": "NOT_RESULTED",
          "isActive": true,
          "competitorId": "",
          "competitorIds": []
        },
        {
          "id": "10",
          "name": "13:9",
          "value": "11.54",
          "status": "NOT_RESULTED",
          "isActive": true,
          "competitorId": "",
          "competitorIds": []
        },
        {
          "id": "11",
          "name": "13:10",
          "value": "5.07",
          "status": "NOT_RESULTED",
          "isActive": true,
          "competitorId": "",
          "competitorIds": []
        },
        {
          "id": "12",
          "name": "13:11",
          "value": "17.70",
          "status": "NOT_RESULTED",
          "isActive": true,
          "competitorId": "",
          "competitorIds": []
        },
        {
          "id": "13",
          "name": "13:12",
          "value": "17.90",
          "status": "LOSS",
          "isActive": false,
          "competitorId": "",
          "competitorIds": []
        },
        {
          "id": "14",
          "name": "0:13",
          "value": "6.82",
          "status": "NOT_RESULTED",
          "isActive": true,
          "competitorId": "",
          "competitorIds": []
        },
        {
          "id": "15",
          "name": "1:13",
          "value": "9.85",
          "status": "NOT_RESULTED",
          "isActive": true,
          "competitorId": "",
          "competitorIds": []
        },
        {
          "id": "16",
          "name": "2:13",
          "value": "17.12",
          "status": "NOT_RESULTED",
          "isActive": true,
          "competitorId": "",
          "competitorIds": []
        },
        {
          "id": "17",
          "name": "3:13",
          "value": "11.95",
          "status": "NOT_RESULTED",
          "isActive": true,
          "competitorId": "",
          "competitorIds": []
        },
        {
          "id": "18",
          "name": "4:13",
          "value": "21.41",
          "status": "NOT_RESULTED",
          "isActive": true,
          "competitorId": "",
          "competitorIds": []
        },
        {
          "id": "19",
          "name": "5:13",
          "value": "24.86",
          "status": "NOT_RESULTED",
          "isActive": true,
          "competitorId": "",
          "competitorIds": []
        },
        {
          "id": "20",
          "name": "6:13",
          "value": "20.14",
          "status": "NOT_RESULTED",
          "isActive": true,
          "competitorId": "",
          "competitorIds": []
        },
        {
          "id": "21",
          "name": "7:13",
          "value": "19.93",
          "status": "NOT_RESULTED",
          "isActive": true,
          "competitorId": "",
          "competitorIds": []
        },
        {
          "id": "22",
          "name": "8:13",
          "value": "16.08",
          "status": "NOT_RESULTED",
          "isActive": true,
          "competitorId": "",
          "competitorIds": []
        },
        {
          "id": "23",
          "name": "9:13",
          "value": "10.33",
          "status": "NOT_RESULTED",
          "isActive": true,
          "competitorId": "",
          "competitorIds": []
        },
        {
          "id": "24",
          "name": "10:13",
          "value": "14.47",
          "status": "NOT_RESULTED",
          "isActive": true,
          "competitorId": "",
          "competitorIds": []
        },
        {
          "id": "25",
          "name": "11:13",
          "value": "14.13",
          "status": "NOT_RESULTED",
          "isActive": true,
          "competitorId": "",
          "competitorIds": []
        },
        {
          "id": "26",
          "name": "12:13",
          "value": "26.19",
          "status": "LOSS",
          "isActive": false,
          "competitorId": "",
          "competitorIds": []
        }
      ],
      "tags": [
        "score"
      ],
      "status": "ACTIVE",
      "typeId": 450,
      "priority": 37,
      "specifiers": [
        {
          "name": "mapnr",
          "value": "2"
        }
      ]
    },
    {
      "id": "538m1",
      "name": "1-я карта - Точный счет пистолетных раундов",
      "odds": [
        {
          "id": "1",
          "name": "2:0",
          "value": "2.09",
          "status": "NOT_RESULTED",
          "isActive": true,
          "competitorId": "",
          "competitorIds": []
        },
        {
          "id": "2",
          "name": "1:1",
          "value": "2.30",
          "status": "NOT_RESULTED",
          "isActive": true,
          "competitorId": "",
          "competitorIds": []
        },
        {
          "id": "3",
          "name": "0:2",
          "value": "5.13",
          "status": "NOT_RESULTED",
          "isActive": true,
          "competitorId": "",
          "competitorIds": []
        }
      ],
      "tags": [
        "score"
      ],
      "status": "ACTIVE",
      "typeId": 538,
      "priority": 40,
      "specifiers": [
        {
          "name": "mapnr",
          "value": "1"
        }
      ]
    },
    {
      "id": "538m2",
      "name": "2-я карта - Точный счет пистолетных раундов",
      "odds": [
        {
          "id": "1",
          "name": "2:0",
          "value": "2.08",
          "status": "NOT_RESULTED",
          "isActive": true,
          "competitorId": "",
          "competitorIds": []
        },
        {
          "id": "2",
          "name": "1:1",
          "value": "2.30",
          "status": "NOT_RESULTED",
          "isActive": true,
          "competitorId": "",
          "competitorIds": []
        },
        {
          "id": "3",
          "name": "0:2",
          "value": "5.12",
          "status": "NOT_RESULTED",
          "isActive": true,
          "competitorId": "",
          "competitorIds": []
        }
      ],
      "tags": [
        "score"
      ],
      "status": "ACTIVE",
      "typeId": 538,
      "priority": 40,
      "specifiers": [
        {
          "name": "mapnr",
          "value": "2"
        }
      ]
    },
    {
      "id": "545m1",
      "name": "1-я карта - К-во раундов чет/нечет",
      "odds": [
        {
          "id": "1",
          "name": "Нечет",
          "value": "3.18",
          "status": "NOT_RESULTED",
          "isActive": true,
          "competitorId": "",
          "competitorIds": []
        },
        {
          "id": "2",
          "name": "Чёт",
          "value": "1.32",
          "status": "NOT_RESULTED",
          "isActive": true,
          "competitorId": "",
          "competitorIds": []
        }
      ],
      "tags": [],
      "status": "ACTIVE",
      "typeId": 545,
      "priority": 44,
      "specifiers": [
        {
          "name": "mapnr",
          "value": "1"
        }
      ]
    },
    {
      "id": "545m2",
      "name": "2-я карта - К-во раундов чет/нечет",
      "odds": [
        {
          "id": "1",
          "name": "Нечет",
          "value": "2.81",
          "status": "NOT_RESULTED",
          "isActive": true,
          "competitorId": "",
          "competitorIds": []
        },
        {
          "id": "2",
          "name": "Чёт",
          "value": "1.40",
          "status": "NOT_RESULTED",
          "isActive": true,
          "competitorId": "",
          "competitorIds": []
        }
      ],
      "tags": [],
      "status": "ACTIVE",
      "typeId": 545,
      "priority": 44,
      "specifiers": [
        {
          "name": "mapnr",
          "value": "2"
        }
      ]
    }
  ],
  "version": "16a02a48-d62b-4ecb-81ee-dfed469e8fb7",
  "disabled": false,
  "providerId": "5",
  "hasMatchLog": false,
  "marketsCount": 23
}