{
    "tier_match_rate": {
        "tier_1": 1.0,
        "tier_2": 0,
        "tier_3": 0,
        "tier_4": 0,
        "tier_5": 0
    },
    "Ancient_tier1_strength": 0.3695906432748538,
    "Ancient_tier1_strength_log": {
        "map_winrate": {
            "value": 0,
            "value_normalized": 0.0,
            "query_id": "fake"
        },
        "rounds_winrate": {
            "team_eco": null,
            "opponent_eco": null,
            "value": 0,
            "value_normalized": 0.1578947368421052,
            "query_id": "fake"
        },
        "average_killed": {
            "team_eco": [
                "MixBuy",
                "MixBuy + 1 AWP",
                "MixBuy + 2 AWP",
                "MixBuy + 3 AWP",
                "Buy",
                "Buy + 1 AWP",
                "Buy + 2 AWP",
                "Buy + 3 AWP",
                "Buy + 4 AWP",
                "FullBuy",
                "FullBuy + 1 AWP",
                "FullBuy + 2 AWP"
            ],
            "opponent_eco": [
                "MixBuy",
                "MixBuy + 1 AWP",
                "MixBuy + 2 AWP",
                "MixBuy + 3 AWP",
                "Buy",
                "Buy + 1 AWP",
                "Buy + 2 AWP",
                "Buy + 3 AWP",
                "Buy + 4 AWP",
                "FullBuy",
                "FullBuy + 1 AWP",
                "FullBuy + 2 AWP"
            ],
            "value": 0,
            "value_normalized": 1.2222222222222223,
            "query_id": ""
        },
        "average_survived": {
            "team_eco": [
                "MixBuy",
                "MixBuy + 1 AWP",
                "MixBuy + 2 AWP",
                "MixBuy + 3 AWP",
                "Buy",
                "Buy + 1 AWP",
                "Buy + 2 AWP",
                "Buy + 3 AWP",
                "Buy + 4 AWP",
                "FullBuy",
                "FullBuy + 1 AWP",
                "FullBuy + 2 AWP"
            ],
            "opponent_eco": [
                "MixBuy",
                "MixBuy + 1 AWP",
                "MixBuy + 2 AWP",
                "MixBuy + 3 AWP",
                "Buy",
                "Buy + 1 AWP",
                "Buy + 2 AWP",
                "Buy + 3 AWP",
                "Buy + 4 AWP",
                "FullBuy",
                "FullBuy + 1 AWP",
                "FullBuy + 2 AWP"
            ],
            "value": 0,
            "value_normalized": 2.0,
            "query_id": "fake"
        }
    },
    "Ancient_tier2_strength": 0.36,
    "Ancient_tier2_strength_log": {
        "map_winrate": {
            "value": 0,
            "value_normalized": 0.0,
            "query_id": ""
        },
        "rounds_winrate": {
            "team_eco": null,
            "opponent_eco": null,
            "value": 0,
            "value_normalized": 0.2,
            "query_id": ""
        },
        "average_killed": {
            "team_eco": [
                "MixBuy",
                "MixBuy + 1 AWP",
                "MixBuy + 2 AWP",
                "MixBuy + 3 AWP",
                "Buy",
                "Buy + 1 AWP",
                "Buy + 2 AWP",
                "Buy + 3 AWP",
                "Buy + 4 AWP",
                "FullBuy",
                "FullBuy + 1 AWP",
                "FullBuy + 2 AWP"
            ],
            "opponent_eco": [
                "MixBuy",
                "MixBuy + 1 AWP",
                "MixBuy + 2 AWP",
                "MixBuy + 3 AWP",
                "Buy",
                "Buy + 1 AWP",
                "Buy + 2 AWP",
                "Buy + 3 AWP",
                "Buy + 4 AWP",
                "FullBuy",
                "FullBuy + 1 AWP",
                "FullBuy + 2 AWP"
            ],
            "value": 0,
            "value_normalized": 1.0,
            "query_id": ""
        },
        "average_survived": {
            "team_eco": [
                "MixBuy",
                "MixBuy + 1 AWP",
                "MixBuy + 2 AWP",
                "MixBuy + 3 AWP",
                "Buy",
                "Buy + 1 AWP",
                "Buy + 2 AWP",
                "Buy + 3 AWP",
                "Buy + 4 AWP",
                "FullBuy",
                "FullBuy + 1 AWP",
                "FullBuy + 2 AWP"
            ],
            "opponent_eco": [
                "MixBuy",
                "MixBuy + 1 AWP",
                "MixBuy + 2 AWP",
                "MixBuy + 3 AWP",
                "Buy",
                "Buy + 1 AWP",
                "Buy + 2 AWP",
                "Buy + 3 AWP",
                "Buy + 4 AWP",
                "FullBuy",
                "FullBuy + 1 AWP",
                "FullBuy + 2 AWP"
            ],
            "value": 0,
            "value_normalized": 2.0,
            "query_id": ""
        }
    },
    "Ancient_tier3_strength": 0.1964285714285714,
    "Ancient_tier3_strength_log": {
        "map_winrate": {
            "value": 0,
            "value_normalized": 0.0,
            "query_id": ""
        },
        "rounds_winrate": {
            "team_eco": null,
            "opponent_eco": null,
            "value": 0,
            "value_normalized": 0.238095238095238,
            "query_id": ""
        },
        "average_killed": {
            "team_eco": [
                "MixBuy",
                "MixBuy + 1 AWP",
                "MixBuy + 2 AWP",
                "MixBuy + 3 AWP",
                "Buy",
                "Buy + 1 AWP",
                "Buy + 2 AWP",
                "Buy + 3 AWP",
                "Buy + 4 AWP",
                "FullBuy",
                "FullBuy + 1 AWP",
                "FullBuy + 2 AWP"
            ],
            "opponent_eco": [
                "MixBuy",
                "MixBuy + 1 AWP",
                "MixBuy + 2 AWP",
                "MixBuy + 3 AWP",
                "Buy",
                "Buy + 1 AWP",
                "Buy + 2 AWP",
                "Buy + 3 AWP",
                "Buy + 4 AWP",
                "FullBuy",
                "FullBuy + 1 AWP",
                "FullBuy + 2 AWP"
            ],
            "value": 0,
            "value_normalized": 1.25,
            "query_id": ""
        },
        "average_survived": {
            "team_eco": [
                "MixBuy",
                "MixBuy + 1 AWP",
                "MixBuy + 2 AWP",
                "MixBuy + 3 AWP",
                "Buy",
                "Buy + 1 AWP",
                "Buy + 2 AWP",
                "Buy + 3 AWP",
                "Buy + 4 AWP",
                "FullBuy",
                "FullBuy + 1 AWP",
                "FullBuy + 2 AWP"
            ],
            "opponent_eco": [
                "MixBuy",
                "MixBuy + 1 AWP",
                "MixBuy + 2 AWP",
                "MixBuy + 3 AWP",
                "Buy",
                "Buy + 1 AWP",
                "Buy + 2 AWP",
                "Buy + 3 AWP",
                "Buy + 4 AWP",
                "FullBuy",
                "FullBuy + 1 AWP",
                "FullBuy + 2 AWP"
            ],
            "value": 0,
            "value_normalized": 0.0,
            "query_id": ""
        }
    },
    "Ancient_tier4_strength": 0.16403508771929826,
    "Ancient_tier4_strength_log": {
        "map_winrate": {
            "value": 0,
            "value_normalized": 0.0,
            "query_id": ""
        },
        "rounds_winrate": {
            "team_eco": null,
            "opponent_eco": null,
            "value": 0,
            "value_normalized": 0.1578947368421052,
            "query_id": ""
        },
        "average_killed": {
            "team_eco": [
                "MixBuy",
                "MixBuy + 1 AWP",
                "MixBuy + 2 AWP",
                "MixBuy + 3 AWP",
                "Buy",
                "Buy + 1 AWP",
                "Buy + 2 AWP",
                "Buy + 3 AWP",
                "Buy + 4 AWP",
                "FullBuy",
                "FullBuy + 1 AWP",
                "FullBuy + 2 AWP"
            ],
            "opponent_eco": [
                "MixBuy",
                "MixBuy + 1 AWP",
                "MixBuy + 2 AWP",
                "MixBuy + 3 AWP",
                "Buy",
                "Buy + 1 AWP",
                "Buy + 2 AWP",
                "Buy + 3 AWP",
                "Buy + 4 AWP",
                "FullBuy",
                "FullBuy + 1 AWP",
                "FullBuy + 2 AWP"
            ],
            "value": 0,
            "value_normalized": 1.1666666666666667,
            "query_id": ""
        },
        "average_survived": {
            "team_eco": [
                "MixBuy",
                "MixBuy + 1 AWP",
                "MixBuy + 2 AWP",
                "MixBuy + 3 AWP",
                "Buy",
                "Buy + 1 AWP",
                "Buy + 2 AWP",
                "Buy + 3 AWP",
                "Buy + 4 AWP",
                "FullBuy",
                "FullBuy + 1 AWP",
                "FullBuy + 2 AWP"
            ],
            "opponent_eco": [
                "MixBuy",
                "MixBuy + 1 AWP",
                "MixBuy + 2 AWP",
                "MixBuy + 3 AWP",
                "Buy",
                "Buy + 1 AWP",
                "Buy + 2 AWP",
                "Buy + 3 AWP",
                "Buy + 4 AWP",
                "FullBuy",
                "FullBuy + 1 AWP",
                "FullBuy + 2 AWP"
            ],
            "value": 0,
            "value_normalized": 0.0,
            "query_id": ""
        }
    },
    "Ancient_raw_strength": 0.14783625730994152,
    "Ancient_clipped_strength": 0.14783625730994152,
    "Ancient_normalized_strength": 5.927875243664717,
    "Anubis_tier1_strength": 0.46515151515151515,
    "Anubis_tier1_strength_log": {
        "map_winrate": {
            "value": 0,
            "value_normalized": 0.0,
            "query_id": "fake"
        },
        "rounds_winrate": {
            "team_eco": null,
            "opponent_eco": null,
            "value": 0,
            "value_normalized": 0.2727272727272727,
            "query_id": "fake"
        },
        "average_killed": {
            "team_eco": [
                "MixBuy",
                "MixBuy + 1 AWP",
                "MixBuy + 2 AWP",
                "MixBuy + 3 AWP",
                "Buy",
                "Buy + 1 AWP",
                "Buy + 2 AWP",
                "Buy + 3 AWP",
                "Buy + 4 AWP",
                "FullBuy",
                "FullBuy + 1 AWP",
                "FullBuy + 2 AWP"
            ],
            "opponent_eco": [
                "MixBuy",
                "MixBuy + 1 AWP",
                "MixBuy + 2 AWP",
                "MixBuy + 3 AWP",
                "Buy",
                "Buy + 1 AWP",
                "Buy + 2 AWP",
                "Buy + 3 AWP",
                "Buy + 4 AWP",
                "FullBuy",
                "FullBuy + 1 AWP",
                "FullBuy + 2 AWP"
            ],
            "value": 0,
            "value_normalized": 1.5,
            "query_id": ""
        },
        "average_survived": {
            "team_eco": [
                "MixBuy",
                "MixBuy + 1 AWP",
                "MixBuy + 2 AWP",
                "MixBuy + 3 AWP",
                "Buy",
                "Buy + 1 AWP",
                "Buy + 2 AWP",
                "Buy + 3 AWP",
                "Buy + 4 AWP",
                "FullBuy",
                "FullBuy + 1 AWP",
                "FullBuy + 2 AWP"
            ],
            "opponent_eco": [
                "MixBuy",
                "MixBuy + 1 AWP",
                "MixBuy + 2 AWP",
                "MixBuy + 3 AWP",
                "Buy",
                "Buy + 1 AWP",
                "Buy + 2 AWP",
                "Buy + 3 AWP",
                "Buy + 4 AWP",
                "FullBuy",
                "FullBuy + 1 AWP",
                "FullBuy + 2 AWP"
            ],
            "value": 0,
            "value_normalized": 2.333333333333333,
            "query_id": "fake"
        }
    },
    "Anubis_tier2_strength": 0.3,
    "Anubis_tier2_strength_log": {
        "map_winrate": {
            "value": 0,
            "value_normalized": 0.0,
            "query_id": ""
        },
        "rounds_winrate": {
            "team_eco": null,
            "opponent_eco": null,
            "value": 0,
            "value_normalized": 0.2,
            "query_id": ""
        },
        "average_killed": {
            "team_eco": [
                "MixBuy",
                "MixBuy + 1 AWP",
                "MixBuy + 2 AWP",
                "MixBuy + 3 AWP",
                "Buy",
                "Buy + 1 AWP",
                "Buy + 2 AWP",
                "Buy + 3 AWP",
                "Buy + 4 AWP",
                "FullBuy",
                "FullBuy + 1 AWP",
                "FullBuy + 2 AWP"
            ],
            "opponent_eco": [
                "MixBuy",
                "MixBuy + 1 AWP",
                "MixBuy + 2 AWP",
                "MixBuy + 3 AWP",
                "Buy",
                "Buy + 1 AWP",
                "Buy + 2 AWP",
                "Buy + 3 AWP",
                "Buy + 4 AWP",
                "FullBuy",
                "FullBuy + 1 AWP",
                "FullBuy + 2 AWP"
            ],
            "value": 0,
            "value_normalized": 1.4,
            "query_id": ""
        },
        "average_survived": {
            "team_eco": [
                "MixBuy",
                "MixBuy + 1 AWP",
                "MixBuy + 2 AWP",
                "MixBuy + 3 AWP",
                "Buy",
                "Buy + 1 AWP",
                "Buy + 2 AWP",
                "Buy + 3 AWP",
                "Buy + 4 AWP",
                "FullBuy",
                "FullBuy + 1 AWP",
                "FullBuy + 2 AWP"
            ],
            "opponent_eco": [
                "MixBuy",
                "MixBuy + 1 AWP",
                "MixBuy + 2 AWP",
                "MixBuy + 3 AWP",
                "Buy",
                "Buy + 1 AWP",
                "Buy + 2 AWP",
                "Buy + 3 AWP",
                "Buy + 4 AWP",
                "FullBuy",
                "FullBuy + 1 AWP",
                "FullBuy + 2 AWP"
            ],
            "value": 0,
            "value_normalized": 1.0,
            "query_id": ""
        }
    },
    "Anubis_tier3_strength": 0.28500000000000003,
    "Anubis_tier3_strength_log": {
        "map_winrate": {
            "value": 0,
            "value_normalized": 0.0,
            "query_id": ""
        },
        "rounds_winrate": {
            "team_eco": null,
            "opponent_eco": null,
            "value": 0,
            "value_normalized": 0.2,
            "query_id": ""
        },
        "average_killed": {
            "team_eco": [
                "MixBuy",
                "MixBuy + 1 AWP",
                "MixBuy + 2 AWP",
                "MixBuy + 3 AWP",
                "Buy",
                "Buy + 1 AWP",
                "Buy + 2 AWP",
                "Buy + 3 AWP",
                "Buy + 4 AWP",
                "FullBuy",
                "FullBuy + 1 AWP",
                "FullBuy + 2 AWP"
            ],
            "opponent_eco": [
                "MixBuy",
                "MixBuy + 1 AWP",
                "MixBuy + 2 AWP",
                "MixBuy + 3 AWP",
                "Buy",
                "Buy + 1 AWP",
                "Buy + 2 AWP",
                "Buy + 3 AWP",
                "Buy + 4 AWP",
                "FullBuy",
                "FullBuy + 1 AWP",
                "FullBuy + 2 AWP"
            ],
            "value": 0,
            "value_normalized": 1.25,
            "query_id": ""
        },
        "average_survived": {
            "team_eco": [
                "MixBuy",
                "MixBuy + 1 AWP",
                "MixBuy + 2 AWP",
                "MixBuy + 3 AWP",
                "Buy",
                "Buy + 1 AWP",
                "Buy + 2 AWP",
                "Buy + 3 AWP",
                "Buy + 4 AWP",
                "FullBuy",
                "FullBuy + 1 AWP",
                "FullBuy + 2 AWP"
            ],
            "opponent_eco": [
                "MixBuy",
                "MixBuy + 1 AWP",
                "MixBuy + 2 AWP",
                "MixBuy + 3 AWP",
                "Buy",
                "Buy + 1 AWP",
                "Buy + 2 AWP",
                "Buy + 3 AWP",
                "Buy + 4 AWP",
                "FullBuy",
                "FullBuy + 1 AWP",
                "FullBuy + 2 AWP"
            ],
            "value": 0,
            "value_normalized": 1.0,
            "query_id": ""
        }
    },
    "Anubis_tier4_strength": 0.29736842105263156,
    "Anubis_tier4_strength_log": {
        "map_winrate": {
            "value": 0,
            "value_normalized": 0.0,
            "query_id": ""
        },
        "rounds_winrate": {
            "team_eco": null,
            "opponent_eco": null,
            "value": 0,
            "value_normalized": 0.1578947368421052,
            "query_id": ""
        },
        "average_killed": {
            "team_eco": [
                "MixBuy",
                "MixBuy + 1 AWP",
                "MixBuy + 2 AWP",
                "MixBuy + 3 AWP",
                "Buy",
                "Buy + 1 AWP",
                "Buy + 2 AWP",
                "Buy + 3 AWP",
                "Buy + 4 AWP",
                "FullBuy",
                "FullBuy + 1 AWP",
                "FullBuy + 2 AWP"
            ],
            "opponent_eco": [
                "MixBuy",
                "MixBuy + 1 AWP",
                "MixBuy + 2 AWP",
                "MixBuy + 3 AWP",
                "Buy",
                "Buy + 1 AWP",
                "Buy + 2 AWP",
                "Buy + 3 AWP",
                "Buy + 4 AWP",
                "FullBuy",
                "FullBuy + 1 AWP",
                "FullBuy + 2 AWP"
            ],
            "value": 0,
            "value_normalized": 0.6666666666666666,
            "query_id": ""
        },
        "average_survived": {
            "team_eco": [
                "MixBuy",
                "MixBuy + 1 AWP",
                "MixBuy + 2 AWP",
                "MixBuy + 3 AWP",
                "Buy",
                "Buy + 1 AWP",
                "Buy + 2 AWP",
                "Buy + 3 AWP",
                "Buy + 4 AWP",
                "FullBuy",
                "FullBuy + 1 AWP",
                "FullBuy + 2 AWP"
            ],
            "opponent_eco": [
                "MixBuy",
                "MixBuy + 1 AWP",
                "MixBuy + 2 AWP",
                "MixBuy + 3 AWP",
                "Buy",
                "Buy + 1 AWP",
                "Buy + 2 AWP",
                "Buy + 3 AWP",
                "Buy + 4 AWP",
                "FullBuy",
                "FullBuy + 1 AWP",
                "FullBuy + 2 AWP"
            ],
            "value": 0,
            "value_normalized": 1.8333333333333333,
            "query_id": ""
        }
    },
    "Anubis_raw_strength": 0.18606060606060607,
    "Anubis_clipped_strength": 0.18606060606060607,
    "Anubis_normalized_strength": 7.2020202020202015,
    "Inferno_tier1_strength": 0.9875886524822695,
    "Inferno_tier1_strength_log": {
        "map_winrate": {
            "value": 1.0,
            "value_normalized": 1.0,
            "query_id": "fake"
        },
        "rounds_winrate": {
            "team_eco": null,
            "opponent_eco": null,
            "value": 0.9375,
            "value_normalized": 0.6808510638297872,
            "query_id": "fake"
        },
        "average_killed": {
            "team_eco": [
                "MixBuy",
                "MixBuy + 1 AWP",
                "MixBuy + 2 AWP",
                "MixBuy + 3 AWP",
                "Buy",
                "Buy + 1 AWP",
                "Buy + 2 AWP",
                "Buy + 3 AWP",
                "Buy + 4 AWP",
                "FullBuy",
                "FullBuy + 1 AWP",
                "FullBuy + 2 AWP"
            ],
            "opponent_eco": [
                "MixBuy",
                "MixBuy + 1 AWP",
                "MixBuy + 2 AWP",
                "MixBuy + 3 AWP",
                "Buy",
                "Buy + 1 AWP",
                "Buy + 2 AWP",
                "Buy + 3 AWP",
                "Buy + 4 AWP",
                "FullBuy",
                "FullBuy + 1 AWP",
                "FullBuy + 2 AWP"
            ],
            "value": 0,
            "value_normalized": 1.1666666666666667,
            "query_id": ""
        },
        "average_survived": {
            "team_eco": [
                "MixBuy",
                "MixBuy + 1 AWP",
                "MixBuy + 2 AWP",
                "MixBuy + 3 AWP",
                "Buy",
                "Buy + 1 AWP",
                "Buy + 2 AWP",
                "Buy + 3 AWP",
                "Buy + 4 AWP",
                "FullBuy",
                "FullBuy + 1 AWP",
                "FullBuy + 2 AWP"
            ],
            "opponent_eco": [
                "MixBuy",
                "MixBuy + 1 AWP",
                "MixBuy + 2 AWP",
                "MixBuy + 3 AWP",
                "Buy",
                "Buy + 1 AWP",
                "Buy + 2 AWP",
                "Buy + 3 AWP",
                "Buy + 4 AWP",
                "FullBuy",
                "FullBuy + 1 AWP",
                "FullBuy + 2 AWP"
            ],
            "value": 3.25,
            "value_normalized": 1.6666666666666667,
            "query_id": "fake"
        }
    },
    "Inferno_tier2_strength": 0.23045454545454544,
    "Inferno_tier2_strength_log": {
        "map_winrate": {
            "value": 0,
            "value_normalized": 0.0,
            "query_id": ""
        },
        "rounds_winrate": {
            "team_eco": null,
            "opponent_eco": null,
            "value": 0,
            "value_normalized": 0.2,
            "query_id": ""
        },
        "average_killed": {
            "team_eco": [
                "MixBuy",
                "MixBuy + 1 AWP",
                "MixBuy + 2 AWP",
                "MixBuy + 3 AWP",
                "Buy",
                "Buy + 1 AWP",
                "Buy + 2 AWP",
                "Buy + 3 AWP",
                "Buy + 4 AWP",
                "FullBuy",
                "FullBuy + 1 AWP",
                "FullBuy + 2 AWP"
            ],
            "opponent_eco": [
                "MixBuy",
                "MixBuy + 1 AWP",
                "MixBuy + 2 AWP",
                "MixBuy + 3 AWP",
                "Buy",
                "Buy + 1 AWP",
                "Buy + 2 AWP",
                "Buy + 3 AWP",
                "Buy + 4 AWP",
                "FullBuy",
                "FullBuy + 1 AWP",
                "FullBuy + 2 AWP"
            ],
            "value": 0,
            "value_normalized": 0.4545454545454545,
            "query_id": ""
        },
        "average_survived": {
            "team_eco": [
                "MixBuy",
                "MixBuy + 1 AWP",
                "MixBuy + 2 AWP",
                "MixBuy + 3 AWP",
                "Buy",
                "Buy + 1 AWP",
                "Buy + 2 AWP",
                "Buy + 3 AWP",
                "Buy + 4 AWP",
                "FullBuy",
                "FullBuy + 1 AWP",
                "FullBuy + 2 AWP"
            ],
            "opponent_eco": [
                "MixBuy",
                "MixBuy + 1 AWP",
                "MixBuy + 2 AWP",
                "MixBuy + 3 AWP",
                "Buy",
                "Buy + 1 AWP",
                "Buy + 2 AWP",
                "Buy + 3 AWP",
                "Buy + 4 AWP",
                "FullBuy",
                "FullBuy + 1 AWP",
                "FullBuy + 2 AWP"
            ],
            "value": 0,
            "value_normalized": 1.25,
            "query_id": ""
        }
    },
    "Inferno_tier3_strength": 0.3281376518218624,
    "Inferno_tier3_strength_log": {
        "map_winrate": {
            "value": 0,
            "value_normalized": 0.0,
            "query_id": ""
        },
        "rounds_winrate": {
            "team_eco": null,
            "opponent_eco": null,
            "value": 0,
            "value_normalized": 0.1578947368421052,
            "query_id": ""
        },
        "average_killed": {
            "team_eco": [
                "MixBuy",
                "MixBuy + 1 AWP",
                "MixBuy + 2 AWP",
                "MixBuy + 3 AWP",
                "Buy",
                "Buy + 1 AWP",
                "Buy + 2 AWP",
                "Buy + 3 AWP",
                "Buy + 4 AWP",
                "FullBuy",
                "FullBuy + 1 AWP",
                "FullBuy + 2 AWP"
            ],
            "opponent_eco": [
                "MixBuy",
                "MixBuy + 1 AWP",
                "MixBuy + 2 AWP",
                "MixBuy + 3 AWP",
                "Buy",
                "Buy + 1 AWP",
                "Buy + 2 AWP",
                "Buy + 3 AWP",
                "Buy + 4 AWP",
                "FullBuy",
                "FullBuy + 1 AWP",
                "FullBuy + 2 AWP"
            ],
            "value": 0,
            "value_normalized": 1.3076923076923077,
            "query_id": ""
        },
        "average_survived": {
            "team_eco": [
                "MixBuy",
                "MixBuy + 1 AWP",
                "MixBuy + 2 AWP",
                "MixBuy + 3 AWP",
                "Buy",
                "Buy + 1 AWP",
                "Buy + 2 AWP",
                "Buy + 3 AWP",
                "Buy + 4 AWP",
                "FullBuy",
                "FullBuy + 1 AWP",
                "FullBuy + 2 AWP"
            ],
            "opponent_eco": [
                "MixBuy",
                "MixBuy + 1 AWP",
                "MixBuy + 2 AWP",
                "MixBuy + 3 AWP",
                "Buy",
                "Buy + 1 AWP",
                "Buy + 2 AWP",
                "Buy + 3 AWP",
                "Buy + 4 AWP",
                "FullBuy",
                "FullBuy + 1 AWP",
                "FullBuy + 2 AWP"
            ],
            "value": 0,
            "value_normalized": 1.5,
            "query_id": ""
        }
    },
    "Inferno_tier4_strength": 0.4425722425722426,
    "Inferno_tier4_strength_log": {
        "map_winrate": {
            "value": 0,
            "value_normalized": 0.0,
            "query_id": ""
        },
        "rounds_winrate": {
            "team_eco": null,
            "opponent_eco": null,
            "value": 0,
            "value_normalized": 0.2600732600732601,
            "query_id": ""
        },
        "average_killed": {
            "team_eco": [
                "MixBuy",
                "MixBuy + 1 AWP",
                "MixBuy + 2 AWP",
                "MixBuy + 3 AWP",
                "Buy",
                "Buy + 1 AWP",
                "Buy + 2 AWP",
                "Buy + 3 AWP",
                "Buy + 4 AWP",
                "FullBuy",
                "FullBuy + 1 AWP",
                "FullBuy + 2 AWP"
            ],
            "opponent_eco": [
                "MixBuy",
                "MixBuy + 1 AWP",
                "MixBuy + 2 AWP",
                "MixBuy + 3 AWP",
                "Buy",
                "Buy + 1 AWP",
                "Buy + 2 AWP",
                "Buy + 3 AWP",
                "Buy + 4 AWP",
                "FullBuy",
                "FullBuy + 1 AWP",
                "FullBuy + 2 AWP"
            ],
            "value": 0,
            "value_normalized": 1.5714285714285714,
            "query_id": ""
        },
        "average_survived": {
            "team_eco": [
                "MixBuy",
                "MixBuy + 1 AWP",
                "MixBuy + 2 AWP",
                "MixBuy + 3 AWP",
                "Buy",
                "Buy + 1 AWP",
                "Buy + 2 AWP",
                "Buy + 3 AWP",
                "Buy + 4 AWP",
                "FullBuy",
                "FullBuy + 1 AWP",
                "FullBuy + 2 AWP"
            ],
            "opponent_eco": [
                "MixBuy",
                "MixBuy + 1 AWP",
                "MixBuy + 2 AWP",
                "MixBuy + 3 AWP",
                "Buy",
                "Buy + 1 AWP",
                "Buy + 2 AWP",
                "Buy + 3 AWP",
                "Buy + 4 AWP",
                "FullBuy",
                "FullBuy + 1 AWP",
                "FullBuy + 2 AWP"
            ],
            "value": 0,
            "value_normalized": 2.074074074074074,
            "query_id": ""
        }
    },
    "Inferno_raw_strength": 0.3950354609929078,
    "Inferno_clipped_strength": 0.27,
    "Inferno_normalized_strength": 10.0,
    "Mirage_tier1_strength": 0.3902255639097745,
    "Mirage_tier1_strength_log": {
        "map_winrate": {
            "value": 0,
            "value_normalized": 0.0,
            "query_id": "fake"
        },
        "rounds_winrate": {
            "team_eco": null,
            "opponent_eco": null,
            "value": 0,
            "value_normalized": 0.1578947368421052,
            "query_id": "fake"
        },
        "average_killed": {
            "team_eco": [
                "MixBuy",
                "MixBuy + 1 AWP",
                "MixBuy + 2 AWP",
                "MixBuy + 3 AWP",
                "Buy",
                "Buy + 1 AWP",
                "Buy + 2 AWP",
                "Buy + 3 AWP",
                "Buy + 4 AWP",
                "FullBuy",
                "FullBuy + 1 AWP",
                "FullBuy + 2 AWP"
            ],
            "opponent_eco": [
                "MixBuy",
                "MixBuy + 1 AWP",
                "MixBuy + 2 AWP",
                "MixBuy + 3 AWP",
                "Buy",
                "Buy + 1 AWP",
                "Buy + 2 AWP",
                "Buy + 3 AWP",
                "Buy + 4 AWP",
                "FullBuy",
                "FullBuy + 1 AWP",
                "FullBuy + 2 AWP"
            ],
            "value": 0,
            "value_normalized": 1.4285714285714286,
            "query_id": ""
        },
        "average_survived": {
            "team_eco": [
                "MixBuy",
                "MixBuy + 1 AWP",
                "MixBuy + 2 AWP",
                "MixBuy + 3 AWP",
                "Buy",
                "Buy + 1 AWP",
                "Buy + 2 AWP",
                "Buy + 3 AWP",
                "Buy + 4 AWP",
                "FullBuy",
                "FullBuy + 1 AWP",
                "FullBuy + 2 AWP"
            ],
            "opponent_eco": [
                "MixBuy",
                "MixBuy + 1 AWP",
                "MixBuy + 2 AWP",
                "MixBuy + 3 AWP",
                "Buy",
                "Buy + 1 AWP",
                "Buy + 2 AWP",
                "Buy + 3 AWP",
                "Buy + 4 AWP",
                "FullBuy",
                "FullBuy + 1 AWP",
                "FullBuy + 2 AWP"
            ],
            "value": 0,
            "value_normalized": 2.0,
            "query_id": "fake"
        }
    },
    "Mirage_tier2_strength": 0.11764705882352941,
    "Mirage_tier2_strength_log": {
        "map_winrate": {
            "value": 0,
            "value_normalized": 0.0,
            "query_id": ""
        },
        "rounds_winrate": {
            "team_eco": null,
            "opponent_eco": null,
            "value": 0,
            "value_normalized": 0.0588235294117647,
            "query_id": ""
        },
        "average_killed": {
            "team_eco": [
                "MixBuy",
                "MixBuy + 1 AWP",
                "MixBuy + 2 AWP",
                "MixBuy + 3 AWP",
                "Buy",
                "Buy + 1 AWP",
                "Buy + 2 AWP",
                "Buy + 3 AWP",
                "Buy + 4 AWP",
                "FullBuy",
                "FullBuy + 1 AWP",
                "FullBuy + 2 AWP"
            ],
            "opponent_eco": [
                "MixBuy",
                "MixBuy + 1 AWP",
                "MixBuy + 2 AWP",
                "MixBuy + 3 AWP",
                "Buy",
                "Buy + 1 AWP",
                "Buy + 2 AWP",
                "Buy + 3 AWP",
                "Buy + 4 AWP",
                "FullBuy",
                "FullBuy + 1 AWP",
                "FullBuy + 2 AWP"
            ],
            "value": 0,
            "value_normalized": 1.0,
            "query_id": ""
        },
        "average_survived": {
            "team_eco": [
                "MixBuy",
                "MixBuy + 1 AWP",
                "MixBuy + 2 AWP",
                "MixBuy + 3 AWP",
                "Buy",
                "Buy + 1 AWP",
                "Buy + 2 AWP",
                "Buy + 3 AWP",
                "Buy + 4 AWP",
                "FullBuy",
                "FullBuy + 1 AWP",
                "FullBuy + 2 AWP"
            ],
            "opponent_eco": [
                "MixBuy",
                "MixBuy + 1 AWP",
                "MixBuy + 2 AWP",
                "MixBuy + 3 AWP",
                "Buy",
                "Buy + 1 AWP",
                "Buy + 2 AWP",
                "Buy + 3 AWP",
                "Buy + 4 AWP",
                "FullBuy",
                "FullBuy + 1 AWP",
                "FullBuy + 2 AWP"
            ],
            "value": 0,
            "value_normalized": 0.0,
            "query_id": ""
        }
    },
    "Mirage_tier3_strength": 0.11764705882352941,
    "Mirage_tier3_strength_log": {
        "map_winrate": {
            "value": 0,
            "value_normalized": 0.0,
            "query_id": ""
        },
        "rounds_winrate": {
            "team_eco": null,
            "opponent_eco": null,
            "value": 0,
            "value_normalized": 0.0588235294117647,
            "query_id": ""
        },
        "average_killed": {
            "team_eco": [
                "MixBuy",
                "MixBuy + 1 AWP",
                "MixBuy + 2 AWP",
                "MixBuy + 3 AWP",
                "Buy",
                "Buy + 1 AWP",
                "Buy + 2 AWP",
                "Buy + 3 AWP",
                "Buy + 4 AWP",
                "FullBuy",
                "FullBuy + 1 AWP",
                "FullBuy + 2 AWP"
            ],
            "opponent_eco": [
                "MixBuy",
                "MixBuy + 1 AWP",
                "MixBuy + 2 AWP",
                "MixBuy + 3 AWP",
                "Buy",
                "Buy + 1 AWP",
                "Buy + 2 AWP",
                "Buy + 3 AWP",
                "Buy + 4 AWP",
                "FullBuy",
                "FullBuy + 1 AWP",
                "FullBuy + 2 AWP"
            ],
            "value": 0,
            "value_normalized": 1.0,
            "query_id": ""
        },
        "average_survived": {
            "team_eco": [
                "MixBuy",
                "MixBuy + 1 AWP",
                "MixBuy + 2 AWP",
                "MixBuy + 3 AWP",
                "Buy",
                "Buy + 1 AWP",
                "Buy + 2 AWP",
                "Buy + 3 AWP",
                "Buy + 4 AWP",
                "FullBuy",
                "FullBuy + 1 AWP",
                "FullBuy + 2 AWP"
            ],
            "opponent_eco": [
                "MixBuy",
                "MixBuy + 1 AWP",
                "MixBuy + 2 AWP",
                "MixBuy + 3 AWP",
                "Buy",
                "Buy + 1 AWP",
                "Buy + 2 AWP",
                "Buy + 3 AWP",
                "Buy + 4 AWP",
                "FullBuy",
                "FullBuy + 1 AWP",
                "FullBuy + 2 AWP"
            ],
            "value": 0,
            "value_normalized": 0.0,
            "query_id": ""
        }
    },
    "Mirage_tier4_strength": 0.06153846153846153,
    "Mirage_tier4_strength_log": {
        "map_winrate": {
            "value": 0,
            "value_normalized": 0.0,
            "query_id": ""
        },
        "rounds_winrate": {
            "team_eco": null,
            "opponent_eco": null,
            "value": 0,
            "value_normalized": 0.2051282051282051,
            "query_id": ""
        },
        "average_killed": {
            "team_eco": [
                "MixBuy",
                "MixBuy + 1 AWP",
                "MixBuy + 2 AWP",
                "MixBuy + 3 AWP",
                "Buy",
                "Buy + 1 AWP",
                "Buy + 2 AWP",
                "Buy + 3 AWP",
                "Buy + 4 AWP",
                "FullBuy",
                "FullBuy + 1 AWP",
                "FullBuy + 2 AWP"
            ],
            "opponent_eco": [
                "MixBuy",
                "MixBuy + 1 AWP",
                "MixBuy + 2 AWP",
                "MixBuy + 3 AWP",
                "Buy",
                "Buy + 1 AWP",
                "Buy + 2 AWP",
                "Buy + 3 AWP",
                "Buy + 4 AWP",
                "FullBuy",
                "FullBuy + 1 AWP",
                "FullBuy + 2 AWP"
            ],
            "value": 0,
            "value_normalized": 0.0,
            "query_id": ""
        },
        "average_survived": {
            "team_eco": [
                "MixBuy",
                "MixBuy + 1 AWP",
                "MixBuy + 2 AWP",
                "MixBuy + 3 AWP",
                "Buy",
                "Buy + 1 AWP",
                "Buy + 2 AWP",
                "Buy + 3 AWP",
                "Buy + 4 AWP",
                "FullBuy",
                "FullBuy + 1 AWP",
                "FullBuy + 2 AWP"
            ],
            "opponent_eco": [
                "MixBuy",
                "MixBuy + 1 AWP",
                "MixBuy + 2 AWP",
                "MixBuy + 3 AWP",
                "Buy",
                "Buy + 1 AWP",
                "Buy + 2 AWP",
                "Buy + 3 AWP",
                "Buy + 4 AWP",
                "FullBuy",
                "FullBuy + 1 AWP",
                "FullBuy + 2 AWP"
            ],
            "value": 0,
            "value_normalized": 0.0,
            "query_id": ""
        }
    },
    "Mirage_raw_strength": 0.1560902255639098,
    "Mirage_clipped_strength": 0.1560902255639098,
    "Mirage_normalized_strength": 6.203007518796993,
    "Nuke_tier1_strength": 0.43315789473684213,
    "Nuke_tier1_strength_log": {
        "map_winrate": {
            "value": 0,
            "value_normalized": 0.0,
            "query_id": "fake"
        },
        "rounds_winrate": {
            "team_eco": null,
            "opponent_eco": null,
            "value": 0,
            "value_normalized": 0.2105263157894736,
            "query_id": "fake"
        },
        "average_killed": {
            "team_eco": [
                "MixBuy",
                "MixBuy + 1 AWP",
                "MixBuy + 2 AWP",
                "MixBuy + 3 AWP",
                "Buy",
                "Buy + 1 AWP",
                "Buy + 2 AWP",
                "Buy + 3 AWP",
                "Buy + 4 AWP",
                "FullBuy",
                "FullBuy + 1 AWP",
                "FullBuy + 2 AWP"
            ],
            "opponent_eco": [
                "MixBuy",
                "MixBuy + 1 AWP",
                "MixBuy + 2 AWP",
                "MixBuy + 3 AWP",
                "Buy",
                "Buy + 1 AWP",
                "Buy + 2 AWP",
                "Buy + 3 AWP",
                "Buy + 4 AWP",
                "FullBuy",
                "FullBuy + 1 AWP",
                "FullBuy + 2 AWP"
            ],
            "value": 0,
            "value_normalized": 1.5,
            "query_id": ""
        },
        "average_survived": {
            "team_eco": [
                "MixBuy",
                "MixBuy + 1 AWP",
                "MixBuy + 2 AWP",
                "MixBuy + 3 AWP",
                "Buy",
                "Buy + 1 AWP",
                "Buy + 2 AWP",
                "Buy + 3 AWP",
                "Buy + 4 AWP",
                "FullBuy",
                "FullBuy + 1 AWP",
                "FullBuy + 2 AWP"
            ],
            "opponent_eco": [
                "MixBuy",
                "MixBuy + 1 AWP",
                "MixBuy + 2 AWP",
                "MixBuy + 3 AWP",
                "Buy",
                "Buy + 1 AWP",
                "Buy + 2 AWP",
                "Buy + 3 AWP",
                "Buy + 4 AWP",
                "FullBuy",
                "FullBuy + 1 AWP",
                "FullBuy + 2 AWP"
            ],
            "value": 0,
            "value_normalized": 2.2,
            "query_id": "fake"
        }
    },
    "Nuke_tier2_strength": 0.2833333333333333,
    "Nuke_tier2_strength_log": {
        "map_winrate": {
            "value": 0,
            "value_normalized": 0.0,
            "query_id": ""
        },
        "rounds_winrate": {
            "team_eco": null,
            "opponent_eco": null,
            "value": 0,
            "value_normalized": 0.1111111111111111,
            "query_id": ""
        },
        "average_killed": {
            "team_eco": [
                "MixBuy",
                "MixBuy + 1 AWP",
                "MixBuy + 2 AWP",
                "MixBuy + 3 AWP",
                "Buy",
                "Buy + 1 AWP",
                "Buy + 2 AWP",
                "Buy + 3 AWP",
                "Buy + 4 AWP",
                "FullBuy",
                "FullBuy + 1 AWP",
                "FullBuy + 2 AWP"
            ],
            "opponent_eco": [
                "MixBuy",
                "MixBuy + 1 AWP",
                "MixBuy + 2 AWP",
                "MixBuy + 3 AWP",
                "Buy",
                "Buy + 1 AWP",
                "Buy + 2 AWP",
                "Buy + 3 AWP",
                "Buy + 4 AWP",
                "FullBuy",
                "FullBuy + 1 AWP",
                "FullBuy + 2 AWP"
            ],
            "value": 0,
            "value_normalized": 1.0,
            "query_id": ""
        },
        "average_survived": {
            "team_eco": [
                "MixBuy",
                "MixBuy + 1 AWP",
                "MixBuy + 2 AWP",
                "MixBuy + 3 AWP",
                "Buy",
                "Buy + 1 AWP",
                "Buy + 2 AWP",
                "Buy + 3 AWP",
                "Buy + 4 AWP",
                "FullBuy",
                "FullBuy + 1 AWP",
                "FullBuy + 2 AWP"
            ],
            "opponent_eco": [
                "MixBuy",
                "MixBuy + 1 AWP",
                "MixBuy + 2 AWP",
                "MixBuy + 3 AWP",
                "Buy",
                "Buy + 1 AWP",
                "Buy + 2 AWP",
                "Buy + 3 AWP",
                "Buy + 4 AWP",
                "FullBuy",
                "FullBuy + 1 AWP",
                "FullBuy + 2 AWP"
            ],
            "value": 0,
            "value_normalized": 1.5,
            "query_id": ""
        }
    },
    "Nuke_tier3_strength": 0.1343137254901961,
    "Nuke_tier3_strength_log": {
        "map_winrate": {
            "value": 0,
            "value_normalized": 0.0,
            "query_id": ""
        },
        "rounds_winrate": {
            "team_eco": null,
            "opponent_eco": null,
            "value": 0,
            "value_normalized": 0.0588235294117647,
            "query_id": ""
        },
        "average_killed": {
            "team_eco": [
                "MixBuy",
                "MixBuy + 1 AWP",
                "MixBuy + 2 AWP",
                "MixBuy + 3 AWP",
                "Buy",
                "Buy + 1 AWP",
                "Buy + 2 AWP",
                "Buy + 3 AWP",
                "Buy + 4 AWP",
                "FullBuy",
                "FullBuy + 1 AWP",
                "FullBuy + 2 AWP"
            ],
            "opponent_eco": [
                "MixBuy",
                "MixBuy + 1 AWP",
                "MixBuy + 2 AWP",
                "MixBuy + 3 AWP",
                "Buy",
                "Buy + 1 AWP",
                "Buy + 2 AWP",
                "Buy + 3 AWP",
                "Buy + 4 AWP",
                "FullBuy",
                "FullBuy + 1 AWP",
                "FullBuy + 2 AWP"
            ],
            "value": 0,
            "value_normalized": 1.1666666666666667,
            "query_id": ""
        },
        "average_survived": {
            "team_eco": [
                "MixBuy",
                "MixBuy + 1 AWP",
                "MixBuy + 2 AWP",
                "MixBuy + 3 AWP",
                "Buy",
                "Buy + 1 AWP",
                "Buy + 2 AWP",
                "Buy + 3 AWP",
                "Buy + 4 AWP",
                "FullBuy",
                "FullBuy + 1 AWP",
                "FullBuy + 2 AWP"
            ],
            "opponent_eco": [
                "MixBuy",
                "MixBuy + 1 AWP",
                "MixBuy + 2 AWP",
                "MixBuy + 3 AWP",
                "Buy",
                "Buy + 1 AWP",
                "Buy + 2 AWP",
                "Buy + 3 AWP",
                "Buy + 4 AWP",
                "FullBuy",
                "FullBuy + 1 AWP",
                "FullBuy + 2 AWP"
            ],
            "value": 0,
            "value_normalized": 0.0,
            "query_id": ""
        }
    },
    "Nuke_tier4_strength": 0.18,
    "Nuke_tier4_strength_log": {
        "map_winrate": {
            "value": 0,
            "value_normalized": 0.0,
            "query_id": ""
        },
        "rounds_winrate": {
            "team_eco": null,
            "opponent_eco": null,
            "value": 0,
            "value_normalized": 0.2,
            "query_id": ""
        },
        "average_killed": {
            "team_eco": [
                "MixBuy",
                "MixBuy + 1 AWP",
                "MixBuy + 2 AWP",
                "MixBuy + 3 AWP",
                "Buy",
                "Buy + 1 AWP",
                "Buy + 2 AWP",
                "Buy + 3 AWP",
                "Buy + 4 AWP",
                "FullBuy",
                "FullBuy + 1 AWP",
                "FullBuy + 2 AWP"
            ],
            "opponent_eco": [
                "MixBuy",
                "MixBuy + 1 AWP",
                "MixBuy + 2 AWP",
                "MixBuy + 3 AWP",
                "Buy",
                "Buy + 1 AWP",
                "Buy + 2 AWP",
                "Buy + 3 AWP",
                "Buy + 4 AWP",
                "FullBuy",
                "FullBuy + 1 AWP",
                "FullBuy + 2 AWP"
            ],
            "value": 0,
            "value_normalized": 1.2,
            "query_id": ""
        },
        "average_survived": {
            "team_eco": [
                "MixBuy",
                "MixBuy + 1 AWP",
                "MixBuy + 2 AWP",
                "MixBuy + 3 AWP",
                "Buy",
                "Buy + 1 AWP",
                "Buy + 2 AWP",
                "Buy + 3 AWP",
                "Buy + 4 AWP",
                "FullBuy",
                "FullBuy + 1 AWP",
                "FullBuy + 2 AWP"
            ],
            "opponent_eco": [
                "MixBuy",
                "MixBuy + 1 AWP",
                "MixBuy + 2 AWP",
                "MixBuy + 3 AWP",
                "Buy",
                "Buy + 1 AWP",
                "Buy + 2 AWP",
                "Buy + 3 AWP",
                "Buy + 4 AWP",
                "FullBuy",
                "FullBuy + 1 AWP",
                "FullBuy + 2 AWP"
            ],
            "value": 0,
            "value_normalized": 0.0,
            "query_id": ""
        }
    },
    "Nuke_raw_strength": 0.17326315789473687,
    "Nuke_clipped_strength": 0.17326315789473687,
    "Nuke_normalized_strength": 6.775438596491228,
    "Overpass_tier1_strength": 0.38376068376068373,
    "Overpass_tier1_strength_log": {
        "map_winrate": {
            "value": 0,
            "value_normalized": 0.0,
            "query_id": "fake"
        },
        "rounds_winrate": {
            "team_eco": null,
            "opponent_eco": null,
            "value": 0,
            "value_normalized": 0.1111111111111111,
            "query_id": "fake"
        },
        "average_killed": {
            "team_eco": [
                "MixBuy",
                "MixBuy + 1 AWP",
                "MixBuy + 2 AWP",
                "MixBuy + 3 AWP",
                "Buy",
                "Buy + 1 AWP",
                "Buy + 2 AWP",
                "Buy + 3 AWP",
                "Buy + 4 AWP",
                "FullBuy",
                "FullBuy + 1 AWP",
                "FullBuy + 2 AWP"
            ],
            "opponent_eco": [
                "MixBuy",
                "MixBuy + 1 AWP",
                "MixBuy + 2 AWP",
                "MixBuy + 3 AWP",
                "Buy",
                "Buy + 1 AWP",
                "Buy + 2 AWP",
                "Buy + 3 AWP",
                "Buy + 4 AWP",
                "FullBuy",
                "FullBuy + 1 AWP",
                "FullBuy + 2 AWP"
            ],
            "value": 0,
            "value_normalized": 1.6153846153846154,
            "query_id": ""
        },
        "average_survived": {
            "team_eco": [
                "MixBuy",
                "MixBuy + 1 AWP",
                "MixBuy + 2 AWP",
                "MixBuy + 3 AWP",
                "Buy",
                "Buy + 1 AWP",
                "Buy + 2 AWP",
                "Buy + 3 AWP",
                "Buy + 4 AWP",
                "FullBuy",
                "FullBuy + 1 AWP",
                "FullBuy + 2 AWP"
            ],
            "opponent_eco": [
                "MixBuy",
                "MixBuy + 1 AWP",
                "MixBuy + 2 AWP",
                "MixBuy + 3 AWP",
                "Buy",
                "Buy + 1 AWP",
                "Buy + 2 AWP",
                "Buy + 3 AWP",
                "Buy + 4 AWP",
                "FullBuy",
                "FullBuy + 1 AWP",
                "FullBuy + 2 AWP"
            ],
            "value": 0,
            "value_normalized": 1.8888888888888888,
            "query_id": "fake"
        }
    },
    "Overpass_tier2_strength": 0.14736842105263157,
    "Overpass_tier2_strength_log": {
        "map_winrate": {
            "value": 0,
            "value_normalized": 0.0,
            "query_id": ""
        },
        "rounds_winrate": {
            "team_eco": null,
            "opponent_eco": null,
            "value": 0,
            "value_normalized": 0.1578947368421052,
            "query_id": ""
        },
        "average_killed": {
            "team_eco": [
                "MixBuy",
                "MixBuy + 1 AWP",
                "MixBuy + 2 AWP",
                "MixBuy + 3 AWP",
                "Buy",
                "Buy + 1 AWP",
                "Buy + 2 AWP",
                "Buy + 3 AWP",
                "Buy + 4 AWP",
                "FullBuy",
                "FullBuy + 1 AWP",
                "FullBuy + 2 AWP"
            ],
            "opponent_eco": [
                "MixBuy",
                "MixBuy + 1 AWP",
                "MixBuy + 2 AWP",
                "MixBuy + 3 AWP",
                "Buy",
                "Buy + 1 AWP",
                "Buy + 2 AWP",
                "Buy + 3 AWP",
                "Buy + 4 AWP",
                "FullBuy",
                "FullBuy + 1 AWP",
                "FullBuy + 2 AWP"
            ],
            "value": 0,
            "value_normalized": 1.0,
            "query_id": ""
        },
        "average_survived": {
            "team_eco": [
                "MixBuy",
                "MixBuy + 1 AWP",
                "MixBuy + 2 AWP",
                "MixBuy + 3 AWP",
                "Buy",
                "Buy + 1 AWP",
                "Buy + 2 AWP",
                "Buy + 3 AWP",
                "Buy + 4 AWP",
                "FullBuy",
                "FullBuy + 1 AWP",
                "FullBuy + 2 AWP"
            ],
            "opponent_eco": [
                "MixBuy",
                "MixBuy + 1 AWP",
                "MixBuy + 2 AWP",
                "MixBuy + 3 AWP",
                "Buy",
                "Buy + 1 AWP",
                "Buy + 2 AWP",
                "Buy + 3 AWP",
                "Buy + 4 AWP",
                "FullBuy",
                "FullBuy + 1 AWP",
                "FullBuy + 2 AWP"
            ],
            "value": 0,
            "value_normalized": 0.0,
            "query_id": ""
        }
    },
    "Overpass_tier3_strength": 0.16333333333333333,
    "Overpass_tier3_strength_log": {
        "map_winrate": {
            "value": 0,
            "value_normalized": 0.0,
            "query_id": ""
        },
        "rounds_winrate": {
            "team_eco": null,
            "opponent_eco": null,
            "value": 0,
            "value_normalized": 0.1111111111111111,
            "query_id": ""
        },
        "average_killed": {
            "team_eco": [
                "MixBuy",
                "MixBuy + 1 AWP",
                "MixBuy + 2 AWP",
                "MixBuy + 3 AWP",
                "Buy",
                "Buy + 1 AWP",
                "Buy + 2 AWP",
                "Buy + 3 AWP",
                "Buy + 4 AWP",
                "FullBuy",
                "FullBuy + 1 AWP",
                "FullBuy + 2 AWP"
            ],
            "opponent_eco": [
                "MixBuy",
                "MixBuy + 1 AWP",
                "MixBuy + 2 AWP",
                "MixBuy + 3 AWP",
                "Buy",
                "Buy + 1 AWP",
                "Buy + 2 AWP",
                "Buy + 3 AWP",
                "Buy + 4 AWP",
                "FullBuy",
                "FullBuy + 1 AWP",
                "FullBuy + 2 AWP"
            ],
            "value": 0,
            "value_normalized": 1.0,
            "query_id": ""
        },
        "average_survived": {
            "team_eco": [
                "MixBuy",
                "MixBuy + 1 AWP",
                "MixBuy + 2 AWP",
                "MixBuy + 3 AWP",
                "Buy",
                "Buy + 1 AWP",
                "Buy + 2 AWP",
                "Buy + 3 AWP",
                "Buy + 4 AWP",
                "FullBuy",
                "FullBuy + 1 AWP",
                "FullBuy + 2 AWP"
            ],
            "opponent_eco": [
                "MixBuy",
                "MixBuy + 1 AWP",
                "MixBuy + 2 AWP",
                "MixBuy + 3 AWP",
                "Buy",
                "Buy + 1 AWP",
                "Buy + 2 AWP",
                "Buy + 3 AWP",
                "Buy + 4 AWP",
                "FullBuy",
                "FullBuy + 1 AWP",
                "FullBuy + 2 AWP"
            ],
            "value": 0,
            "value_normalized": 0.3,
            "query_id": ""
        }
    },
    "Overpass_tier4_strength": 0.18999999999999997,
    "Overpass_tier4_strength_log": {
        "map_winrate": {
            "value": 0,
            "value_normalized": 0.0,
            "query_id": ""
        },
        "rounds_winrate": {
            "team_eco": null,
            "opponent_eco": null,
            "value": 0,
            "value_normalized": 0.1666666666666666,
            "query_id": ""
        },
        "average_killed": {
            "team_eco": [
                "MixBuy",
                "MixBuy + 1 AWP",
                "MixBuy + 2 AWP",
                "MixBuy + 3 AWP",
                "Buy",
                "Buy + 1 AWP",
                "Buy + 2 AWP",
                "Buy + 3 AWP",
                "Buy + 4 AWP",
                "FullBuy",
                "FullBuy + 1 AWP",
                "FullBuy + 2 AWP"
            ],
            "opponent_eco": [
                "MixBuy",
                "MixBuy + 1 AWP",
                "MixBuy + 2 AWP",
                "MixBuy + 3 AWP",
                "Buy",
                "Buy + 1 AWP",
                "Buy + 2 AWP",
                "Buy + 3 AWP",
                "Buy + 4 AWP",
                "FullBuy",
                "FullBuy + 1 AWP",
                "FullBuy + 2 AWP"
            ],
            "value": 0,
            "value_normalized": 1.4,
            "query_id": ""
        },
        "average_survived": {
            "team_eco": [
                "MixBuy",
                "MixBuy + 1 AWP",
                "MixBuy + 2 AWP",
                "MixBuy + 3 AWP",
                "Buy",
                "Buy + 1 AWP",
                "Buy + 2 AWP",
                "Buy + 3 AWP",
                "Buy + 4 AWP",
                "FullBuy",
                "FullBuy + 1 AWP",
                "FullBuy + 2 AWP"
            ],
            "opponent_eco": [
                "MixBuy",
                "MixBuy + 1 AWP",
                "MixBuy + 2 AWP",
                "MixBuy + 3 AWP",
                "Buy",
                "Buy + 1 AWP",
                "Buy + 2 AWP",
                "Buy + 3 AWP",
                "Buy + 4 AWP",
                "FullBuy",
                "FullBuy + 1 AWP",
                "FullBuy + 2 AWP"
            ],
            "value": 0,
            "value_normalized": 0.0,
            "query_id": ""
        }
    },
    "Overpass_raw_strength": 0.1535042735042735,
    "Overpass_clipped_strength": 0.1535042735042735,
    "Overpass_normalized_strength": 6.116809116809117,
    "Vertigo_tier1_strength": 0.39181818181818184,
    "Vertigo_tier1_strength_log": {
        "map_winrate": {
            "value": 0,
            "value_normalized": 0.0,
            "query_id": "fake"
        },
        "rounds_winrate": {
            "team_eco": null,
            "opponent_eco": null,
            "value": 0,
            "value_normalized": 0.2727272727272727,
            "query_id": "fake"
        },
        "average_killed": {
            "team_eco": [
                "MixBuy",
                "MixBuy + 1 AWP",
                "MixBuy + 2 AWP",
                "MixBuy + 3 AWP",
                "Buy",
                "Buy + 1 AWP",
                "Buy + 2 AWP",
                "Buy + 3 AWP",
                "Buy + 4 AWP",
                "FullBuy",
                "FullBuy + 1 AWP",
                "FullBuy + 2 AWP"
            ],
            "opponent_eco": [
                "MixBuy",
                "MixBuy + 1 AWP",
                "MixBuy + 2 AWP",
                "MixBuy + 3 AWP",
                "Buy",
                "Buy + 1 AWP",
                "Buy + 2 AWP",
                "Buy + 3 AWP",
                "Buy + 4 AWP",
                "FullBuy",
                "FullBuy + 1 AWP",
                "FullBuy + 2 AWP"
            ],
            "value": 0,
            "value_normalized": 1.5,
            "query_id": ""
        },
        "average_survived": {
            "team_eco": [
                "MixBuy",
                "MixBuy + 1 AWP",
                "MixBuy + 2 AWP",
                "MixBuy + 3 AWP",
                "Buy",
                "Buy + 1 AWP",
                "Buy + 2 AWP",
                "Buy + 3 AWP",
                "Buy + 4 AWP",
                "FullBuy",
                "FullBuy + 1 AWP",
                "FullBuy + 2 AWP"
            ],
            "opponent_eco": [
                "MixBuy",
                "MixBuy + 1 AWP",
                "MixBuy + 2 AWP",
                "MixBuy + 3 AWP",
                "Buy",
                "Buy + 1 AWP",
                "Buy + 2 AWP",
                "Buy + 3 AWP",
                "Buy + 4 AWP",
                "FullBuy",
                "FullBuy + 1 AWP",
                "FullBuy + 2 AWP"
            ],
            "value": 0,
            "value_normalized": 1.6,
            "query_id": "fake"
        }
    },
    "Vertigo_tier2_strength": 0.3557017543859649,
    "Vertigo_tier2_strength_log": {
        "map_winrate": {
            "value": 0,
            "value_normalized": 0.0,
            "query_id": ""
        },
        "rounds_winrate": {
            "team_eco": null,
            "opponent_eco": null,
            "value": 0,
            "value_normalized": 0.1578947368421052,
            "query_id": ""
        },
        "average_killed": {
            "team_eco": [
                "MixBuy",
                "MixBuy + 1 AWP",
                "MixBuy + 2 AWP",
                "MixBuy + 3 AWP",
                "Buy",
                "Buy + 1 AWP",
                "Buy + 2 AWP",
                "Buy + 3 AWP",
                "Buy + 4 AWP",
                "FullBuy",
                "FullBuy + 1 AWP",
                "FullBuy + 2 AWP"
            ],
            "opponent_eco": [
                "MixBuy",
                "MixBuy + 1 AWP",
                "MixBuy + 2 AWP",
                "MixBuy + 3 AWP",
                "Buy",
                "Buy + 1 AWP",
                "Buy + 2 AWP",
                "Buy + 3 AWP",
                "Buy + 4 AWP",
                "FullBuy",
                "FullBuy + 1 AWP",
                "FullBuy + 2 AWP"
            ],
            "value": 0,
            "value_normalized": 1.3333333333333333,
            "query_id": ""
        },
        "average_survived": {
            "team_eco": [
                "MixBuy",
                "MixBuy + 1 AWP",
                "MixBuy + 2 AWP",
                "MixBuy + 3 AWP",
                "Buy",
                "Buy + 1 AWP",
                "Buy + 2 AWP",
                "Buy + 3 AWP",
                "Buy + 4 AWP",
                "FullBuy",
                "FullBuy + 1 AWP",
                "FullBuy + 2 AWP"
            ],
            "opponent_eco": [
                "MixBuy",
                "MixBuy + 1 AWP",
                "MixBuy + 2 AWP",
                "MixBuy + 3 AWP",
                "Buy",
                "Buy + 1 AWP",
                "Buy + 2 AWP",
                "Buy + 3 AWP",
                "Buy + 4 AWP",
                "FullBuy",
                "FullBuy + 1 AWP",
                "FullBuy + 2 AWP"
            ],
            "value": 0,
            "value_normalized": 1.75,
            "query_id": ""
        }
    },
    "Vertigo_tier3_strength": 0.32514619883040935,
    "Vertigo_tier3_strength_log": {
        "map_winrate": {
            "value": 0,
            "value_normalized": 0.0,
            "query_id": ""
        },
        "rounds_winrate": {
            "team_eco": null,
            "opponent_eco": null,
            "value": 0,
            "value_normalized": 0.1578947368421052,
            "query_id": ""
        },
        "average_killed": {
            "team_eco": [
                "MixBuy",
                "MixBuy + 1 AWP",
                "MixBuy + 2 AWP",
                "MixBuy + 3 AWP",
                "Buy",
                "Buy + 1 AWP",
                "Buy + 2 AWP",
                "Buy + 3 AWP",
                "Buy + 4 AWP",
                "FullBuy",
                "FullBuy + 1 AWP",
                "FullBuy + 2 AWP"
            ],
            "opponent_eco": [
                "MixBuy",
                "MixBuy + 1 AWP",
                "MixBuy + 2 AWP",
                "MixBuy + 3 AWP",
                "Buy",
                "Buy + 1 AWP",
                "Buy + 2 AWP",
                "Buy + 3 AWP",
                "Buy + 4 AWP",
                "FullBuy",
                "FullBuy + 1 AWP",
                "FullBuy + 2 AWP"
            ],
            "value": 0,
            "value_normalized": 1.4444444444444444,
            "query_id": ""
        },
        "average_survived": {
            "team_eco": [
                "MixBuy",
                "MixBuy + 1 AWP",
                "MixBuy + 2 AWP",
                "MixBuy + 3 AWP",
                "Buy",
                "Buy + 1 AWP",
                "Buy + 2 AWP",
                "Buy + 3 AWP",
                "Buy + 4 AWP",
                "FullBuy",
                "FullBuy + 1 AWP",
                "FullBuy + 2 AWP"
            ],
            "opponent_eco": [
                "MixBuy",
                "MixBuy + 1 AWP",
                "MixBuy + 2 AWP",
                "MixBuy + 3 AWP",
                "Buy",
                "Buy + 1 AWP",
                "Buy + 2 AWP",
                "Buy + 3 AWP",
                "Buy + 4 AWP",
                "FullBuy",
                "FullBuy + 1 AWP",
                "FullBuy + 2 AWP"
            ],
            "value": 0,
            "value_normalized": 1.3333333333333333,
            "query_id": ""
        }
    },
    "Vertigo_tier4_strength": 0.38142857142857145,
    "Vertigo_tier4_strength_log": {
        "map_winrate": {
            "value": 0,
            "value_normalized": 0.0,
            "query_id": ""
        },
        "rounds_winrate": {
            "team_eco": null,
            "opponent_eco": null,
            "value": 0,
            "value_normalized": 0.2,
            "query_id": ""
        },
        "average_killed": {
            "team_eco": [
                "MixBuy",
                "MixBuy + 1 AWP",
                "MixBuy + 2 AWP",
                "MixBuy + 3 AWP",
                "Buy",
                "Buy + 1 AWP",
                "Buy + 2 AWP",
                "Buy + 3 AWP",
                "Buy + 4 AWP",
                "FullBuy",
                "FullBuy + 1 AWP",
                "FullBuy + 2 AWP"
            ],
            "opponent_eco": [
                "MixBuy",
                "MixBuy + 1 AWP",
                "MixBuy + 2 AWP",
                "MixBuy + 3 AWP",
                "Buy",
                "Buy + 1 AWP",
                "Buy + 2 AWP",
                "Buy + 3 AWP",
                "Buy + 4 AWP",
                "FullBuy",
                "FullBuy + 1 AWP",
                "FullBuy + 2 AWP"
            ],
            "value": 0,
            "value_normalized": 1.5,
            "query_id": ""
        },
        "average_survived": {
            "team_eco": [
                "MixBuy",
                "MixBuy + 1 AWP",
                "MixBuy + 2 AWP",
                "MixBuy + 3 AWP",
                "Buy",
                "Buy + 1 AWP",
                "Buy + 2 AWP",
                "Buy + 3 AWP",
                "Buy + 4 AWP",
                "FullBuy",
                "FullBuy + 1 AWP",
                "FullBuy + 2 AWP"
            ],
            "opponent_eco": [
                "MixBuy",
                "MixBuy + 1 AWP",
                "MixBuy + 2 AWP",
                "MixBuy + 3 AWP",
                "Buy",
                "Buy + 1 AWP",
                "Buy + 2 AWP",
                "Buy + 3 AWP",
                "Buy + 4 AWP",
                "FullBuy",
                "FullBuy + 1 AWP",
                "FullBuy + 2 AWP"
            ],
            "value": 0,
            "value_normalized": 1.7142857142857142,
            "query_id": ""
        }
    },
    "Vertigo_raw_strength": 0.15672727272727274,
    "Vertigo_clipped_strength": 0.15672727272727274,
    "Vertigo_normalized_strength": 6.224242424242425,
    "All_tier1_strength": 0.9975555555555555,
    "All_tier1_strength_log": {
        "map_winrate": {
            "value": 1.0,
            "value_normalized": 1.0,
            "query_id": "fake"
        },
        "rounds_winrate": {
            "team_eco": null,
            "opponent_eco": null,
            "value": 0.9375,
            "value_normalized": 0.64,
            "query_id": "fake"
        },
        "average_killed": {
            "team_eco": [
                "MixBuy",
                "MixBuy + 1 AWP",
                "MixBuy + 2 AWP",
                "MixBuy + 3 AWP",
                "Buy",
                "Buy + 1 AWP",
                "Buy + 2 AWP",
                "Buy + 3 AWP",
                "Buy + 4 AWP",
                "FullBuy",
                "FullBuy + 1 AWP",
                "FullBuy + 2 AWP"
            ],
            "opponent_eco": [
                "MixBuy",
                "MixBuy + 1 AWP",
                "MixBuy + 2 AWP",
                "MixBuy + 3 AWP",
                "Buy",
                "Buy + 1 AWP",
                "Buy + 2 AWP",
                "Buy + 3 AWP",
                "Buy + 4 AWP",
                "FullBuy",
                "FullBuy + 1 AWP",
                "FullBuy + 2 AWP"
            ],
            "value": 0,
            "value_normalized": 1.5555555555555556,
            "query_id": ""
        },
        "average_survived": {
            "team_eco": [
                "MixBuy",
                "MixBuy + 1 AWP",
                "MixBuy + 2 AWP",
                "MixBuy + 3 AWP",
                "Buy",
                "Buy + 1 AWP",
                "Buy + 2 AWP",
                "Buy + 3 AWP",
                "Buy + 4 AWP",
                "FullBuy",
                "FullBuy + 1 AWP",
                "FullBuy + 2 AWP"
            ],
            "opponent_eco": [
                "MixBuy",
                "MixBuy + 1 AWP",
                "MixBuy + 2 AWP",
                "MixBuy + 3 AWP",
                "Buy",
                "Buy + 1 AWP",
                "Buy + 2 AWP",
                "Buy + 3 AWP",
                "Buy + 4 AWP",
                "FullBuy",
                "FullBuy + 1 AWP",
                "FullBuy + 2 AWP"
            ],
            "value": 3.25,
            "value_normalized": 1.5,
            "query_id": "fake"
        }
    },
    "All_tier2_strength": 0.17083333333333334,
    "All_tier2_strength_log": {
        "map_winrate": {
            "value": 0,
            "value_normalized": 0.0,
            "query_id": ""
        },
        "rounds_winrate": {
            "team_eco": null,
            "opponent_eco": null,
            "value": 0,
            "value_normalized": 0.1111111111111111,
            "query_id": ""
        },
        "average_killed": {
            "team_eco": [
                "MixBuy",
                "MixBuy + 1 AWP",
                "MixBuy + 2 AWP",
                "MixBuy + 3 AWP",
                "Buy",
                "Buy + 1 AWP",
                "Buy + 2 AWP",
                "Buy + 3 AWP",
                "Buy + 4 AWP",
                "FullBuy",
                "FullBuy + 1 AWP",
                "FullBuy + 2 AWP"
            ],
            "opponent_eco": [
                "MixBuy",
                "MixBuy + 1 AWP",
                "MixBuy + 2 AWP",
                "MixBuy + 3 AWP",
                "Buy",
                "Buy + 1 AWP",
                "Buy + 2 AWP",
                "Buy + 3 AWP",
                "Buy + 4 AWP",
                "FullBuy",
                "FullBuy + 1 AWP",
                "FullBuy + 2 AWP"
            ],
            "value": 0,
            "value_normalized": 1.375,
            "query_id": ""
        },
        "average_survived": {
            "team_eco": [
                "MixBuy",
                "MixBuy + 1 AWP",
                "MixBuy + 2 AWP",
                "MixBuy + 3 AWP",
                "Buy",
                "Buy + 1 AWP",
                "Buy + 2 AWP",
                "Buy + 3 AWP",
                "Buy + 4 AWP",
                "FullBuy",
                "FullBuy + 1 AWP",
                "FullBuy + 2 AWP"
            ],
            "opponent_eco": [
                "MixBuy",
                "MixBuy + 1 AWP",
                "MixBuy + 2 AWP",
                "MixBuy + 3 AWP",
                "Buy",
                "Buy + 1 AWP",
                "Buy + 2 AWP",
                "Buy + 3 AWP",
                "Buy + 4 AWP",
                "FullBuy",
                "FullBuy + 1 AWP",
                "FullBuy + 2 AWP"
            ],
            "value": 0,
            "value_normalized": 0.0,
            "query_id": ""
        }
    },
    "All_tier3_strength": 0.18252032520325204,
    "All_tier3_strength_log": {
        "map_winrate": {
            "value": 0,
            "value_normalized": 0.0,
            "query_id": ""
        },
        "rounds_winrate": {
            "team_eco": null,
            "opponent_eco": null,
            "value": 0,
            "value_normalized": 0.2195121951219512,
            "query_id": ""
        },
        "average_killed": {
            "team_eco": [
                "MixBuy",
                "MixBuy + 1 AWP",
                "MixBuy + 2 AWP",
                "MixBuy + 3 AWP",
                "Buy",
                "Buy + 1 AWP",
                "Buy + 2 AWP",
                "Buy + 3 AWP",
                "Buy + 4 AWP",
                "FullBuy",
                "FullBuy + 1 AWP",
                "FullBuy + 2 AWP"
            ],
            "opponent_eco": [
                "MixBuy",
                "MixBuy + 1 AWP",
                "MixBuy + 2 AWP",
                "MixBuy + 3 AWP",
                "Buy",
                "Buy + 1 AWP",
                "Buy + 2 AWP",
                "Buy + 3 AWP",
                "Buy + 4 AWP",
                "FullBuy",
                "FullBuy + 1 AWP",
                "FullBuy + 2 AWP"
            ],
            "value": 0,
            "value_normalized": 1.1666666666666667,
            "query_id": ""
        },
        "average_survived": {
            "team_eco": [
                "MixBuy",
                "MixBuy + 1 AWP",
                "MixBuy + 2 AWP",
                "MixBuy + 3 AWP",
                "Buy",
                "Buy + 1 AWP",
                "Buy + 2 AWP",
                "Buy + 3 AWP",
                "Buy + 4 AWP",
                "FullBuy",
                "FullBuy + 1 AWP",
                "FullBuy + 2 AWP"
            ],
            "opponent_eco": [
                "MixBuy",
                "MixBuy + 1 AWP",
                "MixBuy + 2 AWP",
                "MixBuy + 3 AWP",
                "Buy",
                "Buy + 1 AWP",
                "Buy + 2 AWP",
                "Buy + 3 AWP",
                "Buy + 4 AWP",
                "FullBuy",
                "FullBuy + 1 AWP",
                "FullBuy + 2 AWP"
            ],
            "value": 0,
            "value_normalized": 0.0,
            "query_id": ""
        }
    },
    "All_tier4_strength": 0.21688311688311687,
    "All_tier4_strength_log": {
        "map_winrate": {
            "value": 0,
            "value_normalized": 0.0,
            "query_id": ""
        },
        "rounds_winrate": {
            "team_eco": null,
            "opponent_eco": null,
            "value": 0,
            "value_normalized": 0.238095238095238,
            "query_id": ""
        },
        "average_killed": {
            "team_eco": [
                "MixBuy",
                "MixBuy + 1 AWP",
                "MixBuy + 2 AWP",
                "MixBuy + 3 AWP",
                "Buy",
                "Buy + 1 AWP",
                "Buy + 2 AWP",
                "Buy + 3 AWP",
                "Buy + 4 AWP",
                "FullBuy",
                "FullBuy + 1 AWP",
                "FullBuy + 2 AWP"
            ],
            "opponent_eco": [
                "MixBuy",
                "MixBuy + 1 AWP",
                "MixBuy + 2 AWP",
                "MixBuy + 3 AWP",
                "Buy",
                "Buy + 1 AWP",
                "Buy + 2 AWP",
                "Buy + 3 AWP",
                "Buy + 4 AWP",
                "FullBuy",
                "FullBuy + 1 AWP",
                "FullBuy + 2 AWP"
            ],
            "value": 0,
            "value_normalized": 1.4545454545454546,
            "query_id": ""
        },
        "average_survived": {
            "team_eco": [
                "MixBuy",
                "MixBuy + 1 AWP",
                "MixBuy + 2 AWP",
                "MixBuy + 3 AWP",
                "Buy",
                "Buy + 1 AWP",
                "Buy + 2 AWP",
                "Buy + 3 AWP",
                "Buy + 4 AWP",
                "FullBuy",
                "FullBuy + 1 AWP",
                "FullBuy + 2 AWP"
            ],
            "opponent_eco": [
                "MixBuy",
                "MixBuy + 1 AWP",
                "MixBuy + 2 AWP",
                "MixBuy + 3 AWP",
                "Buy",
                "Buy + 1 AWP",
                "Buy + 2 AWP",
                "Buy + 3 AWP",
                "Buy + 4 AWP",
                "FullBuy",
                "FullBuy + 1 AWP",
                "FullBuy + 2 AWP"
            ],
            "value": 0,
            "value_normalized": 0.0,
            "query_id": ""
        }
    },
    "All_raw_strength": 0.3990222222222222,
    "All_clipped_strength": 0.27,
    "All_normalized_strength": 10.0
}