{
    "url": "https://www.hltv.org/events/6958/esl-challenger-league-season-44-north-america",
    "hltv_id": 6958,
    "link": {
        "overview": "/events/6958/esl-challenger-league-season-44-north-america",
        "matches": null,
        "results": "/results?event=6958"
    },
    "name": "ESL Challenger League Season 44 North America",
    "start_date": "2023-01-24",
    "end_date": "2023-03-26",
    "prize_pool": "$50,000",
    "teams_count": "16",
    "location": "North America (Online)",
    "stages": [
        {
            "name": "Playoffs",
            "rounds": [
                "Opening round",
                "Upper semi-finals",
                "Upper final",
                "Lower round 1",
                "Lower semi-finals",
                "Lower final",
                "Consolidation final",
                "Grand final"
            ]
        }
    ],
    "groups": [
        "Group A",
        "Group B"
    ],
    "formats": [
        {
            "name": "Group stage",
            "description": "Round-robin Bo3"
        },
        {
            "name": "Playoffs",
            "description": "Double elimination Bo3\n- Grand final Bo5 (with 1-0 map advantage for upper bracket team)"
        }
    ],
    "placements": [
        {
            "place": "1st",
            "prizes": [
                {
                    "name": "$20,000",
                    "link": null
                },
                {
                    "name": "ESL Pro League Season 18",
                    "link": "/events/6863/esl-pro-league-season-18"
                }
            ]
        },
        {
            "place": "2nd",
            "prizes": [
                {
                    "name": "$11,500",
                    "link": null
                }
            ]
        },
        {
            "place": "3rd",
            "prizes": [
                {
                    "name": "$7,000",
                    "link": null
                }
            ]
        },
        {
            "place": "4th",
            "prizes": [
                {
                    "name": "$4,000",
                    "link": null
                }
            ]
        },
        {
            "place": "5-6th",
            "prizes": [
                {
                    "name": "$2,500",
                    "link": null
                }
            ]
        },
        {
            "place": "5-6th",
            "prizes": [
                {
                    "name": "$2,500",
                    "link": null
                }
            ]
        },
        {
            "place": "7-8th",
            "prizes": [
                {
                    "name": "$1,250",
                    "link": null
                }
            ]
        },
        {
            "place": "7-8th",
            "prizes": [
                {
                    "name": "$1,250",
                    "link": null
                }
            ]
        },
        {
            "place": "9-10th",
            "prizes": []
        },
        {
            "place": "9-10th",
            "prizes": [
                {
                    "name": "Withdrawal",
                    "link": null
                }
            ]
        },
        {
            "place": "11-12th",
            "prizes": [
                {
                    "name": "Relegation S44",
                    "link": "/events/7120/esl-challenger-league-season-44-north-america-relegation"
                }
            ]
        },
        {
            "place": "11-12th",
            "prizes": [
                {
                    "name": "Relegation S44",
                    "link": "/events/7120/esl-challenger-league-season-44-north-america-relegation"
                }
            ]
        },
        {
            "place": "13-14th",
            "prizes": [
                {
                    "name": "Relegation S44",
                    "link": "/events/7120/esl-challenger-league-season-44-north-america-relegation"
                }
            ]
        },
        {
            "place": "13-14th",
            "prizes": [
                {
                    "name": "Relegation S44",
                    "link": "/events/7120/esl-challenger-league-season-44-north-america-relegation"
                }
            ]
        },
        {
            "place": "15-16th",
            "prizes": [
                {
                    "name": "ESEA Advanced S45",
                    "link": null
                }
            ]
        },
        {
            "place": "15-16th",
            "prizes": [
                {
                    "name": "ESEA Advanced S45",
                    "link": null
                }
            ]
        }
    ],
    "ratings": [
        {
            "team": "paiN",
            "link": "/team/4773/pain",
            "rank": "#29"
        },
        {
            "team": "MIBR",
            "link": "/team/9215/mibr",
            "rank": "#36"
        },
        {
            "team": "ATK",
            "link": "/team/9943/atk",
            "rank": "#38"
        },
        {
            "team": "TeamOne",
            "link": "/team/6947/teamone",
            "rank": "#41"
        },
        {
            "team": "EG Black",
            "link": "/team/11735/eg-black",
            "rank": "#48"
        },
        {
            "team": "Nouns",
            "link": "/team/11948/nouns",
            "rank": "#57"
        },
        {
            "team": "Strife",
            "link": "/team/11298/strife",
            "rank": "#83"
        },
        {
            "team": "timbermen",
            "link": "/team/10464/timbermen",
            "rank": "#85"
        },
        {
            "team": "Vendetta",
            "link": "/team/11826/vendetta",
            "rank": "#89"
        },
        {
            "team": "Detonate",
            "link": "/team/11336/detonate",
            "rank": "#97"
        },
        {
            "team": "Disconnected",
            "link": "/team/11502/disconnected",
            "rank": "#102"
        },
        {
            "team": "ex-Villainous",
            "link": "/team/12172/ex-villainous",
            "rank": "#103"
        },
        {
            "team": "Mythic",
            "link": "/team/5479/mythic",
            "rank": "#104"
        },
        {
            "team": "Limitless",
            "link": "/team/11388/limitless",
            "rank": "#122"
        },
        {
            "team": "Davenport University",
            "link": "/team/11340/davenport-university",
            "rank": "#129"
        },
        {
            "team": "Noxious",
            "link": "/team/12115/noxious",
            "rank": null
        }
    ],
    "related_events": [
        {
            "name": "ESL Challenger League Season 43 North America",
            "link": "/events/6850/esl-challenger-league-season-43-north-america"
        },
        {
            "name": "ESL Pro League Season 18",
            "link": "/events/6863/esl-pro-league-season-18"
        },
        {
            "name": "ESEA Advanced Season 43 North America",
            "link": "/events/6930/esea-advanced-season-43-north-america"
        },
        {
            "name": "ESL Challenger League Season 43 North America Relegation",
            "link": "/events/6931/esl-challenger-league-season-43-north-america-relegation"
        },
        {
            "name": "ESL Challenger League Season 44 North America Relegation",
            "link": "/events/7120/esl-challenger-league-season-44-north-america-relegation"
        },
        {
            "name": "ESL Challenger League Season 45 North America",
            "link": "/events/7159/esl-challenger-league-season-45-north-america"
        }
    ],
    "upcoming_matches": null,
    "played_matches": [
        {
            "date": "2023-03-27",
            "teams": [
                "MIBR",
                "ATK"
            ],
            "bestof": "bo5"
        },
        {
            "date": "2023-03-26",
            "teams": [
                "ATK",
                "EG Black"
            ],
            "bestof": "bo3"
        },
        {
            "date": "2023-03-25",
            "teams": [
                "EG Black",
                "Strife"
            ],
            "bestof": "bo3"
        },
        {
            "date": "2023-03-24",
            "teams": [
                "Nouns",
                "Strife"
            ],
            "bestof": "bo3"
        },
        {
            "date": "2023-03-24",
            "teams": [
                "EG Black",
                "TeamOne"
            ],
            "bestof": "bo3"
        },
        {
            "date": "2023-03-24",
            "teams": [
                "MIBR",
                "ATK"
            ],
            "bestof": "bo3"
        },
        {
            "date": "2023-03-23",
            "teams": [
                "timbermen",
                "Strife"
            ],
            "bestof": "bo3"
        },
        {
            "date": "2023-03-23",
            "teams": [
                "MIBR",
                "Nouns"
            ],
            "bestof": "bo3"
        },
        {
            "date": "2023-03-23",
            "teams": [
                "EG Black",
                "ATK"
            ],
            "bestof": "bo3"
        },
        {
            "date": "2023-03-23",
            "teams": [
                "Detonate",
                "TeamOne"
            ],
            "bestof": "bo3"
        },
        {
            "date": "2023-03-22",
            "teams": [
                "Strife",
                "ATK"
            ],
            "bestof": "bo3"
        },
        {
            "date": "2023-03-22",
            "teams": [
                "EG Black",
                "timbermen"
            ],
            "bestof": "bo3"
        },
        {
            "date": "2023-03-22",
            "teams": [
                "Nouns",
                "TeamOne"
            ],
            "bestof": "bo3"
        },
        {
            "date": "2023-03-22",
            "teams": [
                "MIBR",
                "Detonate"
            ],
            "bestof": "bo3"
        },
        {
            "date": "2023-03-16",
            "teams": [
                "Davenport University",
                "Noxious"
            ],
            "bestof": "bo3"
        },
        {
            "date": "2023-03-16",
            "teams": [
                "Strife",
                "Nouns"
            ],
            "bestof": "bo3"
        },
        {
            "date": "2023-03-15",
            "teams": [
                "Detonate",
                "timbermen"
            ],
            "bestof": "bo3"
        },
        {
            "date": "2023-03-15",
            "teams": [
                "Strife",
                "EG Black"
            ],
            "bestof": "bo3"
        },
        {
            "date": "2023-03-10",
            "teams": [
                "Limitless",
                "Disconnected"
            ],
            "bestof": "def"
        },
        {
            "date": "2023-03-09",
            "teams": [
                "Davenport University",
                "Strife"
            ],
            "bestof": "bo3"
        },
        {
            "date": "2023-03-08",
            "teams": [
                "ex-Villainous",
                "timbermen"
            ],
            "bestof": "bo3"
        },
        {
            "date": "2023-03-08",
            "teams": [
                "Vendetta",
                "Nouns"
            ],
            "bestof": "bo3"
        },
        {
            "date": "2023-03-08",
            "teams": [
                "Davenport University",
                "Nouns"
            ],
            "bestof": "bo3"
        },
        {
            "date": "2023-03-07",
            "teams": [
                "Vendetta",
                "Strife"
            ],
            "bestof": "bo3"
        },
        {
            "date": "2023-03-06",
            "teams": [
                "Limitless",
                "TeamOne"
            ],
            "bestof": "def"
        },
        {
            "date": "2023-03-02",
            "teams": [
                "EG Black",
                "Nouns"
            ],
            "bestof": "bo3"
        },
        {
            "date": "2023-03-02",
            "teams": [
                "Limitless",
                "Detonate"
            ],
            "bestof": "bo3"
        },
        {
            "date": "2023-03-02",
            "teams": [
                "ex-Villainous",
                "paiN"
            ],
            "bestof": "bo3"
        },
        {
            "date": "2023-03-01",
            "teams": [
                "EG Black",
                "Noxious"
            ],
            "bestof": "bo3"
        },
        {
            "date": "2023-02-28",
            "teams": [
                "Davenport University",
                "Vendetta"
            ],
            "bestof": "bo3"
        },
        {
            "date": "2023-02-28",
            "teams": [
                "Limitless",
                "paiN"
            ],
            "bestof": "bo3"
        },
        {
            "date": "2023-02-28",
            "teams": [
                "Villainous",
                "TeamOne"
            ],
            "bestof": "bo3"
        },
        {
            "date": "2023-02-28",
            "teams": [
                "Vendetta",
                "EG Black"
            ],
            "bestof": "bo3"
        },
        {
            "date": "2023-02-28",
            "teams": [
                "Davenport University",
                "Mythic"
            ],
            "bestof": "bo3"
        },
        {
            "date": "2023-02-28",
            "teams": [
                "TeamOne",
                "paiN"
            ],
            "bestof": "bo3"
        },
        {
            "date": "2023-02-27",
            "teams": [
                "Disconnected",
                "Detonate"
            ],
            "bestof": "def"
        },
        {
            "date": "2023-02-27",
            "teams": [
                "Detonate",
                "TeamOne"
            ],
            "bestof": "bo3"
        },
        {
            "date": "2023-02-26",
            "teams": [
                "Villainous",
                "ATK"
            ],
            "bestof": "bo3"
        },
        {
            "date": "2023-02-25",
            "teams": [
                "ATK",
                "paiN"
            ],
            "bestof": "bo3"
        },
        {
            "date": "2023-02-24",
            "teams": [
                "Detonate",
                "paiN"
            ],
            "bestof": "bo3"
        },
        {
            "date": "2023-02-24",
            "teams": [
                "timbermen",
                "paiN"
            ],
            "bestof": "bo3"
        },
        {
            "date": "2023-02-23",
            "teams": [
                "Disconnected",
                "ATK"
            ],
            "bestof": "def"
        },
        {
            "date": "2023-02-23",
            "teams": [
                "Limitless",
                "Villainous"
            ],
            "bestof": "bo3"
        },
        {
            "date": "2023-02-23",
            "teams": [
                "timbermen",
                "TeamOne"
            ],
            "bestof": "bo3"
        },
        {
            "date": "2023-02-23",
            "teams": [
                "Strife",
                "Mythic"
            ],
            "bestof": "bo3"
        },
        {
            "date": "2023-02-23",
            "teams": [
                "Davenport University",
                "EG Black"
            ],
            "bestof": "bo3"
        },
        {
            "date": "2023-02-23",
            "teams": [
                "Disconnected",
                "paiN"
            ],
            "bestof": "bo3"
        },
        {
            "date": "2023-02-22",
            "teams": [
                "Villainous",
                "Detonate"
            ],
            "bestof": "bo3"
        },
        {
            "date": "2023-02-22",
            "teams": [
                "TeamOne",
                "ATK"
            ],
            "bestof": "bo3"
        },
        {
            "date": "2023-02-22",
            "teams": [
                "Mythic",
                "EG Black"
            ],
            "bestof": "bo3"
        },
        {
            "date": "2023-02-21",
            "teams": [
                "Mythic",
                "Vendetta"
            ],
            "bestof": "bo3"
        },
        {
            "date": "2023-02-21",
            "teams": [
                "Noxious",
                "Strife"
            ],
            "bestof": "bo3"
        },
        {
            "date": "2023-02-20",
            "teams": [
                "Mythic",
                "MIBR"
            ],
            "bestof": "def"
        },
        {
            "date": "2023-02-15",
            "teams": [
                "EG Black",
                "MIBR"
            ],
            "bestof": "bo3"
        },
        {
            "date": "2023-02-14",
            "teams": [
                "Noxious",
                "MIBR"
            ],
            "bestof": "bo3"
        },
        {
            "date": "2023-02-13",
            "teams": [
                "Davenport University",
                "MIBR"
            ],
            "bestof": "def"
        },
        {
            "date": "2023-02-09",
            "teams": [
                "Vendetta",
                "Noxious"
            ],
            "bestof": "bo3"
        },
        {
            "date": "2023-02-09",
            "teams": [
                "Strife",
                "MIBR"
            ],
            "bestof": "bo3"
        },
        {
            "date": "2023-02-08",
            "teams": [
                "Limitless",
                "ATK"
            ],
            "bestof": "bo3"
        },
        {
            "date": "2023-02-08",
            "teams": [
                "Nouns",
                "MIBR"
            ],
            "bestof": "bo3"
        },
        {
            "date": "2023-02-07",
            "teams": [
                "Detonate",
                "ATK"
            ],
            "bestof": "bo3"
        },
        {
            "date": "2023-02-07",
            "teams": [
                "Vendetta",
                "MIBR"
            ],
            "bestof": "bo3"
        },
        {
            "date": "2023-02-01",
            "teams": [
                "Noxious",
                "Mythic"
            ],
            "bestof": "bo3"
        },
        {
            "date": "2023-02-01",
            "teams": [
                "timbermen",
                "Limitless"
            ],
            "bestof": "bo3"
        },
        {
            "date": "2023-01-26",
            "teams": [
                "Noxious",
                "Nouns"
            ],
            "bestof": "bo3"
        },
        {
            "date": "2023-01-25",
            "teams": [
                "Mythic",
                "Nouns"
            ],
            "bestof": "bo3"
        },
        {
            "date": "2023-01-25",
            "teams": [
                "timbermen",
                "ATK"
            ],
            "bestof": "bo3"
        }
    ]
}
