[
    [],
    [],
    [],
    [],
    [],
    [],
    [],
    [],
    [],
    [],
    [["Inferno", 0.9411764705882353, 16, 17]],
    [],
    [],
    [],
    [],
    [],
    [],
    [],
    [],
    [],
    [],
    [],
    [],
    [],
    [],
    [],
    [],
    [],
    [],
    [],
    [],
    [],
    [],
    [],
    [],
    [["Inferno", 0.9411764705882353, 16, 17]],
    [],
    [],
    [],
    []
]