{"data":
  [{"name":"Код Давинчи","price":"200","url":"/img/braun.jpg","color":"крассный","article":"e2203"},
    {"name":"Вино из одуванчиков","price":"180","url":"../img/bredberi.jpg","color":"зеленый","article":"e2204"},
    {"name":"Суворі чоловіки","price":"220","url":"/img/hilbert.jpeg","color":"синий","article":"e2205"},
    {"name":"Спящие красавицы","price":"210","url":"/img/king.jpg","color":"серый","article":"e2206"},
    {"name":"Алхимик","price":"250","url":"/img/koelho.jpg","color":"белый","article":"e2207"},
    {"name":"Амстердам","price":"270","url":"/img/mackuen.jpg","color":"желтый","article":"e2208"},
    {"name":"Полустанок","price":"300","url":"/img/phleg.jpg","color":"зеленый","article":"e2209"},
    {"name":"В тихом омуте","price":"130","url":"/img/hokins.jpg","color":"голубой","article":"e2210"},
    {"name":"1984","price":"180","url":"/img/orwel.jpg","color":"беживый","article":"e2213"},
    {"name":"Преступный синдикат","price":"230","url":"/img/nomics.jpg","color":"черный","article":"e2211"}]}