<svg width="68" height="68" viewBox="0 0 68 68" fill="none" xmlns="http://www.w3.org/2000/svg">
<path d="M34 0L63.4449 17V51L34 68L4.55514 51V17L34 0Z" fill="#18CFAB"/>
<path d="M47 21V49H40.52V37.52H27.8V49H21.32V21H27.8V32.04H40.52V21H47Z" fill="white"/>
</svg>
