#python
#tkinter

# Movie Chooser
# Demonstrates check buttons

from tkinter import *

class Application(Frame):
    """ GUI Application for favorite movie types. """
    def __init__(self, master):
        super(Application, self).__init__(master) 
        self.grid()
        self.create_widgets()

    def create_widgets(self):
        """ Create widgets for movie type choices. """   
        # create description label (does not define a variable first - displays directly)
        Label(self,
              text = "Choose your favorite movie types"
              ).grid(row = 0, column = 0, sticky = W)

        # create instruction label
        Label(self,
              text = "Select all that apply:"
              ).grid(row = 1, column = 0, sticky = W)
       
        # create Comedy check button and assign to a BooleanVar class from tkinter
        self.likes_comedy = BooleanVar()
        Checkbutton(self,
                    text = "Comedy",
                    variable = self.likes_comedy, # links variable 'comedy' to button
                    command = self.update_text # binds to update function
                    ).grid(row = 2, column = 0, sticky = W)

        # create Drama check button
        self.likes_drama = BooleanVar()
        Checkbutton(self,
                    text = "Drama",
                    variable = self.likes_drama,
                    command = self.update_text
                    ).grid(row = 3, column = 0, sticky = W)

        # create Romance check button
        self.likes_romance = BooleanVar()
        Checkbutton(self,
                    text = "Romance",
                    variable = self.likes_romance,
                    command = self.update_text
                    ).grid(row = 4, column = 0, sticky = W)

        # create text field to display results
        self.results_txt = Text(self, width = 40, height = 5, wrap = WORD)
        self.results_txt.grid(row = 5, column = 0, columnspan = 3)

    def update_text(self):
        """ Update text widget and display user's favorite movie types. """
        likes = ""
       
        if self.likes_comedy.get(): # value of comedy cannot be returned directly; the BooleanVar's get () method is used 
            likes += "You like comedic movies.\n"

        if self.likes_drama.get():
            likes += "You like dramatic movies.\n"

        if self.likes_romance.get():
            likes += "You like romantic movies."
     
        self.results_txt.delete(0.0, END)
        self.results_txt.insert(0.0, likes)

# main
root = Tk()
root.title("Movie Chooser")
app = Application(root)
root.mainloop()