<?xml version='1.0' encoding='iso-8859-1'?>
<svg version="1.1" xmlns="http://www.w3.org/2000/svg" viewBox="0 0 36.038 36.038" xmlns:xlink="http://www.w3.org/1999/xlink" enable-background="new 0 0 36.038 36.038">
  <g>
    <g>
      <path d="m35.228,13.242c-0.036-0.011-0.047-0.03-0.092-0.039-3.629-0.692-10.842-2.063-10.842-2.063s-3.526-6.353-5.293-9.533c0-0.001-0.001-0.002-0.002-0.003-0.153-0.396-0.531-0.678-0.981-0.678-0.451,0-0.831,0.285-0.982,0.684-0.004,0.005-0.006,0.006-0.01,0.011-1.768,3.186-5.285,9.52-5.285,9.52s-7.111,1.357-10.719,2.045c-0.049,0.01-0.065,0.025-0.105,0.035-0.514,0.07-0.917,0.494-0.917,1.029 0,0.304 0.132,0.573 0.337,0.767 2.489,2.639 7.526,7.98 7.526,7.98s-0.91,7.228-1.363,10.824c-0.005,0.043 0.009,0.059 0.008,0.095-0.006,0.047-0.027,0.089-0.027,0.139 0,0.584 0.474,1.058 1.058,1.058 0.208,0 0.391-0.075 0.554-0.179 0.029-0.011 0.042-0.005 0.074-0.021 3.334-1.553 9.854-4.589 9.854-4.589s6.533,3.064 9.887,4.625c0.049,0.022 0.077,0.022 0.119,0.038 0.145,0.073 0.301,0.125 0.475,0.125 0.584,0 1.058-0.474 1.058-1.058 0-0.052-0.022-0.095-0.028-0.145-0.002-0.053 0.008-0.089 0-0.154-0.455-3.618-1.355-10.759-1.355-10.759s4.994-5.282 7.539-7.981c0.006-0.006 0.005-0.008 0.01-0.014 0.023-0.023 0.036-0.056 0.057-0.081 0.061-0.075 0.121-0.15 0.137-0.2 0.072-0.144 0.122-0.299 0.122-0.471-0.004-0.495-0.353-0.893-0.814-1.007zm-9.179,8.841l1.31,10.314-9.34-4.315-9.309,4.315 1.246-10.247-7.074-7.263 10.041-1.97 5.096-9.015h0.033l5.027,9.015 10.016,1.948-7.046,7.218z"/>
    </g>
  </g>
</svg>
