<svg width="51" height="51" viewBox="0 0 51 51" fill="none" xmlns="http://www.w3.org/2000/svg">
<path fill-rule="evenodd" clip-rule="evenodd" d="M49.9973 -2.94689e-05L25.4703 46.7177L13.7193 46.8408L0.523589 50.5208L3.66156 44.4891L24.8903 29.5389L49.4638 0.00555727L49.9973 -2.94689e-05Z" fill="#B79985"/>
</svg>
