<svg width="134" height="40" viewBox="0 0 134 40" fill="none" xmlns="http://www.w3.org/2000/svg">
<rect width="134" height="40" fill="#252525"/>
<path fill-rule="evenodd" clip-rule="evenodd" d="M47.4539 26.8167L48.7665 30.6172H50.4568L46.2756 18.5337H44.3632L40.2002 30.6172H41.8369L43.1092 26.8167H47.4509H47.4539ZM43.4363 25.5969L44.6369 22.1011C44.8731 21.3663 45.0731 20.6315 45.2548 19.9106H45.2912C45.4729 20.6076 45.6546 21.3265 45.9273 22.1161L47.1268 25.5939H43.4363V25.5969ZM51.9957 34.1662H53.5779V29.4547H53.6142C54.2114 30.3471 55.24 30.8647 56.3233 30.8178C58.3952 30.8178 60.3227 29.2755 60.3227 26.156C60.3227 23.5215 58.7223 21.7462 56.5959 21.7462C55.3165 21.6931 54.1121 22.3417 53.4658 23.4319H53.4294L53.3567 21.9384H51.9199C51.9563 22.7628 51.9926 23.6599 51.9926 24.771V34.1652L51.9957 34.1662ZM53.5778 25.5968C53.586 25.378 53.6227 25.1612 53.6869 24.9516C53.947 23.8327 54.9415 23.0289 56.1051 22.9971C57.7954 22.9971 58.7223 24.4906 58.7223 26.224C58.7223 28.2154 57.7409 29.5765 56.0506 29.5765C54.9152 29.5789 53.9246 28.817 53.6505 27.7305C53.6064 27.5181 53.582 27.3021 53.5778 27.0853V25.5918V25.5968ZM62.7732 34.1662H64.3554V29.4547H64.3958C64.9928 30.3468 66.021 30.8643 67.1039 30.8178C69.1768 30.8178 71.1043 29.2755 71.1043 26.156C71.1043 23.5215 69.5039 21.7462 67.3775 21.7462C66.0981 21.6931 64.8937 22.3417 64.2474 23.4319H64.211L64.1383 21.9384H62.7015C62.7379 22.7628 62.7742 23.6599 62.7742 24.771V34.1652L62.7732 34.1662ZM64.3555 25.5968C64.3637 25.378 64.4003 25.1612 64.4645 24.9516C64.7245 23.833 65.7185 23.0293 66.8817 22.9971C68.573 22.9971 69.4999 24.4906 69.4999 26.224C69.4999 28.2154 68.5185 29.5765 66.8272 29.5765C65.6922 29.5784 64.7022 28.8167 64.4282 27.7305C64.384 27.5181 64.3597 27.3021 64.3555 27.0853V25.5918V25.5968ZM76.4043 30.0243C77.3624 30.5442 78.4409 30.8101 79.5344 30.796C82.4242 30.796 83.8246 29.182 83.8246 27.3181C83.8246 25.5428 82.7695 24.5571 80.6945 23.7685C79.0033 23.1223 78.2581 22.5667 78.2581 21.4377C78.2581 20.6132 78.8942 19.6265 80.5673 19.6265C81.3778 19.6245 82.176 19.822 82.8896 20.201L83.3268 18.9276C82.4888 18.5083 81.5569 18.3049 80.6178 18.3361C78.2359 18.3361 76.6547 19.7301 76.6547 21.6219C76.6547 23.3245 77.8906 24.347 79.8858 25.046C81.5397 25.6732 82.194 26.3184 82.194 27.4485C82.194 28.6672 81.2489 29.5096 79.6313 29.5096C78.6315 29.5009 77.6522 29.2287 76.7951 28.721L76.4043 30.0243ZM86.3822 19.8594V21.9394H85.0181V23.1402H86.3822V27.8736C86.2934 28.6764 86.514 29.4829 87.0001 30.1328C87.4502 30.5913 88.0807 30.8334 88.7267 30.7959C89.209 30.811 89.69 30.7381 90.1454 30.5808L90.0727 29.397C89.7698 29.4728 89.4582 29.5089 89.1458 29.5045C88.2542 29.5045 87.9452 28.8952 87.9452 27.8198V23.1402H90.2362V21.9394H87.9452V19.4502L86.3822 19.8594ZM95.4171 21.7427C92.9816 21.7427 91.0541 23.4463 91.0541 26.3497C90.9574 27.5071 91.3598 28.6511 92.1626 29.5008C92.9653 30.3506 94.094 30.8274 95.2717 30.8143C96.4938 30.8414 97.67 30.3545 98.5062 29.4752C99.3424 28.5959 99.7597 27.4072 99.6538 26.2063C99.6538 23.5538 97.9444 21.7427 95.4171 21.7427ZM95.3807 22.9258C97.2719 22.9258 98.017 24.7907 98.017 26.2603C98.017 28.2148 96.872 29.6306 95.3444 29.6306C93.7813 29.6306 92.6727 28.1969 92.6727 26.2961C92.6727 24.6473 93.4905 22.9258 95.3807 22.9258V22.9258ZM101.668 30.6168H103.25V25.9909C103.254 25.7444 103.278 25.4986 103.323 25.2561C103.418 24.1442 104.337 23.2756 105.468 23.2299C105.651 23.2272 105.834 23.2453 106.014 23.2836V21.7961C105.865 21.7584 105.712 21.7403 105.559 21.7423C104.415 21.788 103.431 22.5557 103.123 23.6431H103.05L102.996 21.9395H101.595C101.65 22.746 101.668 23.6252 101.668 24.6467V30.6208V30.6168ZM114.683 26.5646C114.717 26.321 114.735 26.0756 114.738 25.8298C114.738 24.2367 113.974 21.7476 111.103 21.7476C108.539 21.7476 106.976 23.8096 106.976 26.4272C106.872 27.5969 107.29 28.7533 108.121 29.5939C108.953 30.4345 110.114 30.8758 111.303 30.8022C112.306 30.8284 113.304 30.6451 114.231 30.2645L113.958 29.1345C113.188 29.4556 112.357 29.6085 111.522 29.5825C110.698 29.6431 109.888 29.3439 109.307 28.7642C108.726 28.1844 108.433 27.3826 108.504 26.5706H114.679L114.683 26.5646ZM108.524 25.4354C108.548 24.0839 109.612 22.9727 110.979 22.8716C111.633 22.8811 112.252 23.1678 112.677 23.6585C113.102 24.1492 113.293 24.7965 113.2 25.4354H108.52H108.524Z" fill="white"/>
<path d="M47.4539 26.8167L47.643 26.7514L47.5964 26.6167H47.4539V26.8167ZM48.7665 30.6172L48.5775 30.6825L48.624 30.8172H48.7665V30.6172ZM50.4568 30.6172V30.8172H50.7376L50.6458 30.5518L50.4568 30.6172ZM46.2756 18.5337L46.4646 18.4683L46.418 18.3337H46.2756V18.5337ZM44.3632 18.5337V18.3337H44.2206L44.1741 18.4685L44.3632 18.5337ZM40.2002 30.6172L40.0111 30.552L39.9198 30.8172H40.2002V30.6172ZM41.8369 30.6172V30.8172H41.9809L42.0266 30.6807L41.8369 30.6172ZM43.1092 26.8167V26.6167H42.9652L42.9195 26.7532L43.1092 26.8167ZM43.4363 25.5969H43.2363L43.6255 25.6619L43.4363 25.5969ZM44.6369 22.1011L44.8261 22.1661L44.8273 22.1623L44.6369 22.1011ZM45.2548 19.9106V19.7106H45.099L45.0609 19.8618L45.2548 19.9106ZM45.2912 19.9106L45.4847 19.8602L45.4457 19.7106H45.2912V19.9106ZM45.9273 22.1161L46.1163 22.0508L46.1163 22.0508L45.9273 22.1161ZM47.1268 25.5939V25.7939H47.4073L47.3159 25.5287L47.1268 25.5939ZM43.4363 25.5939V25.3939H43.2363V25.5939H43.4363ZM51.9957 34.1662L51.9332 34.3562L51.9636 34.3662H51.9957V34.1662ZM53.5779 34.1662V34.3662H53.7779V34.1662H53.5779ZM53.5779 29.4547V29.2547H53.3779V29.4547H53.5779ZM53.6142 29.4547L53.7804 29.3435L53.721 29.2547H53.6142V29.4547ZM56.3233 30.8178V30.6176L56.3146 30.618L56.3233 30.8178ZM56.5959 21.7462L56.5876 21.9462H56.5959V21.7462ZM53.4658 23.4319V23.6319H53.5797L53.6378 23.5339L53.4658 23.4319ZM53.4294 23.4319L53.2297 23.4416L53.2389 23.6319H53.4294V23.4319ZM53.3567 21.9384L53.5565 21.9286L53.5473 21.7384H53.3567V21.9384ZM51.9199 21.9384V21.7384H51.7109L51.7201 21.9472L51.9199 21.9384ZM51.9926 34.1652H51.7926V34.31L51.9302 34.3552L51.9926 34.1652ZM53.5778 25.5968H53.3778L53.7777 25.6043L53.5778 25.5968ZM53.6869 24.9516L53.8786 25.0103L53.8817 24.9969L53.6869 24.9516ZM56.1051 22.9971V22.797L56.0997 22.7971L56.1051 22.9971ZM56.0506 29.5765L56.0506 29.3765L56.0502 29.3765L56.0506 29.5765ZM53.6505 27.7305L53.4545 27.7712L53.4566 27.7794L53.6505 27.7305ZM53.5778 27.0853H53.3778L53.3779 27.0892L53.5778 27.0853ZM62.7732 34.1662L62.6328 34.0238L62.2856 34.3662H62.7732V34.1662ZM64.3554 34.1662V34.3662H64.5554V34.1662H64.3554ZM64.3554 29.4547V29.2547H64.1554V29.4547H64.3554ZM64.3958 29.4547L64.562 29.3435L64.5026 29.2547H64.3958V29.4547ZM67.1039 30.8178V30.6176L67.0953 30.618L67.1039 30.8178ZM67.3775 21.7462L67.3692 21.9462H67.3775V21.7462ZM64.2474 23.4319V23.6319H64.3613L64.4194 23.5339L64.2474 23.4319ZM64.211 23.4319L64.0113 23.4416L64.0205 23.6319H64.211V23.4319ZM64.1383 21.9384L64.3381 21.9286L64.3289 21.7384H64.1383V21.9384ZM62.7015 21.9384V21.7384H62.4925L62.5017 21.9472L62.7015 21.9384ZM62.7742 34.1652L62.9147 34.3076L62.9742 34.2489V34.1652H62.7742ZM64.3555 25.5968H64.1555L64.5553 25.6043L64.3555 25.5968ZM64.4645 24.9516L64.6562 25.0103L64.6593 24.9969L64.4645 24.9516ZM66.8817 22.9971V22.797L66.8762 22.7971L66.8817 22.9971ZM66.8272 29.5765L66.8272 29.3765L66.8269 29.3765L66.8272 29.5765ZM64.4282 27.7305L64.2322 27.7712L64.2342 27.7794L64.4282 27.7305ZM64.3555 27.0853L64.1554 27.0853L64.1555 27.0892L64.3555 27.0853ZM76.4043 30.0243L76.2127 29.9669L76.166 30.1226L76.3089 30.2001L76.4043 30.0243ZM79.5344 30.796V30.596L79.5318 30.596L79.5344 30.796ZM80.6945 23.7685L80.6232 23.9554L80.6235 23.9555L80.6945 23.7685ZM80.5673 19.6265L80.5673 19.8265L80.5678 19.8265L80.5673 19.6265ZM82.8896 20.201L82.7958 20.3777L83.0027 20.4876L83.0788 20.266L82.8896 20.201ZM83.3268 18.9276L83.516 18.9925L83.5728 18.827L83.4163 18.7487L83.3268 18.9276ZM80.6178 18.3361V18.5362L80.6244 18.536L80.6178 18.3361ZM79.8858 25.046L79.9567 24.8589L79.9519 24.8572L79.8858 25.046ZM79.6313 29.5096L79.6296 29.7096H79.6313V29.5096ZM76.7951 28.721L76.897 28.5489L76.6769 28.4186L76.6035 28.6636L76.7951 28.721ZM86.3822 19.8594L86.3315 19.6659L86.1822 19.705V19.8594H86.3822ZM86.3822 21.9394V22.1394H86.5822V21.9394H86.3822ZM85.0181 21.9394V21.7394H84.8181V21.9394H85.0181ZM85.0181 23.1402H84.8181V23.3402H85.0181V23.1402ZM86.3822 23.1402H86.5822V22.9402H86.3822V23.1402ZM86.3822 27.8736L86.581 27.8956L86.5822 27.8846V27.8736H86.3822ZM87.0001 30.1328L86.84 30.2526L86.848 30.2633L86.8574 30.2729L87.0001 30.1328ZM88.7267 30.7959L88.733 30.596L88.7241 30.5957L88.7151 30.5962L88.7267 30.7959ZM90.1454 30.5808L90.2106 30.7699L90.3543 30.7203L90.345 30.5686L90.1454 30.5808ZM90.0727 29.397L90.2723 29.3847L90.2575 29.1445L90.0241 29.203L90.0727 29.397ZM89.1458 29.5045L89.1486 29.3045H89.1458V29.5045ZM87.9452 23.1402V22.9402H87.7452V23.1402H87.9452ZM90.2362 23.1402V23.3402H90.4362V23.1402H90.2362ZM90.2362 21.9394H90.4362V21.7394H90.2362V21.9394ZM87.9452 21.9394H87.7452V22.1394H87.9452V21.9394ZM87.9452 19.4502H88.1452V19.1911L87.8946 19.2567L87.9452 19.4502ZM91.0541 26.3497L91.2534 26.3663L91.2541 26.358V26.3497H91.0541ZM95.2717 30.8143L95.2761 30.6142L95.2694 30.6143L95.2717 30.8143ZM99.6538 26.2063L99.4538 26.2063V26.2151L99.4546 26.2238L99.6538 26.2063ZM92.6727 26.2961L92.8727 26.2961L92.6727 26.2961ZM101.668 30.6168V30.4168H101.468V30.6168H101.668ZM103.25 30.6168V30.8168H103.45V30.6168H103.25ZM103.25 25.9909L103.05 25.988V25.9909H103.25ZM103.323 25.2561L103.52 25.2925L103.521 25.2828L103.522 25.273L103.323 25.2561ZM105.468 23.2299L105.465 23.0298L105.46 23.03L105.468 23.2299ZM106.014 23.2836L105.972 23.4792L106.214 23.5309V23.2836H106.014ZM106.014 21.7961H106.214V21.6405L106.063 21.6022L106.014 21.7961ZM105.559 21.7423L105.556 21.5423L105.551 21.5425L105.559 21.7423ZM103.123 23.6431V23.8431H103.274L103.316 23.6976L103.123 23.6431ZM103.05 23.6431L102.851 23.6495L102.857 23.8431H103.05V23.6431ZM102.996 21.9395L103.196 21.9331L103.19 21.7395H102.996V21.9395ZM101.595 21.9395V21.7395H101.381L101.396 21.953L101.595 21.9395ZM114.683 26.5646L114.849 26.6766L114.875 26.6381L114.881 26.5919L114.683 26.5646ZM114.738 25.8298L114.938 25.8321V25.8298H114.738ZM106.976 26.4272L107.175 26.445L107.176 26.4361V26.4272H106.976ZM111.303 30.8022L111.308 30.6023L111.299 30.602L111.29 30.6026L111.303 30.8022ZM114.231 30.2645L114.307 30.4496L114.466 30.3844L114.425 30.2176L114.231 30.2645ZM113.958 29.1345L114.153 29.0876L114.098 28.8596L113.881 28.9499L113.958 29.1345ZM111.522 29.5825L111.528 29.3826L111.518 29.3823L111.507 29.383L111.522 29.5825ZM108.504 26.5706V26.3706H108.321L108.305 26.5531L108.504 26.5706ZM114.679 26.5706V26.7706H114.785L114.845 26.6826L114.679 26.5706ZM108.524 25.4354V25.6354H108.721L108.724 25.439L108.524 25.4354ZM110.979 22.8716L110.982 22.6716L110.973 22.6715L110.964 22.6721L110.979 22.8716ZM113.2 25.4354V25.6354H113.373L113.398 25.4641L113.2 25.4354ZM47.2649 26.882L48.5775 30.6825L48.9556 30.5519L47.643 26.7514L47.2649 26.882ZM48.7665 30.8172H50.4568V30.4172H48.7665V30.8172ZM50.6458 30.5518L46.4646 18.4683L46.0866 18.5991L50.2678 30.6826L50.6458 30.5518ZM46.2756 18.3337H44.3632V18.7337H46.2756V18.3337ZM44.1741 18.4685L40.0111 30.552L40.3893 30.6823L44.5523 18.5988L44.1741 18.4685ZM40.2002 30.8172H41.8369V30.4172H40.2002V30.8172ZM42.0266 30.6807L43.2988 26.8802L42.9195 26.7532L41.6473 30.5537L42.0266 30.6807ZM43.1092 27.0167H47.4509V26.6167H43.1092V27.0167ZM47.4509 27.0167H47.4539V26.6167H47.4509V27.0167ZM43.6255 25.6619L44.826 22.1661L44.4477 22.0362L43.2472 25.532L43.6255 25.6619ZM44.8273 22.1623C45.0653 21.422 45.2664 20.6827 45.4487 19.9595L45.0609 19.8618C44.8797 20.5803 44.681 21.3106 44.4465 22.0399L44.8273 22.1623ZM45.2548 20.1106H45.2912V19.7106H45.2548V20.1106ZM45.0976 19.9611C45.2789 20.6562 45.4626 21.383 45.7382 22.1813L46.1163 22.0508C45.8467 21.27 45.6669 20.5591 45.4847 19.8602L45.0976 19.9611ZM45.7382 22.1813L46.9377 25.6592L47.3159 25.5287L46.1163 22.0508L45.7382 22.1813ZM47.1268 25.3939H43.4363V25.7939H47.1268V25.3939ZM43.2363 25.5939V25.5969H43.6363V25.5939H43.2363ZM51.9957 34.3662H53.5779V33.9662H51.9957V34.3662ZM53.7779 34.1662V29.4547H53.3779V34.1662H53.7779ZM53.5779 29.6547H53.6142V29.2547H53.5779V29.6547ZM53.448 29.5659C54.0845 30.5171 55.1798 31.0675 56.3319 31.0176L56.3146 30.618C55.3003 30.6619 54.3383 30.1772 53.7804 29.3435L53.448 29.5659ZM56.3233 31.0178C57.4093 31.0178 58.4629 30.613 59.2446 29.7948C60.0269 28.9759 60.5227 27.758 60.5227 26.156H60.1227C60.1227 27.6735 59.6547 28.7864 58.9553 29.5185C58.2552 30.2514 57.3091 30.6178 56.3233 30.6178V31.0178ZM60.5227 26.156C60.5227 23.4401 58.8598 21.5462 56.5959 21.5462V21.9462C58.5849 21.9462 60.1227 23.6029 60.1227 26.156H60.5227ZM56.6042 21.5464C55.2522 21.4902 53.978 22.1756 53.2938 23.3299L53.6378 23.5339C54.2461 22.5078 55.3807 21.8959 56.5876 21.946L56.6042 21.5464ZM53.4658 23.2319H53.4294V23.6319H53.4658V23.2319ZM53.6292 23.4221L53.5565 21.9286L53.157 21.9481L53.2297 23.4416L53.6292 23.4221ZM53.3567 21.7384H51.9199V22.1384H53.3567V21.7384ZM51.7201 21.9472C51.7564 22.7709 51.7926 23.6644 51.7926 24.771H52.1926C52.1926 23.6553 52.1561 22.7547 52.1197 21.9295L51.7201 21.9472ZM51.7926 24.771V34.1652H52.1926V24.771H51.7926ZM51.9302 34.3552L51.9332 34.3562L52.0581 33.9762L52.0551 33.9752L51.9302 34.3552ZM53.7777 25.6043C53.7852 25.4028 53.819 25.2032 53.8781 25.0102L53.4957 24.893C53.4264 25.1191 53.3868 25.3531 53.378 25.5893L53.7777 25.6043ZM53.8817 24.9969C54.1208 23.9683 55.0362 23.2264 56.1106 23.197L56.0997 22.7971C54.8468 22.8314 53.7731 23.6971 53.4921 24.9063L53.8817 24.9969ZM56.1051 23.1971C56.8838 23.1971 57.4802 23.5379 57.8876 24.0806C58.299 24.6286 58.5223 25.3903 58.5223 26.224H58.9223C58.9223 25.3243 58.6821 24.4726 58.2075 23.8404C57.7289 23.203 57.0167 22.7971 56.1051 22.7971V23.1971ZM58.5223 26.224C58.5223 27.1895 58.2841 27.9801 57.8622 28.5245C57.4447 29.0632 56.836 29.3765 56.0506 29.3765V29.7765C56.9554 29.7765 57.6826 29.4093 58.1784 28.7695C58.6697 28.1355 58.9223 27.2499 58.9223 26.224H58.5223ZM56.0502 29.3765C55.0048 29.3787 54.0957 28.6774 53.8445 27.6816L53.4566 27.7794C53.7536 28.9566 54.8256 29.7791 56.051 29.7765L56.0502 29.3765ZM53.8463 27.6898C53.8047 27.4895 53.7818 27.2858 53.7778 27.0814L53.3779 27.0892C53.3823 27.3184 53.408 27.5467 53.4547 27.7712L53.8463 27.6898ZM53.7778 27.0853V25.5918H53.3778V27.0853H53.7778ZM53.3778 25.5918V25.5968H53.7778V25.5918H53.3778ZM62.7732 34.3662H64.3554V33.9662H62.7732V34.3662ZM64.5554 34.1662V29.4547H64.1554V34.1662H64.5554ZM64.3554 29.6547H64.3958V29.2547H64.3554V29.6547ZM64.2296 29.5659C64.8659 30.5167 65.9607 31.0671 67.1124 31.0176L67.0953 30.618C66.0813 30.6615 65.1198 30.1769 64.562 29.3435L64.2296 29.5659ZM67.1039 31.0178C68.1904 31.0178 69.2443 30.613 70.026 29.7949C70.8085 28.9759 71.3043 27.758 71.3043 26.156H70.9043C70.9043 27.6735 70.4363 28.7864 69.7368 29.5185C69.0366 30.2514 68.0903 30.6178 67.1039 30.6178V31.0178ZM71.3043 26.156C71.3043 23.4401 69.6414 21.5462 67.3775 21.5462V21.9462C69.3665 21.9462 70.9043 23.6029 70.9043 26.156H71.3043ZM67.3858 21.5464C66.0338 21.4902 64.7596 22.1756 64.0754 23.3299L64.4194 23.5339C65.0277 22.5078 66.1623 21.8959 67.3692 21.946L67.3858 21.5464ZM64.2474 23.2319H64.211V23.6319H64.2474V23.2319ZM64.4108 23.4221L64.3381 21.9286L63.9386 21.9481L64.0113 23.4416L64.4108 23.4221ZM64.1383 21.7384H62.7015V22.1384H64.1383V21.7384ZM62.5017 21.9472C62.5381 22.7709 62.5742 23.6644 62.5742 24.771H62.9742C62.9742 23.6553 62.9377 22.7547 62.9013 21.9295L62.5017 21.9472ZM62.5742 24.771V34.1652H62.9742V24.771H62.5742ZM62.6338 34.0228L62.6328 34.0238L62.9137 34.3086L62.9147 34.3076L62.6338 34.0228ZM64.5553 25.6043C64.5629 25.4028 64.5966 25.2032 64.6557 25.0102L64.2733 24.893C64.204 25.1191 64.1644 25.3531 64.1556 25.5893L64.5553 25.6043ZM64.6593 24.9969C64.8983 23.9686 65.8132 23.2268 66.8873 23.197L66.8762 22.7971C65.6238 22.8319 64.5507 23.6975 64.2697 24.9063L64.6593 24.9969ZM66.8817 23.1971C67.6609 23.1971 68.2576 23.538 68.6651 24.0806C69.0767 24.6286 69.2999 25.3903 69.2999 26.224H69.6999C69.6999 25.3243 69.4597 24.4725 68.985 23.8404C68.5062 23.2029 67.7938 22.7971 66.8817 22.7971V23.1971ZM69.2999 26.224C69.2999 27.1895 69.0617 27.9801 68.6397 28.5245C68.2221 29.0631 67.6132 29.3765 66.8272 29.3765V29.7765C67.7325 29.7765 68.4599 29.4093 68.9558 28.7696C69.4473 28.1356 69.6999 27.2499 69.6999 26.224H69.2999ZM66.8269 29.3765C65.7818 29.3783 64.8732 28.6771 64.6221 27.6816L64.2342 27.7794C64.5311 28.9562 65.6025 29.7786 66.8276 29.7765L66.8269 29.3765ZM64.624 27.6898C64.5823 27.4895 64.5594 27.2858 64.5554 27.0814L64.1555 27.0892C64.1599 27.3184 64.1857 27.5467 64.2323 27.7712L64.624 27.6898ZM64.5555 27.0853V25.5918H64.1555V27.0853H64.5555ZM64.1555 25.5918V25.5968H64.5555V25.5918H64.1555ZM76.3089 30.2001C77.2972 30.7364 78.4094 31.0105 79.537 30.996L79.5318 30.596C78.4724 30.6097 77.4276 30.3521 76.4997 29.8486L76.3089 30.2001ZM79.5344 30.996C81.0161 30.996 82.1402 30.5818 82.8965 29.9051C83.6539 29.2274 84.0246 28.3019 84.0246 27.3181H83.6246C83.6246 28.1982 83.2951 29.0117 82.6298 29.607C81.9634 30.2032 80.9425 30.596 79.5344 30.596V30.996ZM84.0246 27.3181C84.0246 26.3854 83.7453 25.6452 83.1847 25.0377C82.6308 24.4374 81.8146 23.9802 80.7656 23.5816L80.6235 23.9555C81.6494 24.3454 82.3983 24.7754 82.8907 25.3089C83.3764 25.8353 83.6246 26.4755 83.6246 27.3181H84.0246ZM80.7659 23.5817C79.9225 23.2595 79.3444 22.9698 78.9765 22.6361C78.6219 22.3143 78.4581 21.9476 78.4581 21.4377H78.0581C78.0581 22.0568 78.2669 22.5324 78.7077 22.9323C79.1352 23.3202 79.7753 23.6314 80.6232 23.9554L80.7659 23.5817ZM78.4581 21.4377C78.4581 21.0758 78.5978 20.6769 78.9231 20.3679C79.2468 20.0604 79.771 19.8265 80.5673 19.8265V19.4265C79.6905 19.4265 79.0602 19.686 78.6476 20.0779C78.2365 20.4684 78.0581 20.9751 78.0581 21.4377H78.4581ZM80.5678 19.8265C81.3456 19.8246 82.1114 20.0141 82.7958 20.3777L82.9835 20.0244C82.2407 19.6299 81.4101 19.4245 80.5668 19.4265L80.5678 19.8265ZM83.0788 20.266L83.516 18.9925L83.1377 18.8626L82.7005 20.1361L83.0788 20.266ZM83.4163 18.7487C82.5484 18.3145 81.5835 18.1039 80.6112 18.1362L80.6244 18.536C81.5304 18.5059 82.4292 18.7022 83.2374 19.1064L83.4163 18.7487ZM80.6178 18.1361C79.3886 18.1361 78.3495 18.496 77.614 19.1167C76.8765 19.7392 76.4547 20.6163 76.4547 21.6219H76.8547C76.8547 20.7356 77.2235 19.9698 77.872 19.4224C78.5227 18.8732 79.4651 18.5361 80.6178 18.5361V18.1361ZM76.4547 21.6219C76.4547 22.5286 76.7865 23.2603 77.3809 23.852C77.9694 24.4378 78.8088 24.8806 79.8196 25.2347L79.9519 24.8572C78.9676 24.5124 78.1914 24.0944 77.6631 23.5685C77.1409 23.0486 76.8547 22.4177 76.8547 21.6219H76.4547ZM79.8148 25.233C80.6338 25.5436 81.1774 25.8491 81.5167 26.1981C81.8464 26.5373 81.994 26.929 81.994 27.4485H82.394C82.394 26.838 82.2144 26.342 81.8035 25.9193C81.4021 25.5064 80.7916 25.1756 79.9567 24.859L79.8148 25.233ZM81.994 27.4485C81.994 28.0021 81.7814 28.4594 81.3917 28.782C80.9983 29.1076 80.4071 29.3096 79.6313 29.3096V29.7096C80.4731 29.7096 81.1632 29.4904 81.6467 29.0901C82.134 28.6868 82.394 28.1137 82.394 27.4485H81.994ZM79.633 29.3096C78.6683 29.3013 77.7237 29.0385 76.897 28.5489L76.6931 28.8931C77.5808 29.4188 78.5946 29.7006 79.6296 29.7096L79.633 29.3096ZM76.6035 28.6636L76.2127 29.9669L76.5959 30.0818L76.9866 28.7784L76.6035 28.6636ZM86.1822 19.8594V21.9394H86.5822V19.8594H86.1822ZM86.3822 21.7394H85.0181V22.1394H86.3822V21.7394ZM84.8181 21.9394V23.1402H85.2181V21.9394H84.8181ZM85.0181 23.3402H86.3822V22.9402H85.0181V23.3402ZM86.1822 23.1402V27.8736H86.5822V23.1402H86.1822ZM86.1834 27.8516C86.089 28.7052 86.3236 29.5622 86.84 30.2526L87.1603 30.013C86.7044 29.4035 86.4978 28.6477 86.581 27.8956L86.1834 27.8516ZM86.8574 30.2729C87.3483 30.7729 88.0352 31.0364 88.7383 30.9956L88.7151 30.5962C88.1263 30.6304 87.5522 30.4096 87.1429 29.9927L86.8574 30.2729ZM88.7205 30.9958C89.227 31.0116 89.7322 30.935 90.2106 30.7699L90.0801 30.3918C89.6477 30.5411 89.191 30.6103 88.733 30.596L88.7205 30.9958ZM90.345 30.5686L90.2723 29.3847L89.873 29.4092L89.9457 30.5931L90.345 30.5686ZM90.0241 29.203C89.7381 29.2746 89.4437 29.3087 89.1486 29.3045L89.1429 29.7045C89.4726 29.7092 89.8016 29.671 90.1212 29.591L90.0241 29.203ZM89.1458 29.3045C88.7522 29.3045 88.5223 29.1745 88.3782 28.9555C88.2225 28.7188 88.1452 28.3465 88.1452 27.8198H87.7452C87.7452 28.3685 87.8224 28.8385 88.0441 29.1753C88.2773 29.5299 88.6478 29.7045 89.1458 29.7045V29.3045ZM88.1452 27.8198V23.1402H87.7452V27.8198H88.1452ZM87.9452 23.3402H90.2362V22.9402H87.9452V23.3402ZM90.4362 23.1402V21.9394H90.0362V23.1402H90.4362ZM90.2362 21.7394H87.9452V22.1394H90.2362V21.7394ZM88.1452 21.9394V19.4502H87.7452V21.9394H88.1452ZM87.8946 19.2567L86.3315 19.6659L86.4328 20.0529L87.9959 19.6437L87.8946 19.2567ZM95.4171 21.5427C94.1521 21.5427 93.0085 21.9858 92.1807 22.8162C91.3522 23.6473 90.8541 24.8522 90.8541 26.3497H91.2541C91.2541 24.9437 91.7198 23.8451 92.464 23.0986C93.2088 22.3514 94.2466 21.9427 95.4171 21.9427V21.5427ZM90.8548 26.333C90.7533 27.5475 91.1757 28.7474 92.0172 29.6382L92.308 29.3635C91.544 28.5548 91.1615 27.4666 91.2534 26.3663L90.8548 26.333ZM92.0172 29.6382C92.8586 30.5288 94.041 31.028 95.2739 31.0142L95.2694 30.6143C94.1471 30.6268 93.0721 30.1724 92.308 29.3635L92.0172 29.6382ZM95.2672 31.0142C96.5452 31.0426 97.7757 30.5335 98.6511 29.613L98.3613 29.3374C97.5642 30.1755 96.4424 30.6402 95.2761 30.6143L95.2672 31.0142ZM98.6511 29.613C99.5266 28.6924 99.964 27.4473 99.853 26.1887L99.4546 26.2238C99.5554 27.3672 99.1582 28.4993 98.3613 29.3374L98.6511 29.613ZM99.8538 26.2063C99.8538 24.8368 99.4119 23.6691 98.6283 22.8422C97.8439 22.0145 96.7305 21.5427 95.4171 21.5427V21.9427C96.6309 21.9427 97.6359 22.3765 98.338 23.1174C99.041 23.8592 99.4538 24.9233 99.4538 26.2063L99.8538 26.2063ZM95.3807 23.1258C96.2483 23.1258 96.8486 23.5485 97.2404 24.151C97.6372 24.7611 97.817 25.5544 97.817 26.2603H98.217C98.217 25.4966 98.0243 24.6226 97.5757 23.9329C97.1222 23.2355 96.4043 22.7258 95.3807 22.7258V23.1258ZM97.817 26.2603C97.817 28.1489 96.7218 29.4306 95.3444 29.4306V29.8306C97.0223 29.8306 98.217 28.2807 98.217 26.2603H97.817ZM95.3444 29.4306C93.9326 29.4306 92.8727 28.1322 92.8727 26.2961H92.4727C92.4727 28.2615 93.6301 29.8306 95.3444 29.8306V29.4306ZM92.8727 26.2961C92.8727 25.5008 93.0705 24.7011 93.4823 24.1065C93.8887 23.5196 94.5064 23.1258 95.3807 23.1258V22.7258C94.3648 22.7258 93.6285 23.1928 93.1534 23.8788C92.6837 24.5571 92.4727 25.4426 92.4727 26.2961L92.8727 26.2961ZM101.668 30.8168H103.25V30.4168H101.668V30.8168ZM103.45 30.6168V25.9909H103.05V30.6168H103.45ZM103.45 25.9937C103.454 25.7585 103.477 25.5239 103.52 25.2925L103.126 25.2197C103.079 25.4733 103.054 25.7303 103.05 25.988L103.45 25.9937ZM103.522 25.273C103.608 24.2637 104.444 23.4715 105.476 23.4297L105.46 23.03C104.23 23.0798 103.227 24.0246 103.124 25.2391L103.522 25.273ZM105.471 23.4299C105.639 23.4274 105.807 23.444 105.972 23.4792L106.056 23.0881C105.862 23.0466 105.663 23.027 105.465 23.0299L105.471 23.4299ZM106.214 23.2836V21.7961H105.814V23.2836H106.214ZM106.063 21.6022C105.897 21.5603 105.727 21.5401 105.556 21.5424L105.561 21.9423C105.697 21.9405 105.833 21.9566 105.965 21.99L106.063 21.6022ZM105.551 21.5425C104.322 21.5916 103.262 22.4165 102.931 23.5886L103.316 23.6976C103.599 22.6949 104.507 21.9845 105.566 21.9422L105.551 21.5425ZM103.123 23.4431H103.05V23.8431H103.123V23.4431ZM103.25 23.6367L103.196 21.9331L102.796 21.9459L102.851 23.6495L103.25 23.6367ZM102.996 21.7395H101.595V22.1395H102.996V21.7395ZM101.396 21.953C101.45 22.753 101.468 23.6271 101.468 24.6467H101.868C101.868 23.6232 101.85 22.7389 101.795 21.926L101.396 21.953ZM101.468 24.6467V30.6208H101.868V24.6467H101.468ZM101.868 30.6208V30.6168H101.468V30.6208H101.868ZM114.881 26.5919C114.916 26.34 114.935 26.0863 114.938 25.8321L114.538 25.8276C114.535 26.065 114.518 26.302 114.485 26.5373L114.881 26.5919ZM114.938 25.8298C114.938 25.0073 114.742 23.9442 114.163 23.08C113.578 22.205 112.608 21.5476 111.103 21.5476V21.9476C112.47 21.9476 113.317 22.5348 113.831 23.3025C114.352 24.0813 114.538 25.0592 114.538 25.8298H114.938ZM111.103 21.5476C109.763 21.5476 108.675 22.0886 107.925 22.9768C107.178 23.8618 106.776 25.0799 106.776 26.4272H107.176C107.176 25.1569 107.555 24.0352 108.231 23.2348C108.904 22.4376 109.879 21.9476 111.103 21.9476V21.5476ZM106.777 26.4094C106.667 27.6382 107.107 28.8524 107.979 29.7345L108.263 29.4533C107.473 28.6542 107.076 27.5556 107.175 26.445L106.777 26.4094ZM107.979 29.7345C108.851 30.6166 110.07 31.0789 111.315 31.0018L111.29 30.6026C110.159 30.6726 109.054 30.2525 108.263 29.4533L107.979 29.7345ZM111.298 31.0021C112.329 31.029 113.354 30.8407 114.307 30.4496L114.155 30.0795C113.254 30.4495 112.284 30.6277 111.308 30.6023L111.298 31.0021ZM114.425 30.2176L114.153 29.0876L113.764 29.1814L114.036 30.3114L114.425 30.2176ZM113.881 28.9499C113.138 29.26 112.335 29.4077 111.528 29.3826L111.516 29.7824C112.38 29.8092 113.239 29.6512 114.035 29.319L113.881 28.9499ZM111.507 29.383C110.74 29.4394 109.988 29.161 109.448 28.6226L109.166 28.9057C109.788 29.5268 110.655 29.8467 111.536 29.782L111.507 29.383ZM109.448 28.6226C108.909 28.0844 108.637 27.3406 108.703 26.5881L108.305 26.5531C108.228 27.4245 108.543 28.2845 109.166 28.9057L109.448 28.6226ZM108.504 26.7706H114.679V26.3706H108.504V26.7706ZM114.845 26.6826L114.849 26.6766L114.518 26.4526L114.513 26.4586L114.845 26.6826ZM108.724 25.439C108.746 24.1931 109.727 23.1647 110.993 23.071L110.964 22.6721C109.496 22.7807 108.35 23.9747 108.324 25.4319L108.724 25.439ZM110.976 23.0716C111.574 23.0803 112.138 23.3422 112.526 23.7894L112.828 23.5275C112.365 22.9933 111.692 22.682 110.982 22.6716L110.976 23.0716ZM112.526 23.7894C112.913 24.2365 113.086 24.8257 113.002 25.4067L113.398 25.4641C113.499 24.7674 113.291 24.0618 112.828 23.5275L112.526 23.7894ZM113.2 25.2354H108.52V25.6354H113.2V25.2354ZM108.52 25.6354H108.524V25.2354H108.52V25.6354Z" fill="white"/>
<path fill-rule="evenodd" clip-rule="evenodd" d="M24.766 12.0636C27.6165 12.0636 29.439 14.7735 29.439 14.7735C27.7535 15.7579 26.7022 17.537 26.6603 19.4757C26.6535 21.6864 28.0509 23.6621 30.1499 24.4093C30.1499 24.4093 27.3921 30.8332 24.2964 30.8332C22.5556 30.8332 22.4389 29.8449 20.1248 29.8449C18.1158 29.8449 17.4378 30.8332 15.9074 30.8332C12.9861 30.8332 9.2124 24.5674 9.2124 19.4678C9.2124 14.1746 13.033 12.0557 15.4278 12.0557C17.5316 12.0557 18.408 13.2713 20.1019 13.2713C21.5276 13.2792 22.6493 12.0636 24.766 12.0636ZM24.2756 6.66699C24.6953 9.26125 22.3005 12.4692 19.438 12.3655C19.0153 9.06656 22.1001 6.83994 24.2736 6.66699H24.2756Z" fill="white"/>
<path fill-rule="evenodd" clip-rule="evenodd" d="M42.7124 12.7607V10.4161H43.362C43.4303 10.2621 43.4938 10.1056 43.5524 9.94671C43.611 9.78783 43.6656 9.6081 43.716 9.40749C43.7665 9.20689 43.8137 8.97661 43.8577 8.71662C43.9016 8.45664 43.9431 8.14852 43.9822 7.79225C44.0278 7.41673 44.0636 7.04682 44.0896 6.68253C44.1157 6.31824 44.136 5.97722 44.1507 5.65946C44.1653 5.34171 44.1751 5.05445 44.18 4.79768C44.1849 4.54091 44.189 4.33068 44.1922 4.16699H48.7049V10.4161H49.5156V12.7607H48.617V11.2442H43.611V12.7607H42.7124ZM45.0909 4.99512C45.0909 5.45409 45.0721 5.91146 45.0347 6.36723C44.9973 6.823 44.9525 7.28197 44.9004 7.74415C44.8646 8.11005 44.828 8.42058 44.7905 8.67575C44.7531 8.93091 44.714 9.15719 44.6733 9.35458C44.6326 9.55197 44.587 9.73331 44.5366 9.89861C44.4861 10.0639 44.4283 10.2364 44.3632 10.4162H47.7184V4.99512H45.0909ZM53.8574 8.65869C53.8574 8.37303 53.8248 8.11065 53.7597 7.87153C53.6946 7.63241 53.5969 7.4262 53.4667 7.25288C53.3364 7.07956 53.1761 6.94395 52.9856 6.84606C52.7951 6.74817 52.5745 6.69922 52.3238 6.69922C52.0731 6.69922 51.8534 6.74817 51.6645 6.84606C51.4757 6.94395 51.3161 7.07956 51.1859 7.25288C51.0557 7.4262 50.958 7.63241 50.8929 7.87153C50.8278 8.11065 50.7952 8.37303 50.7952 8.65869C50.7952 8.94756 50.8278 9.21315 50.8929 9.45548C50.958 9.69781 51.0557 9.90563 51.1859 10.0789C51.3161 10.2523 51.4757 10.3879 51.6645 10.4858C51.8534 10.5837 52.0731 10.6326 52.3238 10.6326C52.5745 10.6326 52.7951 10.5837 52.9856 10.4858C53.1761 10.3879 53.3364 10.2523 53.4667 10.0789C53.5969 9.90563 53.6946 9.69781 53.7597 9.45548C53.8248 9.21315 53.8574 8.94756 53.8574 8.65869ZM54.756 8.65849C54.756 9.08216 54.7006 9.4633 54.5899 9.80192C54.4792 10.1405 54.3197 10.4286 54.1113 10.6661C53.9029 10.9036 53.6482 11.0858 53.347 11.2125C53.0458 11.3393 52.7048 11.4027 52.3238 11.4027C51.9429 11.4027 51.6027 11.3393 51.3031 11.2125C51.0036 11.0858 50.7496 10.9036 50.5412 10.6661C50.3328 10.4286 50.1733 10.1405 50.0626 9.80192C49.9519 9.4633 49.8966 9.08216 49.8966 8.65849C49.8966 8.24124 49.9519 7.86411 50.0626 7.5271C50.1733 7.19009 50.3328 6.90283 50.5412 6.66532C50.7496 6.42781 51.0036 6.24566 51.3031 6.11888C51.6027 5.9921 51.9429 5.92871 52.3238 5.92871C52.7048 5.92871 53.0458 5.9921 53.347 6.11888C53.6482 6.24566 53.9029 6.42781 54.1113 6.66532C54.3197 6.90283 54.4792 7.19009 54.5899 7.5271C54.7006 7.86411 54.756 8.24124 54.756 8.65849ZM59.879 9.4288C59.866 9.55397 59.8408 9.69038 59.8033 9.83802C59.7659 9.98567 59.7114 10.1325 59.6397 10.2785C59.5681 10.4246 59.4761 10.565 59.3638 10.6998C59.2515 10.8346 59.1147 10.9542 58.9535 11.0585C58.7924 11.1628 58.6027 11.2462 58.3846 11.3088C58.1664 11.3714 57.9174 11.4027 57.6373 11.4027C57.4843 11.4027 57.3232 11.3843 57.1538 11.3473C56.9845 11.3104 56.8193 11.2487 56.6581 11.162C56.497 11.0753 56.3439 10.9638 56.1991 10.8274C56.0542 10.691 55.9272 10.5217 55.8181 10.3195C55.709 10.1173 55.6219 9.88216 55.5568 9.61415C55.4917 9.34615 55.4592 9.03883 55.4592 8.69219C55.4592 8.26531 55.521 7.88096 55.6447 7.53914C55.7685 7.19731 55.9337 6.90765 56.1404 6.67013C56.3472 6.43262 56.5881 6.24967 56.8633 6.12129C57.1384 5.9929 57.4273 5.92871 57.7301 5.92871C58.0036 5.92871 58.2454 5.9576 58.4554 6.01537C58.6654 6.07314 58.8485 6.15017 59.0048 6.24646C59.1611 6.34275 59.293 6.45429 59.4004 6.58107C59.5079 6.70785 59.595 6.84104 59.6617 6.98066C59.7284 7.12028 59.7789 7.26231 59.8131 7.40674C59.8473 7.55117 59.8693 7.68919 59.879 7.82078H59.039C58.9934 7.47093 58.8705 7.19651 58.6703 6.99751C58.47 6.79852 58.1892 6.69902 57.8278 6.69902C57.5804 6.69902 57.3647 6.74877 57.1807 6.84827C56.9967 6.94776 56.8437 7.08658 56.7216 7.26471C56.5995 7.44285 56.5084 7.65789 56.4481 7.90985C56.3879 8.1618 56.3578 8.43863 56.3578 8.74034C56.3578 9.08056 56.3903 9.37343 56.4555 9.61897C56.5206 9.8645 56.6134 10.0667 56.7338 10.2256C56.8543 10.3845 57.0016 10.5016 57.1758 10.577C57.35 10.6525 57.5478 10.6902 57.7692 10.6902C57.9255 10.6902 58.0736 10.6621 58.2136 10.6059C58.3536 10.5498 58.479 10.4679 58.5897 10.3604C58.7004 10.2529 58.7948 10.1205 58.873 9.9632C58.9511 9.80593 59.0064 9.6278 59.039 9.4288H59.879ZM62.1598 6.8582H60.3577V6.08789H64.8606V6.8582H63.0584V11.2441H62.1598V6.8582ZM65.222 6.08789H66.2086L67.6004 10.2861H67.62L69.0119 6.08789H69.9984L68.0009 11.4512C67.9 11.7208 67.8072 11.9551 67.7225 12.1541C67.6379 12.3531 67.5549 12.5224 67.4735 12.662C67.3921 12.8016 67.3099 12.9147 67.2268 13.0014C67.1438 13.0881 67.0526 13.1563 66.9533 13.206C66.854 13.2558 66.7433 13.2895 66.6212 13.3071C66.4991 13.3248 66.3583 13.3336 66.1988 13.3336C66.0685 13.3336 65.9668 13.328 65.8935 13.3168C65.8203 13.3055 65.756 13.2919 65.7006 13.2758V12.4766C65.7592 12.4959 65.8358 12.5151 65.9302 12.5344C66.0246 12.5537 66.1239 12.5633 66.2281 12.5633C66.3941 12.5633 66.5284 12.524 66.631 12.4453C66.7336 12.3667 66.8125 12.2552 66.8679 12.1107L67.1609 11.3838L65.222 6.08789ZM74.1106 6.8582H71.6687V11.2441H70.7701V6.08789H75.0141V11.2441H74.1106V6.8582ZM76.3328 6.08789H77.2314V8.16772H79.6733V6.08789H80.5768V11.2441H79.6733V8.93803H77.2314V11.2441H76.3328V6.08789ZM85.5486 8.65869C85.5486 8.37303 85.516 8.11065 85.4509 7.87153C85.3858 7.63241 85.2881 7.4262 85.1578 7.25288C85.0276 7.07956 84.8673 6.94395 84.6768 6.84606C84.4863 6.74817 84.2657 6.69922 84.015 6.69922C83.7643 6.69922 83.5446 6.74817 83.3557 6.84606C83.1669 6.94395 83.0073 7.07956 82.8771 7.25288C82.7469 7.4262 82.6492 7.63241 82.5841 7.87153C82.5189 8.11065 82.4864 8.37303 82.4864 8.65869C82.4864 8.94756 82.5189 9.21315 82.5841 9.45548C82.6492 9.69781 82.7469 9.90563 82.8771 10.0789C83.0073 10.2523 83.1669 10.3879 83.3557 10.4858C83.5446 10.5837 83.7643 10.6326 84.015 10.6326C84.2657 10.6326 84.4863 10.5837 84.6768 10.4858C84.8673 10.3879 85.0276 10.2523 85.1578 10.0789C85.2881 9.90563 85.3858 9.69781 85.4509 9.45548C85.516 9.21315 85.5486 8.94756 85.5486 8.65869ZM86.4472 8.65849C86.4472 9.08216 86.3918 9.4633 86.2811 9.80192C86.1704 10.1405 86.0109 10.4286 85.8025 10.6661C85.5941 10.9036 85.3393 11.0858 85.0382 11.2125C84.737 11.3393 84.3959 11.4027 84.015 11.4027C83.6341 11.4027 83.2938 11.3393 82.9943 11.2125C82.6947 11.0858 82.4408 10.9036 82.2324 10.6661C82.024 10.4286 81.8645 10.1405 81.7538 9.80192C81.6431 9.4633 81.5877 9.08216 81.5877 8.65849C81.5877 8.24124 81.6431 7.86411 81.7538 7.5271C81.8645 7.19009 82.024 6.90283 82.2324 6.66532C82.4408 6.42781 82.6947 6.24566 82.9943 6.11888C83.2938 5.9921 83.6341 5.92871 84.015 5.92871C84.3959 5.92871 84.737 5.9921 85.0382 6.11888C85.3393 6.24566 85.5941 6.42781 85.8025 6.66532C86.0109 6.90283 86.1704 7.19009 86.2811 7.5271C86.3918 7.86411 86.4472 8.24124 86.4472 8.65849ZM90.237 6.08789H92.4641C93.1022 6.08789 93.58 6.20504 93.8975 6.43934C94.2149 6.67365 94.3736 7.01386 94.3736 7.46C94.3736 7.69751 94.315 7.89811 94.1978 8.06181C94.0806 8.2255 93.926 8.36993 93.7339 8.4951C94.0106 8.59781 94.2304 8.74545 94.3932 8.93803C94.556 9.13061 94.6374 9.37935 94.6374 9.68427C94.6374 9.92499 94.5967 10.1416 94.5153 10.3342C94.4339 10.5268 94.3102 10.6905 94.1441 10.8253C93.9781 10.9601 93.7672 11.0636 93.5116 11.1358C93.2561 11.208 92.9541 11.2441 92.6057 11.2441H90.237V6.08789ZM91.1357 10.5366H92.5032C92.7408 10.5366 92.9386 10.5181 93.0965 10.4812C93.2545 10.4443 93.3806 10.3906 93.475 10.3199C93.5695 10.2493 93.6362 10.1643 93.6753 10.0648C93.7143 9.96528 93.7339 9.85294 93.7339 9.72777C93.7339 9.60259 93.7143 9.48946 93.6753 9.38835C93.6362 9.28725 93.5695 9.20219 93.475 9.13319C93.3806 9.06418 93.2545 9.01122 93.0965 8.97431C92.9386 8.9374 92.7408 8.91895 92.5032 8.91895H91.1357V10.5366ZM91.1357 8.26862H92.4934C92.7962 8.26862 93.0355 8.20925 93.2113 8.09049C93.3871 7.97173 93.475 7.78718 93.475 7.53683C93.475 7.39561 93.4506 7.27766 93.4018 7.18297C93.3529 7.08829 93.2878 7.01206 93.2064 6.95429C93.125 6.89651 93.0331 6.85559 92.9305 6.83152C92.8279 6.80745 92.7229 6.79541 92.6155 6.79541H91.1357V8.26862Z" fill="white"/>
</svg>
