<svg width="86" height="86" viewBox="0 0 86 86" fill="none" xmlns="http://www.w3.org/2000/svg">
<path d="M56.8707 36.3645C56.8707 38.239 55.3511 39.7586 53.4766 39.7586C51.6021 39.7586 50.0825 38.239 50.0825 36.3645C50.0825 34.49 51.6021 32.9705 53.4766 32.9705C55.3511 32.9705 56.8707 34.49 56.8707 36.3645Z"/>
<path d="M16.1417 44.284C16.1417 46.1585 14.6221 47.678 12.7476 47.678C10.8731 47.678 9.35352 46.1585 9.35352 44.284C9.35352 42.4095 10.8731 40.8899 12.7476 40.8899C14.6221 40.8899 16.1417 42.4095 16.1417 44.284Z"/>
<path d="M77.2354 19.3941C77.2354 21.2686 75.7158 22.7882 73.8413 22.7882C71.9668 22.7882 70.4473 21.2686 70.4473 19.3941C70.4473 17.5196 71.9668 16 73.8413 16C75.7158 16 77.2354 17.5196 77.2354 19.3941Z" fill="#B79985"/>
<path d="M29.6836 28.445C29.6809 29.0644 29.8524 29.6721 30.1786 30.1986C30.6058 30.9013 31.2732 31.4254 32.0572 31.6739C32.8412 31.9223 33.6886 31.8783 34.4426 31.55C35.1966 31.2217 35.8062 30.6312 36.1583 29.8881C36.5105 29.1449 36.5814 28.2992 36.358 27.5078C36.1346 26.7163 35.632 26.0326 34.9432 25.5832C34.2545 25.1338 33.4262 24.9492 32.6118 25.0636C31.7974 25.1779 31.052 25.5835 30.5136 26.2052C29.9753 26.8269 29.6804 27.6226 29.6836 28.445Z" fill="#B79985"/>
<path d="M80.0636 70.305V33.8305C80.0636 33.2304 79.8252 32.6549 79.4009 32.2305H68.2814C67.857 32.6549 67.6187 33.2304 67.6187 33.8305V70.305H80.0636Z" fill="#B79985"/>
<path d="M68.1184 32.3506C67.6507 32.8183 67.3871 33.4521 67.3853 34.1135V70.2981L69.0823 70.3476L69.3368 36.2843C69.3379 35.884 69.4804 35.497 69.7392 35.1917C69.998 34.8863 70.3564 34.6823 70.751 34.6155L79.9433 33.8236C79.9548 33.5362 79.9078 33.2494 79.805 32.9807C79.7023 32.7121 79.5459 32.4671 79.3455 32.2607L68.1184 32.3506Z" fill="#C0A999"/>
<path d="M39.3346 42.0211V70.3051H26.8896V42.0211C26.8896 41.724 26.9482 41.4297 27.0619 41.1552C27.1756 40.8807 27.3423 40.6313 27.5524 40.4211H38.6719C39.0962 40.8455 39.3346 41.421 39.3346 42.0211Z" fill="#C0A999"/>
<path d="M26.6426 41.993C26.7001 41.376 26.9929 40.8048 27.4603 40.398L38.6054 40.4903C39.0096 40.9064 39.238 41.4623 39.2431 42.0425L30.0508 43.2445C29.6019 43.2464 29.1721 43.426 28.8554 43.7441C28.5386 44.0621 28.3608 44.4927 28.3608 44.9416V70.3547H26.6426V41.993Z" fill="#B79985"/>
<path fill-rule="evenodd" clip-rule="evenodd" d="M73.8413 15.25C71.5526 15.25 69.6973 17.1054 69.6973 19.3941C69.6973 20.1586 69.9043 20.8747 70.2653 21.4895L56.5093 33.5403C55.7527 32.7283 54.674 32.2205 53.4766 32.2205C51.9589 32.2205 50.6318 33.0363 49.9099 34.2533L37.2189 29.0579C37.2469 28.854 37.2598 28.6473 37.2571 28.4396C37.2557 27.3377 36.8174 26.2814 36.0382 25.5022C35.2577 24.7217 34.1991 24.2832 33.0954 24.2832C31.9916 24.2832 30.9331 24.7217 30.1526 25.5022C29.3725 26.2822 28.9341 27.3401 28.9336 28.4433C28.9315 28.9828 29.037 29.5151 29.2418 30.0096L15.5097 41.1945C14.7766 40.5387 13.8087 40.1399 12.7476 40.1399C10.4589 40.1399 8.60352 41.9953 8.60352 44.284C8.60352 46.5727 10.4589 48.428 12.7476 48.428C15.0363 48.428 16.8917 46.5727 16.8917 44.284C16.8917 43.5975 16.7248 42.9501 16.4294 42.38L30.0507 31.2853C30.4637 31.7384 30.9746 32.0969 31.549 32.3311C32.3976 32.6771 33.3369 32.732 34.22 32.4873C35.1031 32.2426 35.8802 31.712 36.4298 30.9787C36.5477 30.8213 36.6537 30.6565 36.7473 30.4857L49.3918 35.662C49.3528 35.8904 49.3325 36.1251 49.3325 36.3645C49.3325 38.6532 51.1879 40.5086 53.4766 40.5086C55.7653 40.5086 57.6207 38.6532 57.6207 36.3645C57.6207 35.819 57.5152 35.2981 57.3237 34.821L71.2457 22.6248C71.956 23.1962 72.8588 23.5382 73.8413 23.5382C76.1301 23.5382 77.9854 21.6828 77.9854 19.3941C77.9854 17.1054 76.1301 15.25 73.8413 15.25ZM71.1973 19.3941C71.1973 17.9338 72.3811 16.75 73.8413 16.75C75.3016 16.75 76.4854 17.9338 76.4854 19.3941C76.4854 20.8544 75.3016 22.0382 73.8413 22.0382C72.3811 22.0382 71.1973 20.8544 71.1973 19.3941ZM33.0954 25.7832C32.3894 25.7832 31.7124 26.0636 31.2132 26.5628C30.7141 27.062 30.4336 27.739 30.4336 28.445V28.4483C30.4315 28.927 30.5641 29.3966 30.8162 29.8036L30.8218 29.8126L30.8271 29.8218C31.1208 30.3274 31.5738 30.7214 32.1152 30.9421C32.6567 31.1628 33.256 31.1979 33.8195 31.0417C34.3829 30.8856 34.8787 30.5471 35.2294 30.0792C35.58 29.6113 35.7656 29.0404 35.7572 28.4557L35.7571 28.445C35.7571 27.739 35.4767 27.062 34.9775 26.5628C34.4783 26.0636 33.8013 25.7832 33.0954 25.7832ZM53.4766 33.7205C52.0163 33.7205 50.8325 34.9043 50.8325 36.3645C50.8325 37.8248 52.0163 39.0086 53.4766 39.0086C54.9369 39.0086 56.1207 37.8248 56.1207 36.3645C56.1207 34.9043 54.9369 33.7205 53.4766 33.7205ZM10.1035 44.284C10.1035 42.8237 11.2873 41.6399 12.7476 41.6399C14.2079 41.6399 15.3917 42.8237 15.3917 44.284C15.3917 45.7442 14.2079 46.928 12.7476 46.928C11.2873 46.928 10.1035 45.7442 10.1035 44.284Z" fill="#616B7B"/>
<path fill-rule="evenodd" clip-rule="evenodd" d="M46.5044 69.5549V50.0806C46.5044 49.1141 47.2879 48.3306 48.2544 48.3306H58.6993C59.6658 48.3306 60.4493 49.1141 60.4493 50.0806V69.5549H66.8687V33.1101C66.8687 32.1436 67.6522 31.3601 68.6187 31.3601H79.0636C80.0301 31.3601 80.8136 32.1436 80.8136 33.1101V69.5549H83.9999V71.0549H2V69.5549H5.77539V58C5.77539 57.0335 6.55889 56.25 7.52539 56.25H17.9703C18.9368 56.25 19.7203 57.0335 19.7203 58V69.5549H26.1396V41.3005C26.1396 40.334 26.9232 39.5505 27.8896 39.5505H38.3346C39.3011 39.5505 40.0846 40.334 40.0846 41.3005V69.5549H46.5044ZM48.0044 50.0806C48.0044 49.9425 48.1163 49.8306 48.2544 49.8306H58.6993C58.8374 49.8306 58.9493 49.9425 58.9493 50.0806V69.5549H48.0044V50.0806ZM38.5846 69.5549V41.3005C38.5846 41.1625 38.4727 41.0505 38.3346 41.0505H27.8896C27.7516 41.0505 27.6396 41.1625 27.6396 41.3005V69.5549H38.5846ZM18.2203 69.5549V58C18.2203 57.8619 18.1084 57.75 17.9703 57.75H7.52539C7.38732 57.75 7.27539 57.8619 7.27539 58V69.5549H18.2203ZM79.3136 69.5549V33.1101C79.3136 32.972 79.2017 32.8601 79.0636 32.8601H68.6187C68.4806 32.8601 68.3687 32.972 68.3687 33.1101V69.5549H79.3136Z" fill="#616B7B"/>
</svg>
