<svg width="45" height="20" viewBox="0 0 45 20" fill="none" xmlns="http://www.w3.org/2000/svg">
<path fill-rule="evenodd" clip-rule="evenodd" d="M10.3777 19.1489L9.55575 20L0.000350078 10L9.55576 -3.09863e-06L10.3777 0.851061L1.95307 9.47365L45 9.47365L45 10.5263L1.953 10.5263L10.3777 19.1489Z" fill="#FFFFFF"/>
</svg>
