<svg width="85" height="84" viewBox="0 0 85 84" fill="none" xmlns="http://www.w3.org/2000/svg">
<path d="M73.8379 73.8696C74.0084 73.7063 74.1772 73.5412 74.3442 73.3744C78.4765 69.2452 81.5173 64.0221 82.9958 58.176C76.4074 50.5768 75.9013 45.5107 82.0677 38.9247C79.7755 32.5454 75.5715 27.079 70.1475 23.2176C69.8308 22.9922 69.51 22.7723 69.1852 22.5579C62.7408 23.7264 59.1976 26.9008 59.1976 30.819C59.1976 35.3785 61.7285 40.4446 67.2964 43.9909C73.1117 47.6948 70.8942 51.4983 67.4224 57.4532L67.2964 57.6694C63.7585 63.7396 65.2671 71.3251 73.8379 73.8696Z" fill="#B79985"/>
<path d="M10.6051 23.2198L12.7637 20.9456L7.56788 20.1801L4.02469 23.7263L8.86431 26.4686C9.01712 25.3999 9.55621 24.2696 10.6051 23.2198Z" fill="#B79985"/>
<path d="M18.4827 27.1888L15.6669 29.8057C14.7636 30.6093 13.8404 31.0146 12.9762 31.1123L15.7044 35.9354L19.2476 32.3891L18.4827 27.1888Z" fill="#B79985"/>
<path d="M36.926 10.048C42.4937 4.98171 34.395 -2.61746 29.8397 2.95531L26.7141 6.24825C32.3703 0.422146 38.9505 8.02132 33.5401 13.1948L36.926 10.048Z" fill="#B79985"/>
<path d="M35.9137 68.8149C34.0308 63.1845 31.5826 63.3683 24.4028 69.3215C27.8338 74.0793 32.5033 77.8832 37.9384 80.26C41.9878 79.9603 47.0495 74.8942 42.4939 73.3744C40.1691 72.5987 36.703 71.175 35.9137 68.8149Z" fill="#B79985"/>
<path d="M82.0677 38.9247L82.7735 38.6711L82.0677 38.9247ZM67.2964 43.9909L67.6993 43.3583L67.2964 43.9909ZM67.2964 57.6694L66.6484 57.2917L67.2964 57.6694ZM37.4322 20.107L37.1201 19.425L37.4322 20.107ZM57.6791 17.7992L57.8284 17.0642L57.6791 17.7992ZM30.3458 50.0702L30.9405 50.5272L30.3458 50.0702ZM29.3335 54.6297L28.8029 55.1598L29.3335 54.6297ZM22.1734 65.7752L21.5144 66.1331L22.1734 65.7752ZM35.9137 68.8149L35.2024 69.0527L35.9137 68.8149ZM42.4939 73.3744L42.7313 72.6629L42.4939 73.3744ZM26.1728 28.5756L25.5591 29.0066L25.5671 29.018L25.5755 29.0291L26.1728 28.5756ZM32.8767 37.4049L32.2793 37.8584L32.7994 38.5434L33.4072 37.935L32.8767 37.4049ZM36.926 33.352L37.4566 33.8821L37.8026 33.5358L37.6248 33.0797L36.926 33.352ZM32.7794 22.7132L33.4782 22.4408L33.4756 22.4341L33.4728 22.4275L32.7794 22.7132ZM36.926 10.048L36.4213 9.49324L36.4155 9.49862L36.926 10.048ZM29.8397 2.95531L30.3836 3.47163L30.4028 3.45148L30.4203 3.42997L29.8397 2.95531ZM10.6051 23.2198L11.1357 23.7499L11.1425 23.7431L11.1491 23.7361L10.6051 23.2198ZM15.6669 29.8057L16.1654 30.3661L16.1714 30.3607L16.1774 30.3551L15.6669 29.8057ZM16.1728 17.354L16.7168 17.8703L16.1728 17.354ZM2 6.50153L1.50149 5.94119L0.822949 6.54486L1.54403 7.09701L2 6.50153ZM6.55554 2.44864L6.84385 1.75627L6.40897 1.57518L6.05703 1.8883L6.55554 2.44864ZM7.56788 20.1801L7.67721 19.4381L7.30398 19.3831L7.03732 19.65L7.56788 20.1801ZM4.02469 23.7263L3.49412 23.1962L2.79779 23.8932L3.65495 24.3789L4.02469 23.7263ZM8.86431 26.4686L9.60675 26.5748L8.86431 26.4686ZM19.2476 32.3891L19.7781 32.9192L20.0444 32.6527L19.9896 32.28L19.2476 32.3891ZM15.7044 35.9354L15.0516 36.3047L15.5374 37.1636L16.2349 36.4655L15.7044 35.9354ZM12.9762 31.1123L12.8919 30.3671L12.9762 31.1123ZM6.65921 31.859C6.36645 32.1521 6.36666 32.6269 6.65968 32.9197C6.9527 33.2125 7.42757 33.2123 7.72034 32.9192L6.65921 31.859ZM23.3932 33.7331C23.6036 33.3763 23.485 32.9165 23.1283 32.706C22.7715 32.4956 22.3117 32.6142 22.1012 32.9709L23.3932 33.7331ZM36.0844 19.9207C35.7138 20.1058 35.5636 20.5563 35.7488 20.9268C35.934 21.2973 36.3844 21.4476 36.755 21.2624L36.0844 19.9207ZM67.4224 57.4532L66.7745 57.0754L67.4224 57.4532ZM70.1475 23.2176L70.5824 22.6066L70.1475 23.2176ZM74.3442 73.3744L73.814 72.8438L74.3442 73.3744ZM81.3619 39.1784C82.5838 42.579 83.25 46.2459 83.25 50.0702H84.75C84.75 46.0706 84.0531 42.2322 82.7735 38.6711L81.3619 39.1784ZM83.25 50.0702C83.25 52.8048 82.9094 55.4586 82.2687 57.9921L83.7229 58.3599C84.3937 55.7072 84.75 52.9298 84.75 50.0702H83.25ZM81.5202 38.4121C78.3738 41.7726 76.8033 44.8789 77 48.2146C77.1944 51.5113 79.1087 54.8374 82.4291 58.6673L83.5624 57.6847C80.2945 53.9154 78.6615 50.9088 78.4974 48.1262C78.3356 45.3826 79.5952 42.6628 82.6152 39.4373L81.5202 38.4121ZM69.0514 21.82C62.4944 23.0088 58.4476 26.3368 58.4476 30.819H59.9476C59.9476 27.4647 62.9872 24.444 69.319 23.2959L69.0514 21.82ZM58.4476 30.819C58.4476 35.6636 61.1348 40.9557 66.8934 44.6234L67.6993 43.3583C62.3221 39.9335 59.9476 35.0933 59.9476 30.819H58.4476ZM37.7443 20.7889C41.8107 18.928 46.3327 17.8904 51.0989 17.8904V16.3904C46.113 16.3904 41.3784 17.4762 37.1201 19.425L37.7443 20.7889ZM51.0989 17.8904C53.3019 17.8904 55.4525 18.1121 57.5298 18.5341L57.8284 17.0642C55.6534 16.6223 53.4028 16.3904 51.0989 16.3904V17.8904ZM57.5298 18.5341C61.6108 19.3633 65.4114 20.9663 68.7721 23.1839L69.5983 21.9319C66.0808 19.6109 62.1017 17.9324 57.8284 17.0642L57.5298 18.5341ZM36.9649 20.6936C40.6007 23.5903 44.0826 24.9151 47.6386 24.4934C51.1702 24.0747 54.6089 21.9512 58.211 18.3279L57.1472 17.2704C53.6487 20.7894 50.5072 22.6428 47.462 23.0039C44.4414 23.362 41.3502 22.2695 37.8996 19.5204L36.9649 20.6936ZM21.5252 36.6034C26.5651 38.1167 29.7464 39.9542 31.1084 42.0557C31.7689 43.0748 32.0116 44.1707 31.8195 45.3857C31.6241 46.6219 30.9704 48.0267 29.7512 49.6132L30.9405 50.5272C32.2521 48.8207 33.0536 47.1858 33.3011 45.6199C33.552 44.0327 33.2252 42.5638 32.3672 41.2399C30.6921 38.6552 27.0401 36.6931 21.9566 35.1667L21.5252 36.6034ZM29.7512 49.6132C29.0489 50.527 28.3767 51.4395 28.0914 52.3264C27.9416 52.7919 27.8849 53.2859 28.0018 53.7918C28.119 54.2989 28.3954 54.7519 28.8029 55.1598L29.864 54.0996C29.6115 53.8469 29.5047 53.6334 29.4633 53.4541C29.4215 53.2736 29.4308 53.0611 29.5193 52.7858C29.7107 52.1909 30.2048 51.4844 30.9405 50.5272L29.7512 49.6132ZM22.8325 65.4172C20.3553 60.8564 18.9477 55.6289 18.9477 50.0702H17.4477C17.4477 55.8851 18.9207 61.358 21.5144 66.1331L22.8325 65.4172ZM28.8029 55.1598C29.3561 55.7134 29.5051 56.3616 29.3416 57.1439C29.1691 57.9693 28.6458 58.9222 27.8504 59.9269C26.2664 61.9279 23.7927 63.9001 21.7808 65.1361L22.566 66.4142C24.6771 65.1172 27.302 63.0364 29.0265 60.8579C29.8854 59.7729 30.5688 58.6043 30.8099 57.4507C31.06 56.2541 30.8294 55.0658 29.864 54.0996L28.8029 55.1598ZM25.0111 68.8828C24.2145 67.7781 23.4862 66.6208 22.8325 65.4172L21.5144 66.1331C22.1986 67.3929 22.9608 68.6041 23.7945 69.7602L25.0111 68.8828ZM24.8815 69.8988C26.6671 68.4183 28.1326 67.3185 29.3534 66.581C30.5864 65.8361 31.4954 65.5074 32.1816 65.4734C32.8074 65.4425 33.3008 65.6527 33.7702 66.1801C34.2739 66.7462 34.7411 67.6733 35.2024 69.0527L36.625 68.577C36.1448 67.1412 35.6 65.9799 34.8907 65.1829C34.1471 64.3473 33.2267 63.9199 32.1075 63.9752C31.0488 64.0276 29.8819 64.5092 28.5777 65.2971C27.2613 66.0924 25.7284 67.2481 23.9241 68.7441L24.8815 69.8988ZM35.2024 69.0527C35.6837 70.4918 36.9399 71.5564 38.2442 72.3332C39.5694 73.1225 41.0774 73.6924 42.2566 74.0858L42.7313 72.6629C41.5857 72.2807 40.1981 71.751 39.0117 71.0444C37.8045 70.3254 36.933 69.4981 36.625 68.577L35.2024 69.0527ZM51.0989 82.25C46.525 82.25 42.1761 81.2945 38.2389 79.5728L37.6379 80.9471C41.761 82.7502 46.3143 83.75 51.0989 83.75V82.25ZM38.2389 79.5728C32.9283 77.2505 28.3646 73.533 25.0111 68.8828L23.7945 69.7602C27.3031 74.6256 32.0784 78.516 37.6379 80.9471L38.2389 79.5728ZM42.2566 74.0858C43.2428 74.4149 43.4854 74.8483 43.5316 75.1593C43.5891 75.5475 43.4076 76.1224 42.8587 76.8046C41.77 78.1575 39.6753 79.3794 37.883 79.512L37.9937 81.0079C40.2508 80.8409 42.7117 79.3799 44.0273 77.7449C44.6806 76.9331 45.1634 75.9378 45.0153 74.9393C44.8558 73.8636 44.0228 73.0938 42.7313 72.6629L42.2566 74.0858ZM25.5755 29.0291L32.2793 37.8584L33.474 36.9514L26.7702 28.122L25.5755 29.0291ZM33.4072 37.935L37.4566 33.8821L36.3955 32.8219L32.3461 36.8748L33.4072 37.935ZM37.6248 33.0797L33.4782 22.4408L32.0806 22.9855L36.2273 33.6244L37.6248 33.0797ZM37.4308 10.6027C38.9699 9.20221 39.6138 7.57086 39.5578 5.99215C39.5025 4.43425 38.7689 3.00669 37.7005 1.97299C36.6327 0.939903 35.1883 0.259329 33.6561 0.250095C32.1009 0.240721 30.531 0.924531 29.259 2.48064L30.4203 3.42997C31.426 2.1997 32.5766 1.74362 33.6471 1.75007C34.7407 1.75666 35.8271 2.24763 36.6575 3.05102C37.4872 3.8538 38.019 4.92766 38.0587 6.04536C38.0976 7.14224 37.666 8.36064 36.4213 9.49327L37.4308 10.6027ZM33.4728 22.4275L30.8476 16.0559L29.4607 16.6274L32.0859 22.9989L33.4728 22.4275ZM16.1774 30.3551L23.057 23.9614L22.0359 22.8626L15.1563 29.2564L16.1774 30.3551ZM23.057 23.9614L30.6647 16.891L29.6436 15.7923L22.0359 22.8626L23.057 23.9614ZM26.7866 28.1445L23.1602 22.981L21.9327 23.8431L25.5591 29.0066L26.7866 28.1445ZM16.6288 16.7585L2.45597 5.90606L1.54403 7.09701L15.7168 17.9495L16.6288 16.7585ZM2.49851 7.06187L7.05406 3.00898L6.05703 1.8883L1.50149 5.94119L2.49851 7.06187ZM23.0445 9.02487L15.6288 16.8377L16.7168 17.8703L24.1325 10.0575L23.0445 9.02487ZM6.26724 3.14101L23.3002 10.2336L23.8768 8.84883L6.84385 1.75627L6.26724 3.14101ZM15.6288 16.8377L12.2197 20.4293L13.3077 21.4619L16.7168 17.8703L15.6288 16.8377ZM12.2197 20.4293L10.0612 22.7035L11.1491 23.7361L13.3077 21.4619L12.2197 20.4293ZM12.873 20.2036L7.67721 19.4381L7.45856 20.9221L12.6544 21.6876L12.873 20.2036ZM7.03732 19.65L3.49412 23.1962L4.55525 24.2564L8.09845 20.7102L7.03732 19.65ZM10.0746 22.6897C8.92366 23.8415 8.30002 25.1164 8.12186 26.3624L9.60675 26.5748C9.73422 25.6834 10.1888 24.6976 11.1357 23.7499L10.0746 22.6897ZM3.65495 24.3789L8.49457 27.1211L9.23405 25.8161L4.39443 23.0738L3.65495 24.3789ZM18.717 31.859L15.1738 35.4053L16.2349 36.4655L19.7781 32.9192L18.717 31.859ZM16.3572 35.5662L13.629 30.7431L12.3234 31.4816L15.0516 36.3047L16.3572 35.5662ZM13.0605 31.8576C14.1012 31.7399 15.1647 31.2563 16.1654 30.3661L15.1684 29.2454C14.3624 29.9623 13.5796 30.2893 12.8919 30.3671L13.0605 31.8576ZM17.7406 27.2979L18.5055 32.4983L19.9896 32.28L19.2247 27.0797L17.7406 27.2979ZM8.12186 26.3624C7.90847 27.8548 8.34147 29.2627 9.19495 30.2861L10.3469 29.3254C9.76721 28.6302 9.45312 27.6492 9.60675 26.5748L8.12186 26.3624ZM9.19495 30.2861C10.1076 31.3805 11.5041 32.0336 13.0605 31.8576L12.8919 30.3671C11.877 30.4819 10.9633 30.0645 10.3469 29.3254L9.19495 30.2861ZM9.24038 29.2756L6.65921 31.859L7.72034 32.9192L10.3015 30.3358L9.24038 29.2756ZM16.9839 21.5254L9.24038 29.2756L10.3015 30.3358L18.045 22.5856L16.9839 21.5254ZM29.2957 2.43898L26.1701 5.73193L27.258 6.76458L30.3836 3.47163L29.2957 2.43898ZM26.1701 5.73193L23.0445 9.02487L24.1325 10.0575L27.258 6.76458L26.1701 5.73193ZM30.6647 16.891L34.0507 13.7442L33.0295 12.6454L29.6436 15.7923L30.6647 16.891ZM34.0507 13.7442L37.4366 10.5974L36.4155 9.49862L33.0295 12.6454L34.0507 13.7442ZM27.2522 6.77068C28.5568 5.42685 29.8494 4.91953 30.9424 4.8981C32.0396 4.87658 33.022 5.34157 33.7256 6.10497C35.1152 7.6127 35.4413 10.3392 33.0218 12.6527L34.0584 13.7369C37.0493 10.8769 36.7905 7.2171 34.8286 5.0884C33.8564 4.03358 32.4713 3.36783 30.913 3.39839C29.3504 3.42903 27.6994 4.1566 26.176 5.72583L27.2522 6.77068ZM18.9477 50.0702C18.9477 44.105 20.5686 38.5211 23.3932 33.7331L22.1012 32.9709C19.1442 37.9836 17.4477 43.8298 17.4477 50.0702H18.9477ZM36.755 21.2624C37.0816 21.0991 37.4114 20.9413 37.7443 20.7889L37.1201 19.425C36.7716 19.5845 36.4263 19.7497 36.0844 19.9207L36.755 21.2624ZM66.8934 44.6234C68.2858 45.5103 69.1317 46.3625 69.6068 47.1922C70.0726 48.0058 70.2112 48.8487 70.0975 49.7877C69.9813 50.7471 69.6006 51.8101 69.0099 53.0319C68.4199 54.2523 67.6465 55.5797 66.7745 57.0754L68.0703 57.8309C68.9342 56.3492 69.7399 54.9681 70.3604 53.6848C70.9802 52.4029 71.4414 51.1669 71.5866 49.9681C71.7343 48.7489 71.554 47.5742 70.9085 46.4469C70.2722 45.3356 69.2146 44.3234 67.6993 43.3583L66.8934 44.6234ZM66.7744 57.0754L66.6484 57.2917L67.9443 58.0471L68.0703 57.8309L66.7744 57.0754ZM66.6484 57.2917C64.7915 60.4777 64.2277 64.1166 65.316 67.3321C66.4119 70.5702 69.1423 73.2579 73.6245 74.5885L74.0513 73.1506C69.9627 71.9368 67.6534 69.5595 66.7368 66.8512C65.8125 64.1202 66.2633 60.9313 67.9443 58.047L66.6484 57.2917ZM73.6245 74.5885C73.6377 74.5925 73.6512 74.5965 73.6648 74.6005L74.0884 73.1615C74.0761 73.1579 74.0638 73.1543 74.0513 73.1506L73.6245 74.5885ZM66.7745 57.0754C66.7326 57.1472 66.6906 57.2193 66.6484 57.2917L67.9443 58.047C67.9865 57.9747 68.0285 57.9026 68.0703 57.8309L66.7745 57.0754ZM73.3192 73.3278C67.5453 78.8556 59.7189 82.25 51.0989 82.25V83.75C60.1208 83.75 68.3148 80.1956 74.3566 74.4113L73.3192 73.3278ZM16.1774 30.3551L18.9932 27.7382L17.9721 26.6394L15.1563 29.2564L16.1774 30.3551ZM18.9932 27.7382L23.057 23.9614L22.0359 22.8626L17.9721 26.6394L18.9932 27.7382ZM68.7721 23.1839C69.0896 23.3934 69.4031 23.6083 69.7125 23.8286L70.5824 22.6066C70.2586 22.3761 69.9305 22.1511 69.5983 21.9319L68.7721 23.1839ZM69.7125 23.8286C75.0139 27.6027 79.1222 32.9453 81.3619 39.1784L82.7735 38.6711C80.4288 32.1456 76.1292 26.5553 70.5824 22.6066L69.7125 23.8286ZM74.3566 74.4113C74.5309 74.2444 74.7035 74.0755 74.8743 73.9049L73.814 72.8438C73.6508 73.0069 73.4859 73.1683 73.3192 73.3278L74.3566 74.4113ZM74.8743 73.9049C79.1 69.6825 82.2104 64.3404 83.7229 58.3599L82.2687 57.9921C80.8242 63.7037 77.8531 68.808 73.814 72.8438L74.8743 73.9049Z" fill="#616B7B"/>
</svg>
