<svg width="166" height="99" viewBox="0 0 166 99" fill="none" xmlns="http://www.w3.org/2000/svg">
<mask id="mask0" mask-type="alpha" maskUnits="userSpaceOnUse" x="96" y="83" width="60" height="14">
<rect x="96" y="83" width="60" height="14" rx="7" fill="#DAE1F5"/>
</mask>
<g mask="url(#mask0)">
<rect x="96" y="83" width="60" height="14" rx="7" fill="#D2D5D9"/>
<path d="M96 97C96 92.5817 99.5817 89 104 89H139C143.418 89 147 92.5817 147 97C147 100.866 143.866 104 140 104H103C99.134 104 96 100.866 96 97Z" fill="#E8EAEC"/>
<path d="M96 90C96 85.5817 99.5817 82 104 82H117C121.418 82 125 85.5817 125 90C125 93.866 121.866 97 118 97H103C99.134 97 96 93.866 96 90Z" fill="#E8EAEC"/>
</g>
<path d="M142 77.5C142 79.9122 141.193 82.1509 139.813 84C137.56 87.0195 133.782 89 129.5 89C122.596 89 117 83.8513 117 77.5C117 71.1487 122.596 66 129.5 66C136.404 66 142 71.1487 142 77.5Z" fill="#D2D5D9"/>
<path d="M142 84V77.5C142 79.9122 141.193 82.1509 139.813 84H142Z" fill="#D2D5D9"/>
<path d="M134 82C134 84.7255 132.91 87.1962 131.141 89C129.327 90.8514 126.797 92 124 92C118.477 92 114 87.5228 114 82C114 76.4772 118.477 72 124 72C129.523 72 134 76.4772 134 82Z" fill="#E8EAEC"/>
<path d="M134 82C134 84.7255 132.91 87.1962 131.141 89H134V82Z" fill="#E8EAEC"/>
<circle cx="115" cy="82" r="8" fill="#E8EAEC"/>
<mask id="mask1" mask-type="alpha" maskUnits="userSpaceOnUse" x="2" y="30" width="41" height="10">
<rect x="2" y="30.5161" width="41" height="9.48387" rx="4.74194" fill="#DAE1F5"/>
</mask>
<g mask="url(#mask1)">
<rect x="2" y="30.5161" width="41" height="9.48387" rx="4.74194" fill="#D2D5D9"/>
<path d="M2 39.9999C2 37.0069 4.42633 34.5806 7.41936 34.5806H31.4306C34.4237 34.5806 36.85 37.0069 36.85 39.9999C36.85 42.6188 34.727 44.7419 32.1081 44.7419H6.74194C4.12304 44.7419 2 42.6188 2 39.9999Z" fill="#E8EAEC"/>
<path d="M2 35.2582C2 32.2652 4.42633 29.8389 7.41936 29.8389H16.3973C19.3903 29.8389 21.8167 32.2652 21.8167 35.2582C21.8167 37.8771 19.6936 40.0002 17.0747 40.0002H6.74194C4.12304 40.0002 2 37.8771 2 35.2582Z" fill="#E8EAEC"/>
</g>
<path d="M33.4329 26.7903C33.4329 28.4244 32.8813 29.9409 31.9386 31.1935C30.3992 33.239 27.817 34.5806 24.8913 34.5806C20.1738 34.5806 16.3496 31.0928 16.3496 26.7903C16.3496 22.4878 20.1738 19 24.8913 19C29.6087 19 33.4329 22.4878 33.4329 26.7903Z" fill="#D2D5D9"/>
<path d="M33.4329 31.1935V26.7903C33.4329 28.4244 32.8813 29.9409 31.9386 31.1935H33.4329Z" fill="#D2D5D9"/>
<path d="M27.9665 29.8386C27.9665 31.6849 27.2214 33.3587 26.0131 34.5806C24.7729 35.8347 23.0447 36.6128 21.1331 36.6128C17.3592 36.6128 14.2998 33.5799 14.2998 29.8386C14.2998 26.0974 17.3592 23.0645 21.1331 23.0645C24.9071 23.0645 27.9665 26.0974 27.9665 29.8386Z" fill="#E8EAEC"/>
<path d="M27.9665 29.8386C27.9665 31.6849 27.2214 33.3587 26.0131 34.5806H27.9665V29.8386Z" fill="#E8EAEC"/>
<ellipse cx="14.9833" cy="29.8388" rx="5.46667" ry="5.41935" fill="#E8EAEC"/>
<mask id="mask2" mask-type="alpha" maskUnits="userSpaceOnUse" x="102" y="28" width="63" height="15">
<rect x="102" y="28.5483" width="62.1714" height="14.4516" rx="7.2258" fill="#DAE1F5"/>
</mask>
<g mask="url(#mask2)">
<rect x="102" y="28.5483" width="62.1714" height="14.4516" rx="7.2258" fill="#D2D5D9"/>
<path d="M102 43.0002C102 38.4394 105.697 34.7422 110.258 34.7422H146.588C151.148 34.7422 154.846 38.4394 154.846 43.0002C154.846 46.9909 151.611 50.2261 147.62 50.2261H109.226C105.235 50.2261 102 46.9909 102 43.0002Z" fill="#E8EAEC"/>
<path d="M102 35.7742C102 31.2134 105.697 27.5161 110.258 27.5161H123.791C128.352 27.5161 132.05 31.2134 132.05 35.7742C132.05 39.7649 128.814 43 124.824 43H109.226C105.235 43 102 39.7649 102 35.7742Z" fill="#E8EAEC"/>
</g>
<path d="M149.665 22.871C149.665 25.361 148.828 27.6719 147.399 29.5806C145.064 32.6976 141.149 34.7419 136.712 34.7419C129.559 34.7419 123.76 29.4271 123.76 22.871C123.76 16.3148 129.559 11 136.712 11C143.866 11 149.665 16.3148 149.665 22.871Z" fill="#D2D5D9"/>
<path d="M149.665 29.5806V22.871C149.665 25.361 148.828 27.6719 147.399 29.5806H149.665Z" fill="#D2D5D9"/>
<path d="M141.375 27.5159C141.375 30.3293 140.245 32.8798 138.413 34.7417C136.533 36.6528 133.912 37.8385 131.013 37.8385C125.291 37.8385 120.651 33.2169 120.651 27.5159C120.651 21.8149 125.291 17.1934 131.013 17.1934C136.736 17.1934 141.375 21.8149 141.375 27.5159Z" fill="#E8EAEC"/>
<path d="M141.375 27.5159C141.375 30.3293 140.245 32.8798 138.413 34.7417H141.375V27.5159Z" fill="#E8EAEC"/>
<ellipse cx="121.688" cy="27.5159" rx="8.28952" ry="8.25806" fill="#E8EAEC"/>
<mask id="mask3" mask-type="alpha" maskUnits="userSpaceOnUse" x="70" y="23" width="44" height="11">
<rect x="70" y="23.4194" width="44" height="10.2277" rx="5.11385" fill="#DAE1F5"/>
</mask>
<g mask="url(#mask3)">
<rect x="70" y="23.4194" width="44" height="10.2277" rx="5.11385" fill="#DAE1F5"/>
<path d="M70 33.6471C70 30.4194 72.6166 27.8027 75.8444 27.8027H101.556C104.783 27.8027 107.4 30.4194 107.4 33.6471C107.4 36.4714 105.11 38.761 102.286 38.761H75.1138C72.2895 38.761 70 36.4714 70 33.6471Z" fill="#F0F2FB"/>
<path d="M70 28.5334C70 25.3056 72.6166 22.689 75.8444 22.689H85.4223C88.65 22.689 91.2667 25.3056 91.2667 28.5334C91.2667 31.3577 88.9771 33.6472 86.1528 33.6472H75.1139C72.2896 33.6472 70 31.3577 70 28.5334Z" fill="#E8EAEC"/>
</g>
<path d="M103.734 19.4013C103.734 21.1636 103.142 22.7991 102.13 24.1499C100.478 26.3558 97.7069 27.8027 94.5671 27.8027C89.5044 27.8027 85.4004 24.0413 85.4004 19.4013C85.4004 14.7614 89.5044 11 94.5671 11C99.6297 11 103.734 14.7614 103.734 19.4013Z" fill="#D2D5D9"/>
<path d="M103.734 24.1499V19.4013C103.734 21.1636 103.142 22.7991 102.13 24.1499H103.734Z" fill="#D2D5D9"/>
<path d="M97.8669 22.6888C97.8669 24.6799 97.0673 26.4849 95.7706 27.8027C94.4396 29.1552 92.585 29.9943 90.5335 29.9943C86.4834 29.9943 83.2002 26.7235 83.2002 22.6888C83.2002 18.6541 86.4834 15.3833 90.5335 15.3833C94.5836 15.3833 97.8669 18.6541 97.8669 22.6888Z" fill="#E8EAEC"/>
<path d="M97.8669 22.6888C97.8669 24.6799 97.0673 26.4849 95.7706 27.8027H97.8669V22.6888Z" fill="#E8EAEC"/>
<ellipse cx="83.9331" cy="22.6886" rx="5.86667" ry="5.8444" fill="#E8EAEC"/>
<path fill-rule="evenodd" clip-rule="evenodd" d="M13 68L124 2.5L45.5 68H13ZM82 68H109.5L124 2.5L64.5 68H82Z" fill="#A78B7A"/>
<path d="M64.5 68L124 2.5L45.5 68L64.5 84.5V68Z" fill="#A78B7A"/>
<path d="M64.5 68V84.5L82 68H64.5Z" fill="#A78B7A"/>
<path fill-rule="evenodd" clip-rule="evenodd" d="M13 68L124 2.5L45.5 68H13ZM82 68H109.5L124 2.5L64.5 68H82Z" fill="#B79985"/>
<path d="M64.5 68L124 2.5L45.5 68L64.5 84.5V68Z" fill="#B79985"/>
<path fill-rule="evenodd" clip-rule="evenodd" d="M13 68L124 2.5L45.5 68H13ZM82 68H109.5L124 2.5L64.5 68H82Z" fill="#C0A999"/>
</svg>
