<svg width="126" height="133" viewBox="0 0 126 133" fill="none" xmlns="http://www.w3.org/2000/svg">
<g clip-path="url(#clip0)">
<path fill-rule="evenodd" clip-rule="evenodd" d="M70.4382 -0.365232L70.4388 84.0584L53.8835 92.9725L37.9271 108L37.8863 97.1214L56.8404 60.1538L69.6866 0.0394536L70.4382 -0.365232Z" fill="#FFFFFF"/>
<g opacity="0.04" filter="url(#filter0_f)">
<path fill-rule="evenodd" clip-rule="evenodd" d="M88.4382 24.6347L88.4388 109.058L71.8835 117.972L55.9271 133L55.8863 122.121L74.8404 85.1538L87.6866 25.0394L88.4382 24.6347Z" fill="#FFFFFF"/>
</g>
</g>
<defs>
<filter id="filter0_f" x="54.8862" y="23.6347" width="34.5525" height="110.365" filterUnits="userSpaceOnUse" color-interpolation-filters="sRGB">
<feFlood flood-opacity="0" result="BackgroundImageFix"/>
<feBlend mode="normal" in="SourceGraphic" in2="BackgroundImageFix" result="shape"/>
<feGaussianBlur stdDeviation="0.5" result="effect1_foregroundBlur"/>
</filter>
<clipPath id="clip0">
<rect width="133" height="126" fill="white" transform="translate(0 133) rotate(-90)"/>
</clipPath>
</defs>
</svg>
