<svg width="166" height="99" viewBox="0 0 166 99" fill="none" xmlns="http://www.w3.org/2000/svg">
<mask id="mask0" mask-type="alpha" maskUnits="userSpaceOnUse" x="96" y="80" width="60" height="15">
<rect x="96" y="80.5" width="60" height="14" rx="7" fill="#DAE1F5"/>
</mask>
<g mask="url(#mask0)">
<rect x="96" y="80.5" width="60" height="14" rx="7" fill="white"/>
<path d="M96 94.5C96 90.0817 99.5817 86.5 104 86.5H139C143.418 86.5 147 90.0817 147 94.5C147 98.366 143.866 101.5 140 101.5H103C99.134 101.5 96 98.366 96 94.5Z" fill="#FFFFFF"/>
<path d="M96 87.5C96 83.0817 99.5817 79.5 104 79.5H117C121.418 79.5 125 83.0817 125 87.5C125 91.366 121.866 94.5 118 94.5H103C99.134 94.5 96 91.366 96 87.5Z" fill="#FFFFFF"/>
</g>
<path d="M142 75C142 77.4122 141.193 79.6509 139.813 81.5C137.56 84.5195 133.782 86.5 129.5 86.5C122.596 86.5 117 81.3513 117 75C117 68.6487 122.596 63.5 129.5 63.5C136.404 63.5 142 68.6487 142 75Z" fill="white"/>
<path d="M142 81.5V75C142 77.4122 141.193 79.6509 139.813 81.5H142Z" fill="white"/>
<path d="M134 79.5C134 82.2255 132.91 84.6962 131.141 86.5C129.327 88.3514 126.797 89.5 124 89.5C118.477 89.5 114 85.0228 114 79.5C114 73.9772 118.477 69.5 124 69.5C129.523 69.5 134 73.9772 134 79.5Z" fill="#FFFFFF"/>
<path d="M134 79.5C134 82.2255 132.91 84.6962 131.141 86.5H134V79.5Z" fill="#FFFFFF"/>
<circle cx="115" cy="79.5" r="8" fill="#FFFFFF"/>
<mask id="mask1" mask-type="alpha" maskUnits="userSpaceOnUse" x="2" y="28" width="41" height="10">
<rect x="2" y="28.0161" width="41" height="9.48387" rx="4.74194" fill="#DAE1F5"/>
</mask>
<g mask="url(#mask1)">
<rect x="2" y="28.0161" width="41" height="9.48387" rx="4.74194" fill="white"/>
<path d="M2 37.4999C2 34.5069 4.42633 32.0806 7.41936 32.0806H31.4306C34.4237 32.0806 36.85 34.5069 36.85 37.4999C36.85 40.1188 34.727 42.2419 32.1081 42.2419H6.74194C4.12304 42.2419 2 40.1188 2 37.4999Z" fill="#FFFFFF"/>
<path d="M2 32.7582C2 29.7652 4.42633 27.3389 7.41936 27.3389H16.3973C19.3903 27.3389 21.8167 29.7652 21.8167 32.7582C21.8167 35.3771 19.6936 37.5002 17.0747 37.5002H6.74194C4.12304 37.5002 2 35.3771 2 32.7582Z" fill="#FFFFFF"/>
</g>
<path d="M33.4334 24.2903C33.4334 25.9244 32.8818 27.4409 31.9391 28.6935C30.3997 30.739 27.8175 32.0806 24.8918 32.0806C20.1743 32.0806 16.3501 28.5928 16.3501 24.2903C16.3501 19.9878 20.1743 16.5 24.8918 16.5C29.6092 16.5 33.4334 19.9878 33.4334 24.2903Z" fill="white"/>
<path d="M33.4334 28.6935V24.2903C33.4334 25.9244 32.8818 27.4409 31.9391 28.6935H33.4334Z" fill="white"/>
<path d="M27.9665 27.3386C27.9665 29.1849 27.2214 30.8587 26.0131 32.0806C24.7729 33.3347 23.0447 34.1128 21.1331 34.1128C17.3592 34.1128 14.2998 31.0799 14.2998 27.3386C14.2998 23.5974 17.3592 20.5645 21.1331 20.5645C24.9071 20.5645 27.9665 23.5974 27.9665 27.3386Z" fill="#FFFFFF"/>
<path d="M27.9665 27.3386C27.9665 29.1849 27.2214 30.8587 26.0131 32.0806H27.9665V27.3386Z" fill="#FFFFFF"/>
<ellipse cx="14.9833" cy="27.3388" rx="5.46667" ry="5.41935" fill="#FFFFFF"/>
<mask id="mask2" mask-type="alpha" maskUnits="userSpaceOnUse" x="102" y="26" width="63" height="15">
<rect x="102" y="26.0483" width="62.1714" height="14.4516" rx="7.2258" fill="#DAE1F5"/>
</mask>
<g mask="url(#mask2)">
<rect x="102" y="26.0483" width="62.1714" height="14.4516" rx="7.2258" fill="white"/>
<path d="M102 40.5002C102 35.9394 105.697 32.2422 110.258 32.2422H146.588C151.148 32.2422 154.846 35.9394 154.846 40.5002C154.846 44.4909 151.611 47.7261 147.62 47.7261H109.226C105.235 47.7261 102 44.4909 102 40.5002Z" fill="#FFFFFF"/>
<path d="M102 33.2742C102 28.7134 105.697 25.0161 110.258 25.0161H123.791C128.352 25.0161 132.05 28.7134 132.05 33.2742C132.05 37.2649 128.814 40.5 124.824 40.5H109.226C105.235 40.5 102 37.2649 102 33.2742Z" fill="#FFFFFF"/>
</g>
<path d="M149.665 20.371C149.665 22.861 148.828 25.1719 147.399 27.0806C145.064 30.1976 141.149 32.2419 136.712 32.2419C129.559 32.2419 123.76 26.9271 123.76 20.371C123.76 13.8148 129.559 8.5 136.712 8.5C143.866 8.5 149.665 13.8148 149.665 20.371Z" fill="white"/>
<path d="M149.665 27.0806V20.371C149.665 22.861 148.828 25.1719 147.399 27.0806H149.665Z" fill="white"/>
<path d="M141.375 25.0159C141.375 27.8293 140.245 30.3798 138.413 32.2417C136.533 34.1528 133.912 35.3385 131.013 35.3385C125.291 35.3385 120.651 30.7169 120.651 25.0159C120.651 19.3149 125.291 14.6934 131.013 14.6934C136.736 14.6934 141.375 19.3149 141.375 25.0159Z" fill="#FFFFFF"/>
<path d="M141.375 25.0159C141.375 27.8293 140.245 30.3798 138.413 32.2417H141.375V25.0159Z" fill="#FFFFFF"/>
<ellipse cx="121.688" cy="25.0159" rx="8.28952" ry="8.25806" fill="#FFFFFF"/>
<mask id="mask3" mask-type="alpha" maskUnits="userSpaceOnUse" x="70" y="20" width="44" height="12">
<rect x="70" y="20.9194" width="44" height="10.2277" rx="5.11385" fill="#DAE1F5"/>
</mask>
<g mask="url(#mask3)">
<rect x="70" y="20.9194" width="44" height="10.2277" rx="5.11385" fill="#DAE1F5"/>
<path d="M70 31.1471C70 27.9194 72.6166 25.3027 75.8444 25.3027H101.556C104.783 25.3027 107.4 27.9194 107.4 31.1471C107.4 33.9714 105.11 36.261 102.286 36.261H75.1138C72.2895 36.261 70 33.9714 70 31.1471Z" fill="#F0F2FB"/>
<path d="M70 26.0334C70 22.8056 72.6166 20.189 75.8444 20.189H85.4223C88.65 20.189 91.2667 22.8056 91.2667 26.0334C91.2667 28.8577 88.9771 31.1472 86.1528 31.1472H75.1139C72.2896 31.1472 70 28.8577 70 26.0334Z" fill="#FFFFFF"/>
</g>
<path d="M103.733 16.9013C103.733 18.6636 103.141 20.2991 102.13 21.6499C100.478 23.8558 97.7064 25.3027 94.5666 25.3027C89.504 25.3027 85.3999 21.5413 85.3999 16.9013C85.3999 12.2614 89.504 8.5 94.5666 8.5C99.6292 8.5 103.733 12.2614 103.733 16.9013Z" fill="white"/>
<path d="M103.733 21.6499V16.9013C103.733 18.6636 103.141 20.2991 102.13 21.6499H103.733Z" fill="white"/>
<path d="M97.8669 20.1888C97.8669 22.1799 97.0673 23.9849 95.7706 25.3027C94.4396 26.6552 92.585 27.4943 90.5335 27.4943C86.4834 27.4943 83.2002 24.2235 83.2002 20.1888C83.2002 16.1541 86.4834 12.8833 90.5335 12.8833C94.5836 12.8833 97.8669 16.1541 97.8669 20.1888Z" fill="#FFFFFF"/>
<path d="M97.8669 20.1888C97.8669 22.1799 97.0673 23.9849 95.7706 25.3027H97.8669V20.1888Z" fill="#FFFFFF"/>
<ellipse cx="83.9336" cy="20.1886" rx="5.86667" ry="5.8444" fill="#FFFFFF"/>
<path fill-rule="evenodd" clip-rule="evenodd" d="M13 65.5L124 0L45.5 65.5H13ZM82 65.5H109.5L124 0L64.5 65.5H82Z" fill="#A78B7A"/>
<path d="M64.5 65.5L124 0L45.5 65.5L64.5 82V65.5Z" fill="#A78B7A"/>
<path d="M64.5 65.5V82L82 65.5H64.5Z" fill="#A78B7A"/>
<path fill-rule="evenodd" clip-rule="evenodd" d="M13 65.5L124 0L45.5 65.5H13ZM82 65.5H109.5L124 0L64.5 65.5H82Z" fill="#2d74b6"/>
<path d="M64.5 65.5L124 0L45.5 65.5L64.5 82V65.5Z" fill="#2d74b6"/>
<path fill-rule="evenodd" clip-rule="evenodd" d="M13 65.5L124 0L45.5 65.5H13ZM82 65.5H109.5L124 0L64.5 65.5H82Z" fill="#C0A999"/>
</svg>
