[2021-04-07T20:30:19.503+0300][0.006s] Using Concurrent Mark Sweep
[2021-04-07T20:30:19.503+0300][0.006s] Heap address: 0x00000000e0000000, size: 512 MB, Compressed Oops mode: 32-bit
[2021-04-07T20:30:20.911+0300][1.414s] GC(0) Pause Young (Allocation Failure)
[2021-04-07T20:30:20.911+0300][1.414s] GC(0) Using 4 workers of 4 for evacuation
[2021-04-07T20:30:20.916+0300][1.421s] GC(0) ParNew: 87424K->9609K(109248K)
[2021-04-07T20:30:20.916+0300][1.421s] GC(0) CMS: 0K->0K(393216K)
[2021-04-07T20:30:20.916+0300][1.421s] GC(0) Metaspace: 22490K->22490K(1071104K)
[2021-04-07T20:30:20.916+0300][1.421s] GC(0) Pause Young (Allocation Failure) 85M->9M(490M) 7.044ms
[2021-04-07T20:30:20.916+0300][1.421s] GC(0) User=0.06s Sys=0.00s Real=0.00s
[2021-04-07T20:30:20.916+0300][1.422s] GC(1) Pause Initial Mark
[2021-04-07T20:30:20.921+0300][1.423s] GC(1) Pause Initial Mark 12M->12M(490M) 1.284ms
[2021-04-07T20:30:20.921+0300][1.423s] GC(1) User=0.00s Sys=0.00s Real=0.01s
[2021-04-07T20:30:20.921+0300][1.423s] GC(1) Concurrent Mark
[2021-04-07T20:30:20.921+0300][1.423s] GC(1) Using 4 workers of 4 for marking
[2021-04-07T20:30:20.931+0300][1.432s] GC(1) Concurrent Mark 8.911ms
[2021-04-07T20:30:20.931+0300][1.432s] GC(1) User=0.05s Sys=0.00s Real=0.01s
[2021-04-07T20:30:20.931+0300][1.432s] GC(1) Concurrent Preclean
[2021-04-07T20:30:20.931+0300][1.432s] GC(1) Concurrent Preclean 0.389ms
[2021-04-07T20:30:20.931+0300][1.432s] GC(1) User=0.00s Sys=0.00s Real=0.00s
[2021-04-07T20:30:20.931+0300][1.432s] GC(1) Concurrent Abortable Preclean
[2021-04-07T20:30:21.801+0300][2.303s] GC(2) Pause Young (Allocation Failure)
[2021-04-07T20:30:21.801+0300][2.303s] GC(2) Using 4 workers of 4 for evacuation
[2021-04-07T20:30:21.806+0300][2.310s] GC(2) ParNew: 97033K->14086K(109248K)
[2021-04-07T20:30:21.806+0300][2.310s] GC(2) CMS: 0K->0K(393216K)
[2021-04-07T20:30:21.806+0300][2.310s] GC(2) Metaspace: 28502K->28502K(1075200K)
[2021-04-07T20:30:21.806+0300][2.310s] GC(2) Pause Young (Allocation Failure) 94M->13M(490M) 7.049ms
[2021-04-07T20:30:21.806+0300][2.310s] GC(2) User=0.06s Sys=0.00s Real=0.00s
[2021-04-07T20:30:26.963+0300][7.467s] GC(1) Concurrent Abortable Preclean 6034.981ms
[2021-04-07T20:30:26.963+0300][7.467s] GC(1) User=4.88s Sys=0.13s Real=6.03s
[2021-04-07T20:30:26.963+0300][7.467s] GC(1) Pause Remark
[2021-04-07T20:30:26.963+0300][7.467s] GC(3) Pause Young (CMS Final Remark)
[2021-04-07T20:30:26.963+0300][7.467s] GC(3) Using 4 workers of 4 for evacuation
[2021-04-07T20:30:26.968+0300][7.474s] GC(3) ParNew: 41895K->16813K(109248K)
[2021-04-07T20:30:26.968+0300][7.474s] GC(3) CMS: 0K->0K(393216K)
[2021-04-07T20:30:26.968+0300][7.474s] GC(3) Metaspace: 31791K->31791K(1079296K)
[2021-04-07T20:30:26.968+0300][7.474s] GC(3) Pause Young (CMS Final Remark) 40M->16M(490M) 6.551ms
[2021-04-07T20:30:26.973+0300][7.474s] GC(3) User=0.00s Sys=0.00s Real=0.01s
[2021-04-07T20:30:26.978+0300][7.480s] GC(1) Pause Remark 40M->16M(490M) 13.017ms
[2021-04-07T20:30:26.978+0300][7.480s] GC(1) User=0.02s Sys=0.00s Real=0.01s
[2021-04-07T20:30:26.978+0300][7.481s] GC(1) Concurrent Sweep
[2021-04-07T20:30:26.978+0300][7.481s] GC(1) Concurrent Sweep 0.051ms
[2021-04-07T20:30:26.978+0300][7.481s] GC(1) User=0.00s Sys=0.00s Real=0.00s
[2021-04-07T20:30:26.978+0300][7.481s] GC(1) Concurrent Reset
[2021-04-07T20:30:26.978+0300][7.483s] GC(1) Concurrent Reset 2.284ms
[2021-04-07T20:30:26.978+0300][7.483s] GC(1) User=0.00s Sys=0.00s Real=0.00s
[2021-04-07T20:30:26.978+0300][7.483s] GC(1) Old: 0K->0K(393216K)
[2021-04-07T20:30:31.529+0300][12.031s] GC(4) Pause Young (Allocation Failure)
[2021-04-07T20:30:31.529+0300][12.031s] GC(4) Using 4 workers of 4 for evacuation
[2021-04-07T20:30:31.534+0300][12.040s] GC(4) ParNew: 104237K->18061K(109248K)
[2021-04-07T20:30:31.534+0300][12.040s] GC(4) CMS: 0K->0K(393216K)
[2021-04-07T20:30:31.534+0300][12.040s] GC(4) Metaspace: 36264K->36264K(1083392K)
[2021-04-07T20:30:31.534+0300][12.040s] GC(4) Pause Young (Allocation Failure) 101M->17M(490M) 8.215ms
[2021-04-07T20:30:31.534+0300][12.040s] GC(4) User=0.00s Sys=0.00s Real=0.00s
[2021-04-07T20:30:31.669+0300][12.171s] GC(5) Pause Young (GCLocker Initiated GC)
[2021-04-07T20:30:31.669+0300][12.171s] GC(5) Using 4 workers of 4 for evacuation
[2021-04-07T20:30:31.674+0300][12.179s] GC(5) ParNew: 105485K->19781K(109248K)
[2021-04-07T20:30:31.674+0300][12.179s] GC(5) CMS: 0K->0K(393216K)
[2021-04-07T20:30:31.674+0300][12.179s] GC(5) Metaspace: 37043K->37043K(1083392K)
[2021-04-07T20:30:31.674+0300][12.179s] GC(5) Pause Young (GCLocker Initiated GC) 103M->19M(490M) 8.415ms
[2021-04-07T20:30:31.674+0300][12.179s] GC(5) User=0.00s Sys=0.00s Real=0.01s
[2021-04-07T20:30:32.074+0300][12.577s] GC(6) Pause Young (Allocation Failure)
[2021-04-07T20:30:32.074+0300][12.577s] GC(6) Using 4 workers of 4 for evacuation
[2021-04-07T20:30:32.084+0300][12.587s] GC(6) ParNew: 107205K->21824K(109248K)
[2021-04-07T20:30:32.084+0300][12.587s] GC(6) CMS: 0K->166K(393216K)
[2021-04-07T20:30:32.084+0300][12.587s] GC(6) Metaspace: 42926K->42926K(1089536K)
[2021-04-07T20:30:32.084+0300][12.587s] GC(6) Pause Young (Allocation Failure) 104M->21M(490M) 10.640ms
[2021-04-07T20:30:32.084+0300][12.587s] GC(6) User=0.00s Sys=0.00s Real=0.01s
[2021-04-07T20:30:41.976+0300][22.482s] GC(7) Pause Young (Allocation Failure)
[2021-04-07T20:30:41.976+0300][22.482s] GC(7) Using 4 workers of 4 for evacuation
[2021-04-07T20:30:41.991+0300][22.497s] GC(7) ParNew: 109248K->18478K(109248K)
[2021-04-07T20:30:41.991+0300][22.497s] GC(7) CMS: 166K->9854K(393216K)
[2021-04-07T20:30:41.991+0300][22.497s] GC(7) Metaspace: 46818K->46818K(1091584K)
[2021-04-07T20:30:41.991+0300][22.497s] GC(7) Pause Young (Allocation Failure) 106M->27M(490M) 14.862ms
[2021-04-07T20:30:41.991+0300][22.497s] GC(7) User=0.06s Sys=0.00s Real=0.01s
[2021-04-07T20:31:45.684+0300][86.185s] GC(8) Pause Young (Allocation Failure)
[2021-04-07T20:31:45.684+0300][86.185s] GC(8) Using 4 workers of 4 for evacuation
[2021-04-07T20:31:45.721+0300][86.222s] GC(8) ParNew: 105902K->21824K(109248K)
[2021-04-07T20:31:45.721+0300][86.222s] GC(8) CMS: 9854K->23053K(393216K)
[2021-04-07T20:31:45.721+0300][86.222s] GC(8) Metaspace: 52068K->52068K(1095680K)
[2021-04-07T20:31:45.721+0300][86.222s] GC(8) Pause Young (Allocation Failure) 113M->43M(490M) 36.744ms
[2021-04-07T20:31:45.721+0300][86.222s] GC(8) User=0.08s Sys=0.02s Real=0.04s
[2021-04-07T20:31:47.731+0300][88.232s] GC(9) Pause Initial Mark
[2021-04-07T20:31:47.739+0300][88.241s] GC(9) Pause Initial Mark 114M->114M(490M) 8.216ms
[2021-04-07T20:31:47.739+0300][88.241s] GC(9) User=0.00s Sys=0.00s Real=0.01s
[2021-04-07T20:31:47.739+0300][88.241s] GC(9) Concurrent Mark
[2021-04-07T20:31:47.739+0300][88.241s] GC(9) Using 4 workers of 4 for marking
[2021-04-07T20:31:47.747+0300][88.248s] GC(9) Concurrent Mark 7.651ms
[2021-04-07T20:31:47.747+0300][88.248s] GC(9) User=0.06s Sys=0.00s Real=0.01s
[2021-04-07T20:31:47.747+0300][88.248s] GC(9) Concurrent Preclean
[2021-04-07T20:31:47.748+0300][88.250s] GC(9) Concurrent Preclean 1.075ms
[2021-04-07T20:31:47.748+0300][88.250s] GC(9) User=0.00s Sys=0.00s Real=0.00s
[2021-04-07T20:31:47.748+0300][88.250s] GC(9) Concurrent Abortable Preclean
[2021-04-07T20:31:47.830+0300][88.332s] GC(10) Pause Young (Allocation Failure)
[2021-04-07T20:31:47.830+0300][88.332s] GC(10) Using 4 workers of 4 for evacuation
[2021-04-07T20:31:47.858+0300][88.359s] GC(10) ParNew: 109239K->21824K(109248K)
[2021-04-07T20:31:47.858+0300][88.359s] GC(10) CMS: 23053K->48453K(393216K)
[2021-04-07T20:31:47.858+0300][88.359s] GC(10) Metaspace: 54901K->54901K(1099776K)
[2021-04-07T20:31:47.858+0300][88.359s] GC(10) Pause Young (Allocation Failure) 129M->68M(490M) 27.910ms
[2021-04-07T20:31:47.858+0300][88.359s] GC(10) User=0.11s Sys=0.00s Real=0.03s
[2021-04-07T20:31:48.040+0300][88.541s] GC(9) Concurrent Abortable Preclean 291.440ms
[2021-04-07T20:31:48.040+0300][88.541s] GC(9) User=0.77s Sys=0.00s Real=0.29s
[2021-04-07T20:31:48.040+0300][88.541s] GC(9) Pause Remark
[2021-04-07T20:31:48.040+0300][88.542s] GC(11) Pause Young (CMS Final Remark)
[2021-04-07T20:31:48.041+0300][88.542s] GC(11) Using 4 workers of 4 for evacuation
[2021-04-07T20:31:48.053+0300][88.555s] GC(11) ParNew: 92580K->21824K(109248K)
[2021-04-07T20:31:48.054+0300][88.555s] GC(11) CMS: 48453K->55561K(393216K)
[2021-04-07T20:31:48.054+0300][88.555s] GC(11) Metaspace: 54984K->54984K(1099776K)
[2021-04-07T20:31:48.054+0300][88.555s] GC(11) Pause Young (CMS Final Remark) 137M->75M(490M) 13.110ms
[2021-04-07T20:31:48.054+0300][88.555s] GC(11) User=0.00s Sys=0.00s Real=0.01s
[2021-04-07T20:31:48.074+0300][88.575s] GC(9) Pause Remark 137M->75M(490M) 33.441ms
[2021-04-07T20:31:48.074+0300][88.575s] GC(9) User=0.05s Sys=0.00s Real=0.03s
[2021-04-07T20:31:48.079+0300][88.580s] GC(9) Concurrent Sweep
[2021-04-07T20:31:48.089+0300][88.590s] GC(9) Concurrent Sweep 9.472ms
[2021-04-07T20:31:48.089+0300][88.590s] GC(9) User=0.05s Sys=0.00s Real=0.01s
[2021-04-07T20:31:48.089+0300][88.590s] GC(9) Concurrent Reset
[2021-04-07T20:31:48.089+0300][88.591s] GC(9) Concurrent Reset 0.693ms
[2021-04-07T20:31:48.089+0300][88.591s] GC(9) User=0.00s Sys=0.00s Real=0.00s
[2021-04-07T20:31:48.089+0300][88.591s] GC(9) Old: 23053K->55539K(393216K)
[2021-04-07T20:31:48.323+0300][88.825s] GC(12) Pause Young (Allocation Failure)
[2021-04-07T20:31:48.323+0300][88.825s] GC(12) Using 4 workers of 4 for evacuation
[2021-04-07T20:31:48.345+0300][88.846s] GC(12) ParNew: 109248K->21824K(109248K)
[2021-04-07T20:31:48.345+0300][88.846s] GC(12) CMS: 55539K->64372K(393216K)
[2021-04-07T20:31:48.345+0300][88.846s] GC(12) Metaspace: 55105K->55105K(1099776K)
[2021-04-07T20:31:48.345+0300][88.846s] GC(12) Pause Young (Allocation Failure) 160M->84M(490M) 21.463ms
[2021-04-07T20:31:48.345+0300][88.846s] GC(12) User=0.03s Sys=0.00s Real=0.02s
[2021-04-07T20:31:49.200+0300][89.701s] GC(13) Pause Young (Allocation Failure)
[2021-04-07T20:31:49.200+0300][89.701s] GC(13) Using 4 workers of 4 for evacuation
[2021-04-07T20:31:49.210+0300][89.711s] GC(13) ParNew: 109248K->21824K(109248K)
[2021-04-07T20:31:49.210+0300][89.711s] GC(13) CMS: 64372K->67171K(393216K)
[2021-04-07T20:31:49.210+0300][89.711s] GC(13) Metaspace: 55495K->55495K(1099776K)
[2021-04-07T20:31:49.210+0300][89.711s] GC(13) Pause Young (Allocation Failure) 169M->86M(490M) 10.162ms
[2021-04-07T20:31:49.210+0300][89.711s] GC(13) User=0.00s Sys=0.00s Real=0.01s
[2021-04-07T20:31:50.892+0300][91.393s] GC(14) Pause Young (Allocation Failure)
[2021-04-07T20:31:50.892+0300][91.393s] GC(14) Using 4 workers of 4 for evacuation
[2021-04-07T20:31:50.931+0300][91.432s] GC(14) ParNew: 109248K->16652K(109248K)
[2021-04-07T20:31:50.931+0300][91.432s] GC(14) CMS: 67171K->76416K(393216K)
[2021-04-07T20:31:50.931+0300][91.432s] GC(14) Metaspace: 56144K->56144K(1099776K)
[2021-04-07T20:31:50.931+0300][91.432s] GC(14) Pause Young (Allocation Failure) 172M->90M(490M) 38.535ms
[2021-04-07T20:31:50.931+0300][91.432s] GC(14) User=0.11s Sys=0.00s Real=0.04s
[2021-04-07T20:31:51.337+0300][91.839s] GC(15) Pause Young (Allocation Failure)
[2021-04-07T20:31:51.338+0300][91.839s] GC(15) Using 4 workers of 4 for evacuation
[2021-04-07T20:31:51.342+0300][91.843s] GC(15) ParNew: 104076K->14404K(109248K)
[2021-04-07T20:31:51.342+0300][91.843s] GC(15) CMS: 76416K->76416K(393216K)
[2021-04-07T20:31:51.342+0300][91.843s] GC(15) Metaspace: 56763K->56763K(1101824K)
[2021-04-07T20:31:51.342+0300][91.843s] GC(15) Pause Young (Allocation Failure) 176M->88M(490M) 4.597ms
[2021-04-07T20:31:51.342+0300][91.843s] GC(15) User=0.00s Sys=0.00s Real=0.01s
[2021-04-07T20:31:51.621+0300][92.123s] GC(16) Pause Young (Allocation Failure)
[2021-04-07T20:31:51.621+0300][92.123s] GC(16) Using 4 workers of 4 for evacuation
[2021-04-07T20:31:51.625+0300][92.127s] GC(16) ParNew: 101824K->13523K(109248K)
[2021-04-07T20:31:51.626+0300][92.127s] GC(16) CMS: 76416K->76416K(393216K)
[2021-04-07T20:31:51.626+0300][92.127s] GC(16) Metaspace: 56813K->56813K(1101824K)
[2021-04-07T20:31:51.626+0300][92.127s] GC(16) Pause Young (Allocation Failure) 174M->87M(490M) 4.421ms
[2021-04-07T20:31:51.626+0300][92.127s] GC(16) User=0.00s Sys=0.00s Real=0.00s
[2021-04-07T20:31:52.444+0300][92.945s] GC(17) Pause Young (Allocation Failure)
[2021-04-07T20:31:52.444+0300][92.946s] GC(17) Using 4 workers of 4 for evacuation
[2021-04-07T20:31:52.450+0300][92.951s] GC(17) ParNew: 100947K->15516K(109248K)
[2021-04-07T20:31:52.450+0300][92.951s] GC(17) CMS: 76416K->76416K(393216K)
[2021-04-07T20:31:52.450+0300][92.951s] GC(17) Metaspace: 57268K->57268K(1101824K)
[2021-04-07T20:31:52.450+0300][92.951s] GC(17) Pause Young (Allocation Failure) 173M->89M(490M) 5.608ms
[2021-04-07T20:31:52.450+0300][92.951s] GC(17) User=0.06s Sys=0.00s Real=0.01s
[2021-04-07T20:31:52.756+0300][93.257s] GC(18) Pause Young (Allocation Failure)
[2021-04-07T20:31:52.756+0300][93.257s] GC(18) Using 4 workers of 4 for evacuation
[2021-04-07T20:31:52.761+0300][93.263s] GC(18) ParNew: 102652K->17264K(109248K)
[2021-04-07T20:31:52.761+0300][93.263s] GC(18) CMS: 76416K->76416K(393216K)
[2021-04-07T20:31:52.761+0300][93.263s] GC(18) Metaspace: 57498K->57498K(1101824K)
[2021-04-07T20:31:52.761+0300][93.263s] GC(18) Pause Young (Allocation Failure) 174M->91M(490M) 5.367ms
[2021-04-07T20:31:52.762+0300][93.263s] GC(18) User=0.06s Sys=0.00s Real=0.01s
[2021-04-07T20:32:02.544+0300][103.046s] GC(19) Pause Young (Allocation Failure)
[2021-04-07T20:32:02.544+0300][103.046s] GC(19) Using 4 workers of 4 for evacuation
[2021-04-07T20:32:02.558+0300][103.059s] GC(19) ParNew: 104688K->21824K(109248K)
[2021-04-07T20:32:02.558+0300][103.059s] GC(19) CMS: 76416K->82594K(393216K)
[2021-04-07T20:32:02.558+0300][103.059s] GC(19) Metaspace: 57933K->57933K(1101824K)
[2021-04-07T20:32:02.558+0300][103.059s] GC(19) Pause Young (Allocation Failure) 176M->101M(490M) 13.675ms
[2021-04-07T20:32:02.558+0300][103.059s] GC(19) User=0.05s Sys=0.02s Real=0.01s
[2021-04-07T20:32:09.035+0300][109.536s] GC(20) Pause Young (Allocation Failure)
[2021-04-07T20:32:09.035+0300][109.537s] GC(20) Using 4 workers of 4 for evacuation
[2021-04-07T20:32:09.046+0300][109.547s] GC(20) ParNew: 109248K->21824K(109248K)
[2021-04-07T20:32:09.046+0300][109.547s] GC(20) CMS: 82594K->88052K(393216K)
[2021-04-07T20:32:09.046+0300][109.547s] GC(20) Metaspace: 57946K->57946K(1101824K)
[2021-04-07T20:32:09.046+0300][109.547s] GC(20) Pause Young (Allocation Failure) 187M->107M(490M) 10.908ms
[2021-04-07T20:32:09.046+0300][109.547s] GC(20) User=0.06s Sys=0.00s Real=0.01s
[2021-04-07T20:32:09.295+0300][109.797s] GC(21) Pause Young (Allocation Failure)
[2021-04-07T20:32:09.296+0300][109.797s] GC(21) Using 4 workers of 4 for evacuation
[2021-04-07T20:32:09.304+0300][109.805s] GC(21) ParNew: 109083K->21824K(109248K)
[2021-04-07T20:32:09.304+0300][109.806s] GC(21) CMS: 88052K->92890K(393216K)
[2021-04-07T20:32:09.304+0300][109.806s] GC(21) Metaspace: 58326K->58326K(1101824K)
[2021-04-07T20:32:09.304+0300][109.806s] GC(21) Pause Young (Allocation Failure) 192M->112M(490M) 8.848ms
[2021-04-07T20:32:09.304+0300][109.806s] GC(21) User=0.00s Sys=0.00s Real=0.01s
[2021-04-07T20:32:57.059+0300][157.564s] GC(22) Pause Young (Allocation Failure)
[2021-04-07T20:32:57.059+0300][157.564s] GC(22) Using 4 workers of 4 for evacuation
[2021-04-07T20:32:57.069+0300][157.572s] GC(22) ParNew: 109248K->21824K(109248K)
[2021-04-07T20:32:57.069+0300][157.572s] GC(22) CMS: 92890K->93232K(393216K)
[2021-04-07T20:32:57.069+0300][157.572s] GC(22) Metaspace: 58682K->58682K(1103872K)
[2021-04-07T20:32:57.069+0300][157.572s] GC(22) Pause Young (Allocation Failure) 197M->112M(490M) 7.638ms
[2021-04-07T20:32:57.069+0300][157.572s] GC(22) User=0.00s Sys=0.00s Real=0.01s
[2021-04-07T20:32:57.184+0300][157.686s] GC(23) Pause Young (Allocation Failure)
[2021-04-07T20:32:57.184+0300][157.686s] GC(23) Using 4 workers of 4 for evacuation
[2021-04-07T20:32:57.194+0300][157.695s] GC(23) ParNew: 109248K->21524K(109248K)
[2021-04-07T20:32:57.194+0300][157.695s] GC(23) CMS: 93232K->93317K(393216K)
[2021-04-07T20:32:57.194+0300][157.695s] GC(23) Metaspace: 58698K->58698K(1103872K)
[2021-04-07T20:32:57.194+0300][157.695s] GC(23) Pause Young (Allocation Failure) 197M->112M(490M) 9.394ms
[2021-04-07T20:32:57.194+0300][157.695s] GC(23) User=0.00s Sys=0.00s Real=0.01s
[2021-04-07T20:33:06.474+0300][166.979s] GC(24) Pause Young (Allocation Failure)
[2021-04-07T20:33:06.474+0300][166.980s] GC(24) Using 4 workers of 4 for evacuation
[2021-04-07T20:33:06.489+0300][166.995s] GC(24) ParNew: 108948K->21824K(109248K)
[2021-04-07T20:33:06.489+0300][166.995s] GC(24) CMS: 93317K->97460K(393216K)
[2021-04-07T20:33:06.489+0300][166.995s] GC(24) Metaspace: 58868K->58868K(1103872K)
[2021-04-07T20:33:06.489+0300][166.995s] GC(24) Pause Young (Allocation Failure) 197M->116M(490M) 15.556ms
[2021-04-07T20:33:06.489+0300][166.995s] GC(24) User=0.06s Sys=0.00s Real=0.02s
[2021-04-07T20:33:06.559+0300][167.062s] GC(25) Pause Young (Allocation Failure)
[2021-04-07T20:33:06.559+0300][167.062s] GC(25) Using 4 workers of 4 for evacuation
[2021-04-07T20:33:06.569+0300][167.075s] GC(25) ParNew: 109248K->21824K(109248K)
[2021-04-07T20:33:06.569+0300][167.075s] GC(25) CMS: 97460K->107643K(393216K)
[2021-04-07T20:33:06.569+0300][167.075s] GC(25) Metaspace: 58877K->58877K(1103872K)
[2021-04-07T20:33:06.569+0300][167.075s] GC(25) Pause Young (Allocation Failure) 201M->126M(490M) 12.997ms
[2021-04-07T20:33:06.569+0300][167.075s] GC(25) User=0.00s Sys=0.00s Real=0.01s
[2021-04-07T20:33:06.674+0300][167.179s] GC(26) Pause Young (Allocation Failure)
[2021-04-07T20:33:06.674+0300][167.179s] GC(26) Using 4 workers of 4 for evacuation
[2021-04-07T20:33:06.679+0300][167.185s] GC(26) ParNew: 109248K->15694K(109248K)
[2021-04-07T20:33:06.679+0300][167.185s] GC(26) CMS: 107643K->107643K(393216K)
[2021-04-07T20:33:06.679+0300][167.185s] GC(26) Metaspace: 58948K->58948K(1103872K)
[2021-04-07T20:33:06.679+0300][167.185s] GC(26) Pause Young (Allocation Failure) 211M->120M(490M) 6.264ms
[2021-04-07T20:33:06.679+0300][167.185s] GC(26) User=0.00s Sys=0.00s Real=0.00s
[2021-04-07T20:37:02.188+0300][402.693s] GC(27) Pause Young (Allocation Failure)
[2021-04-07T20:37:02.188+0300][402.693s] GC(27) Using 4 workers of 4 for evacuation
[2021-04-07T20:37:02.198+0300][402.701s] GC(27) ParNew: 103118K->21824K(109248K)
[2021-04-07T20:37:02.198+0300][402.701s] GC(27) CMS: 107643K->107643K(393216K)
[2021-04-07T20:37:02.198+0300][402.701s] GC(27) Metaspace: 59326K->59326K(1103872K)
[2021-04-07T20:37:02.198+0300][402.701s] GC(27) Pause Young (Allocation Failure) 205M->126M(490M) 8.153ms
[2021-04-07T20:37:02.198+0300][402.701s] GC(27) User=0.06s Sys=0.00s Real=0.01s
[2021-04-07T20:37:50.391+0300][450.894s] GC(28) Pause Young (Allocation Failure)
[2021-04-07T20:37:50.391+0300][450.894s] GC(28) Using 4 workers of 4 for evacuation
[2021-04-07T20:37:50.401+0300][450.905s] GC(28) ParNew: 109248K->21824K(109248K)
[2021-04-07T20:37:50.401+0300][450.905s] GC(28) CMS: 107643K->114051K(393216K)
[2021-04-07T20:37:50.401+0300][450.905s] GC(28) Metaspace: 59355K->59355K(1103872K)
[2021-04-07T20:37:50.401+0300][450.905s] GC(28) Pause Young (Allocation Failure) 211M->132M(490M) 11.014ms
[2021-04-07T20:37:50.401+0300][450.905s] GC(28) User=0.06s Sys=0.00s Real=0.01s
[2021-04-07T20:38:35.410+0300][495.915s] GC(29) Pause Young (Allocation Failure)
[2021-04-07T20:38:35.410+0300][495.915s] GC(29) Using 4 workers of 4 for evacuation
[2021-04-07T20:38:35.420+0300][495.925s] GC(29) ParNew: 109201K->21824K(109248K)
[2021-04-07T20:38:35.420+0300][495.925s] GC(29) CMS: 114051K->114631K(393216K)
[2021-04-07T20:38:35.420+0300][495.925s] GC(29) Metaspace: 59403K->59403K(1103872K)
[2021-04-07T20:38:35.420+0300][495.925s] GC(29) Pause Young (Allocation Failure) 218M->133M(490M) 9.429ms
[2021-04-07T20:38:35.420+0300][495.925s] GC(29) User=0.06s Sys=0.00s Real=0.01s
[2021-04-07T20:38:35.615+0300][496.117s] GC(30) Pause Young (Allocation Failure)
[2021-04-07T20:38:35.615+0300][496.117s] GC(30) Using 4 workers of 4 for evacuation
[2021-04-07T20:38:35.625+0300][496.127s] GC(30) ParNew: 109248K->17602K(109248K)
[2021-04-07T20:38:35.625+0300][496.127s] GC(30) CMS: 114631K->117576K(393216K)
[2021-04-07T20:38:35.625+0300][496.127s] GC(30) Metaspace: 59420K->59420K(1103872K)
[2021-04-07T20:38:35.625+0300][496.127s] GC(30) Pause Young (Allocation Failure) 218M->132M(490M) 10.140ms
[2021-04-07T20:38:35.625+0300][496.127s] GC(30) User=0.06s Sys=0.00s Real=0.01s
