[2021-04-08T14:10:08.903+0300][0.006s] Using Concurrent Mark Sweep
[2021-04-08T14:10:08.904+0300][0.006s] Heap address: 0x00000000e0000000, size: 512 MB, Compressed Oops mode: 32-bit
[2021-04-08T14:10:10.431+0300][1.534s] GC(0) Pause Young (Allocation Failure)
[2021-04-08T14:10:10.431+0300][1.534s] GC(0) Using 4 workers of 4 for evacuation
[2021-04-08T14:10:10.438+0300][1.541s] GC(0) ParNew: 87424K->9606K(109248K)
[2021-04-08T14:10:10.438+0300][1.541s] GC(0) CMS: 0K->0K(393216K)
[2021-04-08T14:10:10.438+0300][1.541s] GC(0) Metaspace: 22508K->22508K(1071104K)
[2021-04-08T14:10:10.438+0300][1.541s] GC(0) Pause Young (Allocation Failure) 85M->9M(490M) 7.063ms
[2021-04-08T14:10:10.438+0300][1.541s] GC(0) User=0.00s Sys=0.00s Real=0.01s
[2021-04-08T14:10:10.438+0300][1.541s] GC(1) Pause Initial Mark
[2021-04-08T14:10:10.440+0300][1.543s] GC(1) Pause Initial Mark 10M->10M(490M) 1.378ms
[2021-04-08T14:10:10.440+0300][1.543s] GC(1) User=0.00s Sys=0.00s Real=0.00s
[2021-04-08T14:10:10.440+0300][1.543s] GC(1) Concurrent Mark
[2021-04-08T14:10:10.440+0300][1.543s] GC(1) Using 4 workers of 4 for marking
[2021-04-08T14:10:10.443+0300][1.546s] GC(1) Concurrent Mark 2.999ms
[2021-04-08T14:10:10.443+0300][1.546s] GC(1) User=0.02s Sys=0.00s Real=0.00s
[2021-04-08T14:10:10.443+0300][1.546s] GC(1) Concurrent Preclean
[2021-04-08T14:10:10.443+0300][1.546s] GC(1) Concurrent Preclean 0.385ms
[2021-04-08T14:10:10.443+0300][1.546s] GC(1) User=0.00s Sys=0.00s Real=0.00s
[2021-04-08T14:10:10.443+0300][1.546s] GC(1) Concurrent Abortable Preclean
[2021-04-08T14:10:11.426+0300][2.529s] GC(2) Pause Young (Allocation Failure)
[2021-04-08T14:10:11.427+0300][2.529s] GC(2) Using 4 workers of 4 for evacuation
[2021-04-08T14:10:11.434+0300][2.537s] GC(2) ParNew: 97030K->13859K(109248K)
[2021-04-08T14:10:11.434+0300][2.537s] GC(2) CMS: 0K->0K(393216K)
[2021-04-08T14:10:11.434+0300][2.537s] GC(2) Metaspace: 29442K->29442K(1077248K)
[2021-04-08T14:10:11.434+0300][2.537s] GC(2) Pause Young (Allocation Failure) 94M->13M(490M) 8.008ms
[2021-04-08T14:10:11.434+0300][2.537s] GC(2) User=0.02s Sys=0.02s Real=0.01s
[2021-04-08T14:10:16.565+0300][7.675s] GC(1) Concurrent Abortable Preclean 6128.460ms
[2021-04-08T14:10:16.565+0300][7.675s] GC(1) User=4.84s Sys=0.17s Real=6.12s
[2021-04-08T14:10:16.565+0300][7.675s] GC(1) Pause Remark
[2021-04-08T14:10:16.565+0300][7.675s] GC(3) Pause Young (CMS Final Remark)
[2021-04-08T14:10:16.565+0300][7.675s] GC(3) Using 4 workers of 4 for evacuation
[2021-04-08T14:10:16.565+0300][7.681s] GC(3) ParNew: 38777K->16077K(109248K)
[2021-04-08T14:10:16.565+0300][7.681s] GC(3) CMS: 0K->0K(393216K)
[2021-04-08T14:10:16.565+0300][7.681s] GC(3) Metaspace: 31756K->31756K(1079296K)
[2021-04-08T14:10:16.565+0300][7.681s] GC(3) Pause Young (CMS Final Remark) 37M->15M(490M) 6.527ms
[2021-04-08T14:10:16.565+0300][7.681s] GC(3) User=0.00s Sys=0.00s Real=0.00s
[2021-04-08T14:10:16.581+0300][7.687s] GC(1) Pause Remark 37M->15M(490M) 12.781ms
[2021-04-08T14:10:16.581+0300][7.687s] GC(1) User=0.06s Sys=0.00s Real=0.02s
[2021-04-08T14:10:16.581+0300][7.688s] GC(1) Concurrent Sweep
[2021-04-08T14:10:16.581+0300][7.688s] GC(1) Concurrent Sweep 0.032ms
[2021-04-08T14:10:16.581+0300][7.688s] GC(1) User=0.00s Sys=0.00s Real=0.00s
[2021-04-08T14:10:16.581+0300][7.688s] GC(1) Concurrent Reset
[2021-04-08T14:10:16.581+0300][7.690s] GC(1) Concurrent Reset 2.095ms
[2021-04-08T14:10:16.581+0300][7.690s] GC(1) User=0.00s Sys=0.00s Real=0.00s
[2021-04-08T14:10:16.581+0300][7.690s] GC(1) Old: 0K->0K(393216K)
[2021-04-08T14:10:21.098+0300][12.202s] GC(4) Pause Young (Allocation Failure)
[2021-04-08T14:10:21.098+0300][12.203s] GC(4) Using 4 workers of 4 for evacuation
[2021-04-08T14:10:21.098+0300][12.213s] GC(4) ParNew: 103501K->21824K(109248K)
[2021-04-08T14:10:21.098+0300][12.213s] GC(4) CMS: 0K->0K(393216K)
[2021-04-08T14:10:21.098+0300][12.213s] GC(4) Metaspace: 37263K->37263K(1083392K)
[2021-04-08T14:10:21.098+0300][12.213s] GC(4) Pause Young (Allocation Failure) 101M->21M(490M) 10.865ms
[2021-04-08T14:10:21.098+0300][12.213s] GC(4) User=0.00s Sys=0.00s Real=0.00s
[2021-04-08T14:10:21.270+0300][12.374s] GC(5) Pause Young (Allocation Failure)
[2021-04-08T14:10:21.270+0300][12.374s] GC(5) Using 4 workers of 4 for evacuation
[2021-04-08T14:10:21.270+0300][12.385s] GC(5) ParNew: 109248K->21824K(109248K)
[2021-04-08T14:10:21.270+0300][12.385s] GC(5) CMS: 0K->0K(393216K)
[2021-04-08T14:10:21.270+0300][12.385s] GC(5) Metaspace: 38244K->38244K(1083392K)
[2021-04-08T14:10:21.270+0300][12.385s] GC(5) Pause Young (Allocation Failure) 106M->21M(490M) 10.524ms
[2021-04-08T14:10:21.270+0300][12.385s] GC(5) User=0.00s Sys=0.00s Real=0.00s
[2021-04-08T14:10:21.364+0300][12.467s] GC(6) Pause Young (Allocation Failure)
[2021-04-08T14:10:21.364+0300][12.467s] GC(6) Using 4 workers of 4 for evacuation
[2021-04-08T14:10:21.364+0300][12.478s] GC(6) ParNew: 109248K->21824K(109248K)
[2021-04-08T14:10:21.364+0300][12.478s] GC(6) CMS: 0K->0K(393216K)
[2021-04-08T14:10:21.364+0300][12.478s] GC(6) Metaspace: 38440K->38440K(1085440K)
[2021-04-08T14:10:21.364+0300][12.478s] GC(6) Pause Young (Allocation Failure) 106M->21M(490M) 11.631ms
[2021-04-08T14:10:21.364+0300][12.479s] GC(6) User=0.00s Sys=0.00s Real=0.00s
[2021-04-08T14:10:21.442+0300][12.558s] GC(7) Pause Young (Allocation Failure)
[2021-04-08T14:10:21.442+0300][12.558s] GC(7) Using 4 workers of 4 for evacuation
[2021-04-08T14:10:21.458+0300][12.568s] GC(7) ParNew: 109248K->21824K(109248K)
[2021-04-08T14:10:21.458+0300][12.568s] GC(7) CMS: 0K->233K(393216K)
[2021-04-08T14:10:21.458+0300][12.568s] GC(7) Metaspace: 38913K->38913K(1085440K)
[2021-04-08T14:10:21.458+0300][12.568s] GC(7) Pause Young (Allocation Failure) 106M->21M(490M) 10.320ms
[2021-04-08T14:10:21.458+0300][12.568s] GC(7) User=0.05s Sys=0.00s Real=0.02s
[2021-04-08T14:10:22.013+0300][13.115s] GC(8) Pause Young (Allocation Failure)
[2021-04-08T14:10:22.013+0300][13.115s] GC(8) Using 4 workers of 4 for evacuation
[2021-04-08T14:10:22.028+0300][13.131s] GC(8) ParNew: 109248K->21824K(109248K)
[2021-04-08T14:10:22.028+0300][13.131s] GC(8) CMS: 233K->3497K(393216K)
[2021-04-08T14:10:22.028+0300][13.131s] GC(8) Metaspace: 43562K->43562K(1089536K)
[2021-04-08T14:10:22.028+0300][13.131s] GC(8) Pause Young (Allocation Failure) 106M->24M(490M) 15.768ms
[2021-04-08T14:10:22.028+0300][13.131s] GC(8) User=0.06s Sys=0.00s Real=0.02s
[2021-04-08T14:10:22.669+0300][13.772s] GC(9) Pause Young (Allocation Failure)
[2021-04-08T14:10:22.669+0300][13.772s] GC(9) Using 4 workers of 4 for evacuation
[2021-04-08T14:10:22.708+0300][13.810s] GC(9) ParNew: 109248K->21824K(109248K)
[2021-04-08T14:10:22.708+0300][13.810s] GC(9) CMS: 3497K->12384K(393216K)
[2021-04-08T14:10:22.708+0300][13.810s] GC(9) Metaspace: 46731K->46731K(1091584K)
[2021-04-08T14:10:22.708+0300][13.810s] GC(9) Pause Young (Allocation Failure) 110M->33M(490M) 38.688ms
[2021-04-08T14:10:22.708+0300][13.810s] GC(9) User=0.11s Sys=0.02s Real=0.04s
[2021-04-08T14:10:29.311+0300][20.413s] GC(10) Pause Young (Allocation Failure)
[2021-04-08T14:10:29.311+0300][20.413s] GC(10) Using 4 workers of 4 for evacuation
[2021-04-08T14:10:29.333+0300][20.435s] GC(10) ParNew: 109248K->21824K(109248K)
[2021-04-08T14:10:29.333+0300][20.435s] GC(10) CMS: 12384K->19455K(393216K)
[2021-04-08T14:10:29.333+0300][20.435s] GC(10) Metaspace: 50523K->50523K(1095680K)
[2021-04-08T14:10:29.333+0300][20.435s] GC(10) Pause Young (Allocation Failure) 118M->40M(490M) 22.119ms
[2021-04-08T14:10:29.333+0300][20.436s] GC(10) User=0.06s Sys=0.02s Real=0.02s
[2021-04-08T14:12:01.652+0300][112.755s] GC(11) Pause Young (Allocation Failure)
[2021-04-08T14:12:01.652+0300][112.755s] GC(11) Using 4 workers of 4 for evacuation
[2021-04-08T14:12:01.690+0300][112.793s] GC(11) ParNew: 109248K->21824K(109248K)
[2021-04-08T14:12:01.690+0300][112.793s] GC(11) CMS: 19455K->60985K(393216K)
[2021-04-08T14:12:01.690+0300][112.793s] GC(11) Metaspace: 53118K->53118K(1097728K)
[2021-04-08T14:12:01.690+0300][112.793s] GC(11) Pause Young (Allocation Failure) 125M->80M(490M) 38.233ms
[2021-04-08T14:12:01.690+0300][112.793s] GC(11) User=0.11s Sys=0.02s Real=0.04s
[2021-04-08T14:12:02.303+0300][113.405s] GC(12) Pause Young (Allocation Failure)
[2021-04-08T14:12:02.303+0300][113.405s] GC(12) Using 4 workers of 4 for evacuation
[2021-04-08T14:12:02.322+0300][113.424s] GC(12) ParNew: 109248K->21824K(109248K)
[2021-04-08T14:12:02.322+0300][113.424s] GC(12) CMS: 60985K->73237K(393216K)
[2021-04-08T14:12:02.322+0300][113.424s] GC(12) Metaspace: 53725K->53725K(1097728K)
[2021-04-08T14:12:02.322+0300][113.424s] GC(12) Pause Young (Allocation Failure) 166M->92M(490M) 19.423ms
[2021-04-08T14:12:02.322+0300][113.424s] GC(12) User=0.06s Sys=0.00s Real=0.02s
[2021-04-08T14:12:02.324+0300][113.426s] GC(13) Pause Initial Mark
[2021-04-08T14:12:02.327+0300][113.430s] GC(13) Pause Initial Mark 93M->93M(490M) 3.789ms
[2021-04-08T14:12:02.327+0300][113.430s] GC(13) User=0.00s Sys=0.00s Real=0.00s
[2021-04-08T14:12:02.328+0300][113.430s] GC(13) Concurrent Mark
[2021-04-08T14:12:02.328+0300][113.430s] GC(13) Using 4 workers of 4 for marking
[2021-04-08T14:12:02.350+0300][113.452s] GC(13) Concurrent Mark 22.011ms
[2021-04-08T14:12:02.350+0300][113.452s] GC(13) User=0.11s Sys=0.02s Real=0.02s
[2021-04-08T14:12:02.350+0300][113.452s] GC(13) Concurrent Preclean
[2021-04-08T14:12:02.351+0300][113.453s] GC(13) Concurrent Preclean 0.976ms
[2021-04-08T14:12:02.351+0300][113.453s] GC(13) User=0.00s Sys=0.00s Real=0.00s
[2021-04-08T14:12:02.351+0300][113.453s] GC(13) Pause Remark
[2021-04-08T14:12:02.351+0300][113.453s] GC(14) Pause Young (CMS Final Remark)
[2021-04-08T14:12:02.351+0300][113.453s] GC(14) Using 4 workers of 4 for evacuation
[2021-04-08T14:12:02.365+0300][113.467s] GC(14) ParNew: 22139K->21824K(109248K)
[2021-04-08T14:12:02.365+0300][113.467s] GC(14) CMS: 73237K->84856K(393216K)
[2021-04-08T14:12:02.365+0300][113.467s] GC(14) Metaspace: 53725K->53725K(1097728K)
[2021-04-08T14:12:02.365+0300][113.467s] GC(14) Pause Young (CMS Final Remark) 93M->104M(490M) 14.039ms
[2021-04-08T14:12:02.365+0300][113.467s] GC(14) User=0.05s Sys=0.00s Real=0.01s
[2021-04-08T14:12:02.383+0300][113.485s] GC(13) Pause Remark 93M->104M(490M) 32.029ms
[2021-04-08T14:12:02.383+0300][113.486s] GC(13) User=0.09s Sys=0.00s Real=0.03s
[2021-04-08T14:12:02.383+0300][113.486s] GC(13) Concurrent Sweep
[2021-04-08T14:12:02.400+0300][113.503s] GC(13) Concurrent Sweep 17.003ms
[2021-04-08T14:12:02.400+0300][113.503s] GC(13) User=0.06s Sys=0.00s Real=0.02s
[2021-04-08T14:12:02.400+0300][113.503s] GC(13) Concurrent Reset
[2021-04-08T14:12:02.401+0300][113.503s] GC(13) Concurrent Reset 0.688ms
[2021-04-08T14:12:02.401+0300][113.503s] GC(13) User=0.00s Sys=0.00s Real=0.00s
[2021-04-08T14:12:02.401+0300][113.503s] GC(13) Old: 73237K->82835K(393216K)
[2021-04-08T14:12:03.430+0300][114.533s] GC(15) Pause Young (Allocation Failure)
[2021-04-08T14:12:03.430+0300][114.533s] GC(15) Using 4 workers of 4 for evacuation
[2021-04-08T14:12:03.438+0300][114.540s] GC(15) ParNew: 109248K->17869K(109248K)
[2021-04-08T14:12:03.438+0300][114.540s] GC(15) CMS: 82835K->82835K(393216K)
[2021-04-08T14:12:03.438+0300][114.540s] GC(15) Metaspace: 54298K->54298K(1097728K)
[2021-04-08T14:12:03.438+0300][114.540s] GC(15) Pause Young (Allocation Failure) 187M->98M(490M) 7.947ms
[2021-04-08T14:12:03.438+0300][114.540s] GC(15) User=0.00s Sys=0.00s Real=0.01s
[2021-04-08T14:12:04.403+0300][115.505s] GC(16) Pause Young (Allocation Failure)
[2021-04-08T14:12:04.403+0300][115.505s] GC(16) Using 4 workers of 4 for evacuation
[2021-04-08T14:12:04.411+0300][115.513s] GC(16) ParNew: 105257K->21824K(109248K)
[2021-04-08T14:12:04.411+0300][115.513s] GC(16) CMS: 82835K->82835K(393216K)
[2021-04-08T14:12:04.411+0300][115.513s] GC(16) Metaspace: 56568K->56568K(1099776K)
[2021-04-08T14:12:04.411+0300][115.513s] GC(16) Pause Young (Allocation Failure) 183M->102M(490M) 7.953ms
[2021-04-08T14:12:04.411+0300][115.513s] GC(16) User=0.00s Sys=0.00s Real=0.01s
[2021-04-08T14:12:04.985+0300][116.087s] GC(17) Pause Young (Allocation Failure)
[2021-04-08T14:12:04.985+0300][116.087s] GC(17) Using 4 workers of 4 for evacuation
[2021-04-08T14:12:04.993+0300][116.095s] GC(17) ParNew: 108830K->21824K(109248K)
[2021-04-08T14:12:04.993+0300][116.095s] GC(17) CMS: 82835K->82894K(393216K)
[2021-04-08T14:12:04.993+0300][116.095s] GC(17) Metaspace: 56616K->56616K(1101824K)
[2021-04-08T14:12:04.993+0300][116.096s] GC(17) Pause Young (Allocation Failure) 187M->102M(490M) 8.179ms
[2021-04-08T14:12:04.993+0300][116.096s] GC(17) User=0.06s Sys=0.00s Real=0.01s
[2021-04-08T14:12:05.571+0300][116.674s] GC(18) Pause Young (Allocation Failure)
[2021-04-08T14:12:05.571+0300][116.674s] GC(18) Using 4 workers of 4 for evacuation
[2021-04-08T14:12:05.579+0300][116.682s] GC(18) ParNew: 109248K->21824K(109248K)
[2021-04-08T14:12:05.579+0300][116.682s] GC(18) CMS: 82894K->82894K(393216K)
[2021-04-08T14:12:05.579+0300][116.682s] GC(18) Metaspace: 56862K->56862K(1101824K)
[2021-04-08T14:12:05.579+0300][116.682s] GC(18) Pause Young (Allocation Failure) 187M->102M(490M) 8.298ms
[2021-04-08T14:12:05.579+0300][116.682s] GC(18) User=0.00s Sys=0.00s Real=0.01s
[2021-04-08T14:12:05.957+0300][117.059s] GC(19) Pause Young (Allocation Failure)
[2021-04-08T14:12:05.957+0300][117.059s] GC(19) Using 4 workers of 4 for evacuation
[2021-04-08T14:12:05.965+0300][117.067s] GC(19) ParNew: 109138K->21824K(109248K)
[2021-04-08T14:12:05.965+0300][117.067s] GC(19) CMS: 82894K->83872K(393216K)
[2021-04-08T14:12:05.965+0300][117.067s] GC(19) Metaspace: 57397K->57397K(1101824K)
[2021-04-08T14:12:05.965+0300][117.067s] GC(19) Pause Young (Allocation Failure) 187M->103M(490M) 7.892ms
[2021-04-08T14:12:05.965+0300][117.067s] GC(19) User=0.06s Sys=0.00s Real=0.01s
[2021-04-08T14:12:06.502+0300][117.604s] GC(20) Pause Young (Allocation Failure)
[2021-04-08T14:12:06.502+0300][117.604s] GC(20) Using 4 workers of 4 for evacuation
[2021-04-08T14:12:06.512+0300][117.614s] GC(20) ParNew: 109248K->21824K(109248K)
[2021-04-08T14:12:06.512+0300][117.614s] GC(20) CMS: 83872K->87045K(393216K)
[2021-04-08T14:12:06.512+0300][117.614s] GC(20) Metaspace: 57640K->57640K(1101824K)
[2021-04-08T14:12:06.512+0300][117.614s] GC(20) Pause Young (Allocation Failure) 188M->106M(490M) 10.252ms
[2021-04-08T14:12:06.512+0300][117.614s] GC(20) User=0.06s Sys=0.00s Real=0.01s
[2021-04-08T14:12:06.604+0300][117.706s] GC(21) Pause Young (Allocation Failure)
[2021-04-08T14:12:06.604+0300][117.706s] GC(21) Using 4 workers of 4 for evacuation
[2021-04-08T14:12:06.611+0300][117.713s] GC(21) ParNew: 109248K->19120K(109248K)
[2021-04-08T14:12:06.611+0300][117.713s] GC(21) CMS: 87045K->92452K(393216K)
[2021-04-08T14:12:06.611+0300][117.713s] GC(21) Metaspace: 57650K->57650K(1101824K)
[2021-04-08T14:12:06.611+0300][117.713s] GC(21) Pause Young (Allocation Failure) 191M->108M(490M) 6.895ms
[2021-04-08T14:12:06.611+0300][117.713s] GC(21) User=0.00s Sys=0.00s Real=0.01s
[2021-04-08T14:12:21.117+0300][132.219s] GC(22) Pause Young (Allocation Failure)
[2021-04-08T14:12:21.117+0300][132.219s] GC(22) Using 4 workers of 4 for evacuation
[2021-04-08T14:12:21.127+0300][132.230s] GC(22) ParNew: 106544K->20580K(109248K)
[2021-04-08T14:12:21.127+0300][132.230s] GC(22) CMS: 92452K->97169K(393216K)
[2021-04-08T14:12:21.127+0300][132.230s] GC(22) Metaspace: 58005K->58005K(1101824K)
[2021-04-08T14:12:21.127+0300][132.230s] GC(22) Pause Young (Allocation Failure) 194M->114M(490M) 10.339ms
[2021-04-08T14:12:21.127+0300][132.230s] GC(22) User=0.00s Sys=0.00s Real=0.01s
[2021-04-08T14:12:34.262+0300][145.364s] GC(23) Pause Young (Allocation Failure)
[2021-04-08T14:12:34.262+0300][145.364s] GC(23) Using 4 workers of 4 for evacuation
[2021-04-08T14:12:34.271+0300][145.373s] GC(23) ParNew: 108004K->21824K(109248K)
[2021-04-08T14:12:34.271+0300][145.373s] GC(23) CMS: 97169K->101812K(393216K)
[2021-04-08T14:12:34.271+0300][145.373s] GC(23) Metaspace: 58130K->58130K(1101824K)
[2021-04-08T14:12:34.271+0300][145.373s] GC(23) Pause Young (Allocation Failure) 200M->120M(490M) 9.503ms
[2021-04-08T14:12:34.271+0300][145.374s] GC(23) User=0.00s Sys=0.00s Real=0.01s
[2021-04-08T14:12:34.941+0300][146.043s] GC(24) Pause Young (Allocation Failure)
[2021-04-08T14:12:34.941+0300][146.043s] GC(24) Using 4 workers of 4 for evacuation
[2021-04-08T14:12:34.948+0300][146.050s] GC(24) ParNew: 109221K->19808K(109248K)
[2021-04-08T14:12:34.948+0300][146.050s] GC(24) CMS: 101812K->102271K(393216K)
[2021-04-08T14:12:34.948+0300][146.050s] GC(24) Metaspace: 58527K->58527K(1101824K)
[2021-04-08T14:12:34.948+0300][146.051s] GC(24) Pause Young (Allocation Failure) 206M->119M(490M) 7.209ms
[2021-04-08T14:12:34.948+0300][146.051s] GC(24) User=0.06s Sys=0.00s Real=0.01s
[2021-04-08T14:13:25.473+0300][196.583s] GC(25) Pause Young (Allocation Failure)
[2021-04-08T14:13:25.473+0300][196.583s] GC(25) Using 4 workers of 4 for evacuation
[2021-04-08T14:13:25.488+0300][196.592s] GC(25) ParNew: 107228K->15716K(109248K)
[2021-04-08T14:13:25.488+0300][196.592s] GC(25) CMS: 102271K->102332K(393216K)
[2021-04-08T14:13:25.488+0300][196.592s] GC(25) Metaspace: 58918K->58918K(1103872K)
[2021-04-08T14:13:25.488+0300][196.592s] GC(25) Pause Young (Allocation Failure) 204M->115M(490M) 8.607ms
[2021-04-08T14:13:25.488+0300][196.592s] GC(25) User=0.06s Sys=0.00s Real=0.01s
[2021-04-08T14:13:25.551+0300][196.660s] GC(26) Pause Young (Allocation Failure)
[2021-04-08T14:13:25.551+0300][196.660s] GC(26) Using 4 workers of 4 for evacuation
[2021-04-08T14:13:25.551+0300][196.668s] GC(26) ParNew: 103140K->14533K(109248K)
[2021-04-08T14:13:25.551+0300][196.668s] GC(26) CMS: 102332K->102635K(393216K)
[2021-04-08T14:13:25.551+0300][196.668s] GC(26) Metaspace: 58941K->58941K(1103872K)
[2021-04-08T14:13:25.551+0300][196.668s] GC(26) Pause Young (Allocation Failure) 200M->114M(490M) 7.763ms
[2021-04-08T14:13:25.551+0300][196.668s] GC(26) User=0.00s Sys=0.00s Real=0.00s
[2021-04-08T14:16:40.616+0300][391.729s] GC(27) Pause Young (Allocation Failure)
[2021-04-08T14:16:40.616+0300][391.729s] GC(27) Using 4 workers of 4 for evacuation
[2021-04-08T14:16:40.631+0300][391.741s] GC(27) ParNew: 101957K->21562K(109248K)
[2021-04-08T14:16:40.631+0300][391.741s] GC(27) CMS: 102635K->104701K(393216K)
[2021-04-08T14:16:40.631+0300][391.741s] GC(27) Metaspace: 59342K->59342K(1103872K)
[2021-04-08T14:16:40.631+0300][391.741s] GC(27) Pause Young (Allocation Failure) 199M->123M(490M) 12.186ms
[2021-04-08T14:16:40.631+0300][391.741s] GC(27) User=0.06s Sys=0.00s Real=0.02s
[2021-04-08T14:17:27.296+0300][438.407s] GC(28) Pause Young (Allocation Failure)
[2021-04-08T14:17:27.296+0300][438.407s] GC(28) Using 4 workers of 4 for evacuation
[2021-04-08T14:17:27.312+0300][438.419s] GC(28) ParNew: 108986K->21824K(109248K)
[2021-04-08T14:17:27.312+0300][438.419s] GC(28) CMS: 104701K->105672K(393216K)
[2021-04-08T14:17:27.312+0300][438.419s] GC(28) Metaspace: 59378K->59378K(1103872K)
[2021-04-08T14:17:27.312+0300][438.419s] GC(28) Pause Young (Allocation Failure) 208M->124M(490M) 11.730ms
[2021-04-08T14:17:27.312+0300][438.419s] GC(28) User=0.05s Sys=0.00s Real=0.02s
[2021-04-08T14:18:17.204+0300][488.313s] GC(29) Pause Young (Allocation Failure)
[2021-04-08T14:18:17.204+0300][488.313s] GC(29) Using 4 workers of 4 for evacuation
[2021-04-08T14:18:17.219+0300][488.322s] GC(29) ParNew: 109248K->21824K(109248K)
[2021-04-08T14:18:17.219+0300][488.322s] GC(29) CMS: 105672K->108450K(393216K)
[2021-04-08T14:18:17.219+0300][488.322s] GC(29) Metaspace: 59402K->59402K(1103872K)
[2021-04-08T14:18:17.219+0300][488.322s] GC(29) Pause Young (Allocation Failure) 209M->127M(490M) 9.511ms
[2021-04-08T14:18:17.219+0300][488.322s] GC(29) User=0.02s Sys=0.00s Real=0.02s
[2021-04-08T14:18:31.586+0300][502.703s] GC(30) Pause Young (Allocation Failure)
[2021-04-08T14:18:31.586+0300][502.703s] GC(30) Using 4 workers of 4 for evacuation
[2021-04-08T14:18:31.601+0300][502.715s] GC(30) ParNew: 109248K->21824K(109248K)
[2021-04-08T14:18:31.601+0300][502.715s] GC(30) CMS: 108450K->112339K(393216K)
[2021-04-08T14:18:31.601+0300][502.715s] GC(30) Metaspace: 59450K->59450K(1103872K)
[2021-04-08T14:18:31.601+0300][502.715s] GC(30) Pause Young (Allocation Failure) 212M->131M(490M) 12.459ms
[2021-04-08T14:18:31.601+0300][502.715s] GC(30) User=0.06s Sys=0.00s Real=0.02s
[2021-04-08T14:30:20.600+0300][1211.703s] Heap
[2021-04-08T14:30:20.600+0300][1211.703s]  par new generation   total 109248K, used 98684K [0x00000000e0000000, 0x00000000e8000000, 0x00000000e8000000)
[2021-04-08T14:30:20.600+0300][1211.703s]   eden space 87424K,  87% used [0x00000000e0000000, 0x00000000e4b0f3b8, 0x00000000e5560000)
[2021-04-08T14:30:20.600+0300][1211.703s]   from space 21824K, 100% used [0x00000000e6ab0000, 0x00000000e8000000, 0x00000000e8000000)
[2021-04-08T14:30:20.600+0300][1211.703s]   to   space 21824K,   0% used [0x00000000e5560000, 0x00000000e5560000, 0x00000000e6ab0000)
[2021-04-08T14:30:20.600+0300][1211.703s]  concurrent mark-sweep generation total 393216K, used 112339K [0x00000000e8000000, 0x0000000100000000, 0x0000000100000000)
[2021-04-08T14:30:20.600+0300][1211.703s]  Metaspace       used 60458K, capacity 61783K, committed 61816K, reserved 1103872K
[2021-04-08T14:30:20.600+0300][1211.703s]   class space    used 6651K, capacity 7197K, committed 7216K, reserved 1048576K
