[2021-04-07T22:19:48.615+0300][0.006s] Using Concurrent Mark Sweep
[2021-04-07T22:19:48.615+0300][0.006s] Heap address: 0x00000000e0000000, size: 512 MB, Compressed Oops mode: 32-bit
[2021-04-07T22:19:50.015+0300][1.402s] GC(0) Pause Young (Allocation Failure)
[2021-04-07T22:19:50.015+0300][1.402s] GC(0) Using 4 workers of 4 for evacuation
[2021-04-07T22:19:50.020+0300][1.408s] GC(0) ParNew: 87424K->9606K(109248K)
[2021-04-07T22:19:50.020+0300][1.408s] GC(0) CMS: 0K->0K(393216K)
[2021-04-07T22:19:50.020+0300][1.408s] GC(0) Metaspace: 22508K->22508K(1071104K)
[2021-04-07T22:19:50.020+0300][1.408s] GC(0) Pause Young (Allocation Failure) 85M->9M(490M) 6.665ms
[2021-04-07T22:19:50.020+0300][1.408s] GC(0) User=0.00s Sys=0.00s Real=0.00s
[2021-04-07T22:19:50.020+0300][1.408s] GC(1) Pause Initial Mark
[2021-04-07T22:19:50.020+0300][1.410s] GC(1) Pause Initial Mark 12M->12M(490M) 1.318ms
[2021-04-07T22:19:50.020+0300][1.410s] GC(1) User=0.00s Sys=0.00s Real=0.00s
[2021-04-07T22:19:50.020+0300][1.410s] GC(1) Concurrent Mark
[2021-04-07T22:19:50.020+0300][1.410s] GC(1) Using 4 workers of 4 for marking
[2021-04-07T22:19:50.025+0300][1.412s] GC(1) Concurrent Mark 1.769ms
[2021-04-07T22:19:50.025+0300][1.412s] GC(1) User=0.02s Sys=0.00s Real=0.01s
[2021-04-07T22:19:50.025+0300][1.412s] GC(1) Concurrent Preclean
[2021-04-07T22:19:50.025+0300][1.412s] GC(1) Concurrent Preclean 0.655ms
[2021-04-07T22:19:50.025+0300][1.412s] GC(1) User=0.00s Sys=0.00s Real=0.00s
[2021-04-07T22:19:50.025+0300][1.412s] GC(1) Concurrent Abortable Preclean
[2021-04-07T22:19:50.815+0300][2.206s] GC(2) Pause Young (Allocation Failure)
[2021-04-07T22:19:50.815+0300][2.206s] GC(2) Using 4 workers of 4 for evacuation
[2021-04-07T22:19:50.825+0300][2.213s] GC(2) ParNew: 97030K->14227K(109248K)
[2021-04-07T22:19:50.825+0300][2.213s] GC(2) CMS: 0K->0K(393216K)
[2021-04-07T22:19:50.825+0300][2.213s] GC(2) Metaspace: 28451K->28451K(1075200K)
[2021-04-07T22:19:50.825+0300][2.213s] GC(2) Pause Young (Allocation Failure) 94M->13M(490M) 6.841ms
[2021-04-07T22:19:50.825+0300][2.213s] GC(2) User=0.03s Sys=0.02s Real=0.01s
[2021-04-07T22:19:56.132+0300][7.522s] GC(1) Concurrent Abortable Preclean 6109.334ms
[2021-04-07T22:19:56.132+0300][7.522s] GC(1) User=5.03s Sys=0.14s Real=6.11s
[2021-04-07T22:19:56.132+0300][7.522s] GC(1) Pause Remark
[2021-04-07T22:19:56.132+0300][7.522s] GC(3) Pause Young (CMS Final Remark)
[2021-04-07T22:19:56.132+0300][7.522s] GC(3) Using 4 workers of 4 for evacuation
[2021-04-07T22:19:56.142+0300][7.529s] GC(3) ParNew: 42342K->16558K(109248K)
[2021-04-07T22:19:56.142+0300][7.529s] GC(3) CMS: 0K->0K(393216K)
[2021-04-07T22:19:56.142+0300][7.529s] GC(3) Metaspace: 31722K->31722K(1079296K)
[2021-04-07T22:19:56.142+0300][7.529s] GC(3) Pause Young (CMS Final Remark) 41M->16M(490M) 6.735ms
[2021-04-07T22:19:56.142+0300][7.529s] GC(3) User=0.06s Sys=0.00s Real=0.01s
[2021-04-07T22:19:56.147+0300][7.535s] GC(1) Pause Remark 41M->16M(490M) 13.115ms
[2021-04-07T22:19:56.147+0300][7.535s] GC(1) User=0.06s Sys=0.00s Real=0.02s
[2021-04-07T22:19:56.147+0300][7.535s] GC(1) Concurrent Sweep
[2021-04-07T22:19:56.147+0300][7.535s] GC(1) Concurrent Sweep 0.035ms
[2021-04-07T22:19:56.147+0300][7.535s] GC(1) User=0.00s Sys=0.00s Real=0.00s
[2021-04-07T22:19:56.147+0300][7.535s] GC(1) Concurrent Reset
[2021-04-07T22:19:56.147+0300][7.537s] GC(1) Concurrent Reset 2.114ms
[2021-04-07T22:19:56.147+0300][7.537s] GC(1) User=0.00s Sys=0.00s Real=0.00s
[2021-04-07T22:19:56.147+0300][7.537s] GC(1) Old: 0K->0K(393216K)
[2021-04-07T22:20:00.546+0300][11.933s] GC(4) Pause Young (Allocation Failure)
[2021-04-07T22:20:00.546+0300][11.933s] GC(4) Using 4 workers of 4 for evacuation
[2021-04-07T22:20:00.556+0300][11.944s] GC(4) ParNew: 103982K->19428K(109248K)
[2021-04-07T22:20:00.556+0300][11.944s] GC(4) CMS: 0K->0K(393216K)
[2021-04-07T22:20:00.556+0300][11.944s] GC(4) Metaspace: 37223K->37223K(1083392K)
[2021-04-07T22:20:00.556+0300][11.944s] GC(4) Pause Young (Allocation Failure) 101M->18M(490M) 11.060ms
[2021-04-07T22:20:00.556+0300][11.944s] GC(4) User=0.06s Sys=0.00s Real=0.01s
[2021-04-07T22:20:00.701+0300][12.090s] GC(5) Pause Young (Allocation Failure)
[2021-04-07T22:20:00.701+0300][12.090s] GC(5) Using 4 workers of 4 for evacuation
[2021-04-07T22:20:00.711+0300][12.099s] GC(5) ParNew: 106852K->21824K(109248K)
[2021-04-07T22:20:00.711+0300][12.099s] GC(5) CMS: 0K->0K(393216K)
[2021-04-07T22:20:00.711+0300][12.099s] GC(5) Metaspace: 38211K->38211K(1083392K)
[2021-04-07T22:20:00.711+0300][12.099s] GC(5) Pause Young (Allocation Failure) 104M->21M(490M) 9.284ms
[2021-04-07T22:20:00.711+0300][12.099s] GC(5) User=0.00s Sys=0.00s Real=0.01s
[2021-04-07T22:20:00.786+0300][12.175s] GC(6) Pause Young (Allocation Failure)
[2021-04-07T22:20:00.786+0300][12.175s] GC(6) Using 4 workers of 4 for evacuation
[2021-04-07T22:20:00.796+0300][12.183s] GC(6) ParNew: 109248K->21824K(109248K)
[2021-04-07T22:20:00.796+0300][12.183s] GC(6) CMS: 0K->0K(393216K)
[2021-04-07T22:20:00.796+0300][12.183s] GC(6) Metaspace: 38369K->38369K(1085440K)
[2021-04-07T22:20:00.796+0300][12.183s] GC(6) Pause Young (Allocation Failure) 106M->21M(490M) 8.699ms
[2021-04-07T22:20:00.796+0300][12.183s] GC(6) User=0.06s Sys=0.00s Real=0.01s
[2021-04-07T22:20:00.861+0300][12.251s] GC(7) Pause Young (Allocation Failure)
[2021-04-07T22:20:00.861+0300][12.251s] GC(7) Using 4 workers of 4 for evacuation
[2021-04-07T22:20:00.871+0300][12.260s] GC(7) ParNew: 109248K->21252K(109248K)
[2021-04-07T22:20:00.871+0300][12.260s] GC(7) CMS: 0K->0K(393216K)
[2021-04-07T22:20:00.871+0300][12.260s] GC(7) Metaspace: 38570K->38570K(1085440K)
[2021-04-07T22:20:00.871+0300][12.260s] GC(7) Pause Young (Allocation Failure) 106M->20M(490M) 8.882ms
[2021-04-07T22:20:00.871+0300][12.260s] GC(7) User=0.06s Sys=0.00s Real=0.01s
[2021-04-07T22:20:01.347+0300][12.734s] GC(8) Pause Young (Allocation Failure)
[2021-04-07T22:20:01.347+0300][12.734s] GC(8) Using 4 workers of 4 for evacuation
[2021-04-07T22:20:01.369+0300][12.756s] GC(8) ParNew: 108676K->21824K(109248K)
[2021-04-07T22:20:01.369+0300][12.756s] GC(8) CMS: 0K->2713K(393216K)
[2021-04-07T22:20:01.369+0300][12.756s] GC(8) Metaspace: 43584K->43584K(1089536K)
[2021-04-07T22:20:01.369+0300][12.756s] GC(8) Pause Young (Allocation Failure) 106M->23M(490M) 21.862ms
[2021-04-07T22:20:01.369+0300][12.756s] GC(8) User=0.13s Sys=0.00s Real=0.02s
[2021-04-07T22:20:01.973+0300][13.360s] GC(9) Pause Young (Allocation Failure)
[2021-04-07T22:20:01.973+0300][13.360s] GC(9) Using 4 workers of 4 for evacuation
[2021-04-07T22:20:01.993+0300][13.380s] GC(9) ParNew: 109248K->21824K(109248K)
[2021-04-07T22:20:01.993+0300][13.380s] GC(9) CMS: 2713K->12248K(393216K)
[2021-04-07T22:20:01.993+0300][13.381s] GC(9) Metaspace: 46742K->46742K(1091584K)
[2021-04-07T22:20:01.993+0300][13.381s] GC(9) Pause Young (Allocation Failure) 109M->33M(490M) 20.788ms
[2021-04-07T22:20:01.993+0300][13.381s] GC(9) User=0.09s Sys=0.02s Real=0.02s
[2021-04-07T22:20:11.064+0300][22.454s] GC(10) Pause Young (Allocation Failure)
[2021-04-07T22:20:11.064+0300][22.454s] GC(10) Using 4 workers of 4 for evacuation
[2021-04-07T22:20:11.089+0300][22.479s] GC(10) ParNew: 109248K->21824K(109248K)
[2021-04-07T22:20:11.089+0300][22.479s] GC(10) CMS: 12248K->21302K(393216K)
[2021-04-07T22:20:11.089+0300][22.479s] GC(10) Metaspace: 51067K->51067K(1095680K)
[2021-04-07T22:20:11.089+0300][22.479s] GC(10) Pause Young (Allocation Failure) 118M->42M(490M) 24.961ms
[2021-04-07T22:20:11.089+0300][22.479s] GC(10) User=0.13s Sys=0.00s Real=0.03s
[2021-04-07T22:26:38.851+0300][410.241s] GC(11) Pause Young (Allocation Failure)
[2021-04-07T22:26:38.851+0300][410.241s] GC(11) Using 4 workers of 4 for evacuation
[2021-04-07T22:26:38.876+0300][410.266s] GC(11) ParNew: 109248K->21824K(109248K)
[2021-04-07T22:26:38.876+0300][410.266s] GC(11) CMS: 21302K->29023K(393216K)
[2021-04-07T22:26:38.876+0300][410.266s] GC(11) Metaspace: 53703K->53703K(1097728K)
[2021-04-07T22:26:38.876+0300][410.266s] GC(11) Pause Young (Allocation Failure) 127M->49M(490M) 25.329ms
[2021-04-07T22:26:38.876+0300][410.266s] GC(11) User=0.13s Sys=0.00s Real=0.02s
[2021-04-07T22:26:38.876+0300][410.267s] GC(12) Pause Initial Mark
[2021-04-07T22:26:38.881+0300][410.272s] GC(12) Pause Initial Mark 49M->49M(490M) 4.698ms
[2021-04-07T22:26:38.881+0300][410.272s] GC(12) User=0.00s Sys=0.00s Real=0.01s
[2021-04-07T22:26:38.881+0300][410.272s] GC(12) Concurrent Mark
[2021-04-07T22:26:38.881+0300][410.272s] GC(12) Using 4 workers of 4 for marking
[2021-04-07T22:26:38.896+0300][410.285s] GC(12) Concurrent Mark 12.991ms
[2021-04-07T22:26:38.896+0300][410.285s] GC(12) User=0.06s Sys=0.00s Real=0.01s
[2021-04-07T22:26:38.896+0300][410.285s] GC(12) Concurrent Preclean
[2021-04-07T22:26:38.896+0300][410.286s] GC(12) Concurrent Preclean 0.781ms
[2021-04-07T22:26:38.896+0300][410.286s] GC(12) User=0.00s Sys=0.00s Real=0.00s
[2021-04-07T22:26:38.896+0300][410.286s] GC(12) Pause Remark
[2021-04-07T22:26:38.896+0300][410.286s] GC(13) Pause Young (CMS Final Remark)
[2021-04-07T22:26:38.896+0300][410.286s] GC(13) Using 4 workers of 4 for evacuation
[2021-04-07T22:26:38.911+0300][410.301s] GC(13) ParNew: 22291K->19644K(109248K)
[2021-04-07T22:26:38.911+0300][410.301s] GC(13) CMS: 29023K->33869K(393216K)
[2021-04-07T22:26:38.911+0300][410.301s] GC(13) Metaspace: 53704K->53704K(1097728K)
[2021-04-07T22:26:38.911+0300][410.301s] GC(13) Pause Young (CMS Final Remark) 50M->52M(490M) 15.715ms
[2021-04-07T22:26:38.911+0300][410.301s] GC(13) User=0.06s Sys=0.00s Real=0.02s
[2021-04-07T22:26:38.926+0300][410.317s] GC(12) Pause Remark 50M->52M(490M) 30.898ms
[2021-04-07T22:26:38.926+0300][410.317s] GC(12) User=0.13s Sys=0.00s Real=0.03s
[2021-04-07T22:26:38.926+0300][410.317s] GC(12) Concurrent Sweep
[2021-04-07T22:26:38.941+0300][410.330s] GC(12) Concurrent Sweep 12.909ms
[2021-04-07T22:26:38.941+0300][410.330s] GC(12) User=0.06s Sys=0.00s Real=0.01s
[2021-04-07T22:26:38.941+0300][410.330s] GC(12) Concurrent Reset
[2021-04-07T22:26:38.946+0300][410.337s] GC(12) Concurrent Reset 6.783ms
[2021-04-07T22:26:38.946+0300][410.337s] GC(12) User=0.02s Sys=0.02s Real=0.01s
[2021-04-07T22:26:38.946+0300][410.337s] GC(12) Old: 29023K->33264K(393216K)
[2021-04-07T22:26:39.036+0300][410.422s] GC(14) Pause Young (Allocation Failure)
[2021-04-07T22:26:39.036+0300][410.422s] GC(14) Using 4 workers of 4 for evacuation
[2021-04-07T22:26:39.041+0300][410.432s] GC(14) ParNew: 107068K->21824K(109248K)
[2021-04-07T22:26:39.046+0300][410.432s] GC(14) CMS: 33264K->33264K(393216K)
[2021-04-07T22:26:39.046+0300][410.432s] GC(14) Metaspace: 53708K->53708K(1097728K)
[2021-04-07T22:26:39.046+0300][410.432s] GC(14) Pause Young (Allocation Failure) 137M->53M(490M) 9.904ms
[2021-04-07T22:26:39.046+0300][410.432s] GC(14) User=0.06s Sys=0.00s Real=0.01s
[2021-04-07T22:26:48.356+0300][419.745s] GC(15) Pause Young (Allocation Failure)
[2021-04-07T22:26:48.356+0300][419.745s] GC(15) Using 4 workers of 4 for evacuation
[2021-04-07T22:26:48.371+0300][419.758s] GC(15) ParNew: 109248K->21824K(109248K)
[2021-04-07T22:26:48.371+0300][419.758s] GC(15) CMS: 33264K->33264K(393216K)
[2021-04-07T22:26:48.371+0300][419.758s] GC(15) Metaspace: 54632K->54632K(1099776K)
[2021-04-07T22:26:48.371+0300][419.758s] GC(15) Pause Young (Allocation Failure) 139M->53M(490M) 13.057ms
[2021-04-07T22:26:48.371+0300][419.758s] GC(15) User=0.03s Sys=0.03s Real=0.02s
[2021-04-07T22:26:50.288+0300][421.675s] GC(16) Pause Young (Allocation Failure)
[2021-04-07T22:26:50.288+0300][421.675s] GC(16) Using 4 workers of 4 for evacuation
[2021-04-07T22:26:50.298+0300][421.687s] GC(16) ParNew: 109248K->21824K(109248K)
[2021-04-07T22:26:50.298+0300][421.687s] GC(16) CMS: 33264K->34414K(393216K)
[2021-04-07T22:26:50.298+0300][421.687s] GC(16) Metaspace: 55211K->55211K(1099776K)
[2021-04-07T22:26:50.298+0300][421.687s] GC(16) Pause Young (Allocation Failure) 139M->54M(490M) 12.170ms
[2021-04-07T22:26:50.298+0300][421.687s] GC(16) User=0.06s Sys=0.00s Real=0.01s
[2021-04-07T22:26:50.373+0300][421.759s] GC(17) Pause Young (Allocation Failure)
[2021-04-07T22:26:50.373+0300][421.759s] GC(17) Using 4 workers of 4 for evacuation
[2021-04-07T22:26:50.383+0300][421.771s] GC(17) ParNew: 109248K->21824K(109248K)
[2021-04-07T22:26:50.383+0300][421.771s] GC(17) CMS: 34414K->34470K(393216K)
[2021-04-07T22:26:50.383+0300][421.771s] GC(17) Metaspace: 55238K->55238K(1099776K)
[2021-04-07T22:26:50.383+0300][421.771s] GC(17) Pause Young (Allocation Failure) 140M->54M(490M) 11.525ms
[2021-04-07T22:26:50.383+0300][421.771s] GC(17) User=0.00s Sys=0.00s Real=0.01s
[2021-04-07T22:31:01.790+0300][673.179s] GC(18) Pause Young (Allocation Failure)
[2021-04-07T22:31:01.790+0300][673.179s] GC(18) Using 4 workers of 4 for evacuation
[2021-04-07T22:31:01.805+0300][673.193s] GC(18) ParNew: 109248K->21824K(109248K)
[2021-04-07T22:31:01.805+0300][673.193s] GC(18) CMS: 34470K->35776K(393216K)
[2021-04-07T22:31:01.805+0300][673.193s] GC(18) Metaspace: 55555K->55555K(1099776K)
[2021-04-07T22:31:01.805+0300][673.193s] GC(18) Pause Young (Allocation Failure) 140M->56M(490M) 13.725ms
[2021-04-07T22:31:01.805+0300][673.193s] GC(18) User=0.00s Sys=0.00s Real=0.02s
[2021-04-07T22:31:01.855+0300][673.246s] GC(19) Pause Young (Allocation Failure)
[2021-04-07T22:31:01.855+0300][673.246s] GC(19) Using 4 workers of 4 for evacuation
[2021-04-07T22:31:01.875+0300][673.261s] GC(19) ParNew: 109248K->21824K(109248K)
[2021-04-07T22:31:01.875+0300][673.261s] GC(19) CMS: 35776K->44776K(393216K)
[2021-04-07T22:31:01.875+0300][673.261s] GC(19) Metaspace: 55558K->55558K(1099776K)
[2021-04-07T22:31:01.875+0300][673.261s] GC(19) Pause Young (Allocation Failure) 141M->65M(490M) 15.276ms
[2021-04-07T22:31:01.875+0300][673.261s] GC(19) User=0.06s Sys=0.00s Real=0.02s
[2021-04-07T22:31:16.599+0300][687.985s] GC(20) Pause Young (Allocation Failure)
[2021-04-07T22:31:16.599+0300][687.985s] GC(20) Using 4 workers of 4 for evacuation
[2021-04-07T22:31:16.613+0300][687.999s] GC(20) ParNew: 104754K->21824K(109248K)
[2021-04-07T22:31:16.613+0300][687.999s] GC(20) CMS: 44776K->55463K(393216K)
[2021-04-07T22:31:16.613+0300][687.999s] GC(20) Metaspace: 56332K->56332K(1099776K)
[2021-04-07T22:31:16.613+0300][687.999s] GC(20) Pause Young (Allocation Failure) 146M->75M(490M) 13.913ms
[2021-04-07T22:31:16.613+0300][687.999s] GC(20) User=0.06s Sys=0.00s Real=0.01s
[2021-04-07T22:31:17.928+0300][689.315s] GC(21) Pause Young (Allocation Failure)
[2021-04-07T22:31:17.928+0300][689.315s] GC(21) Using 4 workers of 4 for evacuation
[2021-04-07T22:31:17.950+0300][689.336s] GC(21) ParNew: 109248K->21824K(109248K)
[2021-04-07T22:31:17.950+0300][689.336s] GC(21) CMS: 55463K->73677K(393216K)
[2021-04-07T22:31:17.950+0300][689.336s] GC(21) Metaspace: 57565K->57565K(1101824K)
[2021-04-07T22:31:17.950+0300][689.336s] GC(21) Pause Young (Allocation Failure) 160M->93M(490M) 21.392ms
[2021-04-07T22:31:17.950+0300][689.336s] GC(21) User=0.11s Sys=0.02s Real=0.02s
[2021-04-07T22:31:31.891+0300][703.277s] GC(22) Pause Young (Allocation Failure)
[2021-04-07T22:31:31.891+0300][703.277s] GC(22) Using 4 workers of 4 for evacuation
[2021-04-07T22:31:31.903+0300][703.290s] GC(22) ParNew: 109248K->21824K(109248K)
[2021-04-07T22:31:31.903+0300][703.290s] GC(22) CMS: 73677K->90946K(393216K)
[2021-04-07T22:31:31.903+0300][703.290s] GC(22) Metaspace: 57864K->57864K(1101824K)
[2021-04-07T22:31:31.903+0300][703.290s] GC(22) Pause Young (Allocation Failure) 178M->110M(490M) 12.778ms
[2021-04-07T22:31:31.903+0300][703.290s] GC(22) User=0.03s Sys=0.03s Real=0.01s
[2021-04-07T22:31:32.108+0300][703.495s] GC(23) Pause Young (Allocation Failure)
[2021-04-07T22:31:32.108+0300][703.495s] GC(23) Using 4 workers of 4 for evacuation
[2021-04-07T22:31:32.113+0300][703.500s] GC(23) ParNew: 108847K->14309K(109248K)
[2021-04-07T22:31:32.113+0300][703.500s] GC(23) CMS: 90946K->90946K(393216K)
[2021-04-07T22:31:32.113+0300][703.500s] GC(23) Metaspace: 58479K->58479K(1101824K)
[2021-04-07T22:31:32.113+0300][703.500s] GC(23) Pause Young (Allocation Failure) 195M->102M(490M) 5.081ms
[2021-04-07T22:31:32.113+0300][703.500s] GC(23) User=0.00s Sys=0.00s Real=0.00s
[2021-04-07T22:31:52.140+0300][723.530s] GC(24) Pause Young (Allocation Failure)
[2021-04-07T22:31:52.140+0300][723.530s] GC(24) Using 4 workers of 4 for evacuation
[2021-04-07T22:31:52.145+0300][723.535s] GC(24) ParNew: 101733K->14138K(109248K)
[2021-04-07T22:31:52.145+0300][723.535s] GC(24) CMS: 90946K->90946K(393216K)
[2021-04-07T22:31:52.145+0300][723.535s] GC(24) Metaspace: 58624K->58624K(1101824K)
[2021-04-07T22:31:52.145+0300][723.535s] GC(24) Pause Young (Allocation Failure) 188M->102M(490M) 5.170ms
[2021-04-07T22:31:52.145+0300][723.535s] GC(24) User=0.00s Sys=0.00s Real=0.00s
[2021-04-07T22:31:52.290+0300][723.679s] GC(25) Pause Young (Allocation Failure)
[2021-04-07T22:31:52.290+0300][723.679s] GC(25) Using 4 workers of 4 for evacuation
[2021-04-07T22:31:52.295+0300][723.684s] GC(25) ParNew: 101562K->19484K(109248K)
[2021-04-07T22:31:52.295+0300][723.684s] GC(25) CMS: 90946K->90946K(393216K)
[2021-04-07T22:31:52.295+0300][723.684s] GC(25) Metaspace: 58692K->58692K(1103872K)
[2021-04-07T22:31:52.295+0300][723.684s] GC(25) Pause Young (Allocation Failure) 187M->107M(490M) 5.550ms
[2021-04-07T22:31:52.295+0300][723.684s] GC(25) User=0.00s Sys=0.00s Real=0.01s
[2021-04-07T22:31:52.395+0300][723.785s] GC(26) Pause Young (Allocation Failure)
[2021-04-07T22:31:52.395+0300][723.785s] GC(26) Using 4 workers of 4 for evacuation
[2021-04-07T22:31:52.400+0300][723.790s] GC(26) ParNew: 106908K->16573K(109248K)
[2021-04-07T22:31:52.400+0300][723.790s] GC(26) CMS: 90946K->90946K(393216K)
[2021-04-07T22:31:52.400+0300][723.790s] GC(26) Metaspace: 58732K->58732K(1103872K)
[2021-04-07T22:31:52.400+0300][723.790s] GC(26) Pause Young (Allocation Failure) 193M->104M(490M) 5.736ms
[2021-04-07T22:31:52.400+0300][723.790s] GC(26) User=0.06s Sys=0.00s Real=0.01s
[2021-04-07T22:32:01.477+0300][732.866s] GC(27) Pause Young (Allocation Failure)
[2021-04-07T22:32:01.477+0300][732.866s] GC(27) Using 4 workers of 4 for evacuation
[2021-04-07T22:32:01.482+0300][732.873s] GC(27) ParNew: 103997K->16318K(109248K)
[2021-04-07T22:32:01.482+0300][732.873s] GC(27) CMS: 90946K->90946K(393216K)
[2021-04-07T22:32:01.482+0300][732.873s] GC(27) Metaspace: 58884K->58884K(1103872K)
[2021-04-07T22:32:01.482+0300][732.873s] GC(27) Pause Young (Allocation Failure) 190M->104M(490M) 7.051ms
[2021-04-07T22:32:01.482+0300][732.873s] GC(27) User=0.00s Sys=0.00s Real=0.01s
[2021-04-07T22:32:08.462+0300][739.849s] GC(28) Pause Young (Allocation Failure)
[2021-04-07T22:32:08.462+0300][739.849s] GC(28) Using 4 workers of 4 for evacuation
[2021-04-07T22:32:08.475+0300][739.862s] GC(28) ParNew: 103742K->21824K(109248K)
[2021-04-07T22:32:08.475+0300][739.862s] GC(28) CMS: 90946K->100256K(393216K)
[2021-04-07T22:32:08.475+0300][739.862s] GC(28) Metaspace: 59048K->59048K(1103872K)
[2021-04-07T22:32:08.475+0300][739.862s] GC(28) Pause Young (Allocation Failure) 190M->119M(490M) 13.214ms
[2021-04-07T22:32:08.475+0300][739.862s] GC(28) User=0.00s Sys=0.00s Real=0.01s
[2021-04-07T22:32:37.074+0300][768.460s] GC(29) Pause Young (Allocation Failure)
[2021-04-07T22:32:37.074+0300][768.460s] GC(29) Using 4 workers of 4 for evacuation
[2021-04-07T22:32:37.085+0300][768.472s] GC(29) ParNew: 109247K->21824K(109248K)
[2021-04-07T22:32:37.085+0300][768.472s] GC(29) CMS: 100256K->106632K(393216K)
[2021-04-07T22:32:37.085+0300][768.472s] GC(29) Metaspace: 59069K->59069K(1103872K)
[2021-04-07T22:32:37.085+0300][768.472s] GC(29) Pause Young (Allocation Failure) 204M->125M(490M) 11.945ms
[2021-04-07T22:32:37.085+0300][768.472s] GC(29) User=0.00s Sys=0.00s Real=0.01s
[2021-04-07T22:32:37.237+0300][768.624s] GC(30) Pause Young (Allocation Failure)
[2021-04-07T22:32:37.237+0300][768.624s] GC(30) Using 4 workers of 4 for evacuation
[2021-04-07T22:32:37.247+0300][768.633s] GC(30) ParNew: 109248K->21824K(109248K)
[2021-04-07T22:32:37.247+0300][768.633s] GC(30) CMS: 106632K->110202K(393216K)
[2021-04-07T22:32:37.247+0300][768.633s] GC(30) Metaspace: 59110K->59110K(1103872K)
[2021-04-07T22:32:37.247+0300][768.633s] GC(30) Pause Young (Allocation Failure) 210M->128M(490M) 9.470ms
[2021-04-07T22:32:37.247+0300][768.633s] GC(30) User=0.06s Sys=0.00s Real=0.01s
[2021-04-07T22:32:52.954+0300][784.340s] GC(31) Pause Young (Allocation Failure)
[2021-04-07T22:32:52.954+0300][784.340s] GC(31) Using 4 workers of 4 for evacuation
[2021-04-07T22:32:52.959+0300][784.348s] GC(31) ParNew: 109248K->16493K(109248K)
[2021-04-07T22:32:52.959+0300][784.348s] GC(31) CMS: 110202K->110373K(393216K)
[2021-04-07T22:32:52.959+0300][784.348s] GC(31) Metaspace: 59189K->59189K(1103872K)
[2021-04-07T22:32:52.959+0300][784.348s] GC(31) Pause Young (Allocation Failure) 214M->123M(490M) 7.974ms
[2021-04-07T22:32:52.959+0300][784.348s] GC(31) User=0.00s Sys=0.00s Real=0.01s
[2021-04-07T22:33:58.526+0300][849.912s] GC(32) Pause Young (Allocation Failure)
[2021-04-07T22:33:58.526+0300][849.912s] GC(32) Using 4 workers of 4 for evacuation
[2021-04-07T22:33:58.538+0300][849.924s] GC(32) ParNew: 103917K->21824K(109248K)
[2021-04-07T22:33:58.538+0300][849.924s] GC(32) CMS: 110373K->116161K(393216K)
[2021-04-07T22:33:58.538+0300][849.924s] GC(32) Metaspace: 59237K->59237K(1103872K)
[2021-04-07T22:33:58.538+0300][849.924s] GC(32) Pause Young (Allocation Failure) 209M->134M(490M) 11.603ms
[2021-04-07T22:33:58.538+0300][849.924s] GC(32) User=0.00s Sys=0.00s Real=0.01s
[2021-04-07T22:33:58.703+0300][850.089s] GC(33) Pause Young (Allocation Failure)
[2021-04-07T22:33:58.703+0300][850.090s] GC(33) Using 4 workers of 4 for evacuation
[2021-04-07T22:33:58.713+0300][850.100s] GC(33) ParNew: 109219K->21824K(109248K)
[2021-04-07T22:33:58.713+0300][850.100s] GC(33) CMS: 116161K->119115K(393216K)
[2021-04-07T22:33:58.713+0300][850.100s] GC(33) Metaspace: 59257K->59257K(1103872K)
[2021-04-07T22:33:58.713+0300][850.100s] GC(33) Pause Young (Allocation Failure) 220M->137M(490M) 10.513ms
[2021-04-07T22:33:58.713+0300][850.100s] GC(33) User=0.06s Sys=0.00s Real=0.01s
[2021-04-07T22:33:58.824+0300][850.211s] GC(34) Pause Young (Allocation Failure)
[2021-04-07T22:33:58.824+0300][850.211s] GC(34) Using 4 workers of 4 for evacuation
[2021-04-07T22:33:58.832+0300][850.219s] GC(34) ParNew: 109034K->19900K(109248K)
[2021-04-07T22:33:58.832+0300][850.219s] GC(34) CMS: 119115K->121884K(393216K)
[2021-04-07T22:33:58.832+0300][850.219s] GC(34) Metaspace: 59272K->59272K(1103872K)
[2021-04-07T22:33:58.832+0300][850.219s] GC(34) Pause Young (Allocation Failure) 222M->138M(490M) 8.277ms
[2021-04-07T22:33:58.832+0300][850.219s] GC(34) User=0.00s Sys=0.00s Real=0.01s
[2021-04-07T22:33:59.146+0300][850.533s] GC(35) Pause Young (Allocation Failure)
[2021-04-07T22:33:59.146+0300][850.533s] GC(35) Using 4 workers of 4 for evacuation
[2021-04-07T22:33:59.152+0300][850.538s] GC(35) ParNew: 107324K->21222K(109248K)
[2021-04-07T22:33:59.152+0300][850.538s] GC(35) CMS: 121884K->121884K(393216K)
[2021-04-07T22:33:59.152+0300][850.538s] GC(35) Metaspace: 59515K->59515K(1103872K)
[2021-04-07T22:33:59.152+0300][850.538s] GC(35) Pause Young (Allocation Failure) 223M->139M(490M) 5.446ms
[2021-04-07T22:33:59.152+0300][850.538s] GC(35) User=0.06s Sys=0.00s Real=0.01s
[2021-04-07T22:35:00.526+0300][911.913s] GC(36) Pause Young (Allocation Failure)
[2021-04-07T22:35:00.526+0300][911.913s] GC(36) Using 4 workers of 4 for evacuation
[2021-04-07T22:35:00.531+0300][911.918s] GC(36) ParNew: 108646K->18297K(109248K)
[2021-04-07T22:35:00.531+0300][911.918s] GC(36) CMS: 121884K->121884K(393216K)
[2021-04-07T22:35:00.531+0300][911.918s] GC(36) Metaspace: 59774K->59774K(1103872K)
[2021-04-07T22:35:00.531+0300][911.918s] GC(36) Pause Young (Allocation Failure) 225M->136M(490M) 5.523ms
[2021-04-07T22:35:00.531+0300][911.918s] GC(36) User=0.00s Sys=0.00s Real=0.00s
[2021-04-07T22:37:36.020+0300][1067.410s] GC(37) Pause Young (Allocation Failure)
[2021-04-07T22:37:36.020+0300][1067.410s] GC(37) Using 4 workers of 4 for evacuation
[2021-04-07T22:37:36.030+0300][1067.420s] GC(37) ParNew: 105712K->20444K(109248K)
[2021-04-07T22:37:36.030+0300][1067.420s] GC(37) CMS: 121884K->124928K(393216K)
[2021-04-07T22:37:36.030+0300][1067.420s] GC(37) Metaspace: 59947K->59947K(1103872K)
[2021-04-07T22:37:36.030+0300][1067.420s] GC(37) Pause Young (Allocation Failure) 222M->141M(490M) 9.299ms
[2021-04-07T22:37:36.030+0300][1067.420s] GC(37) User=0.06s Sys=0.00s Real=0.01s
[2021-04-07T22:37:36.100+0300][1067.490s] GC(38) Pause Young (Allocation Failure)
[2021-04-07T22:37:36.100+0300][1067.490s] GC(38) Using 4 workers of 4 for evacuation
[2021-04-07T22:37:36.105+0300][1067.495s] GC(38) ParNew: 107868K->19406K(109248K)
[2021-04-07T22:37:36.105+0300][1067.496s] GC(38) CMS: 124928K->125377K(393216K)
[2021-04-07T22:37:36.105+0300][1067.496s] GC(38) Metaspace: 59955K->59955K(1103872K)
[2021-04-07T22:37:36.105+0300][1067.496s] GC(38) Pause Young (Allocation Failure) 227M->141M(490M) 5.252ms
[2021-04-07T22:37:36.105+0300][1067.496s] GC(38) User=0.06s Sys=0.00s Real=0.01s
[2021-04-07T22:38:14.508+0300][1105.897s] GC(39) Pause Young (Allocation Failure)
[2021-04-07T22:38:14.508+0300][1105.897s] GC(39) Using 4 workers of 4 for evacuation
[2021-04-07T22:38:14.518+0300][1105.907s] GC(39) ParNew: 106830K->21824K(109248K)
[2021-04-07T22:38:14.518+0300][1105.907s] GC(39) CMS: 125377K->125880K(393216K)
[2021-04-07T22:38:14.518+0300][1105.907s] GC(39) Metaspace: 60254K->60254K(1103872K)
[2021-04-07T22:38:14.518+0300][1105.907s] GC(39) Pause Young (Allocation Failure) 226M->144M(490M) 10.318ms
[2021-04-07T22:38:14.518+0300][1105.907s] GC(39) User=0.05s Sys=0.00s Real=0.01s
[2021-04-07T22:38:57.697+0300][1149.088s] GC(40) Pause Young (Allocation Failure)
[2021-04-07T22:38:57.697+0300][1149.088s] GC(40) Using 4 workers of 4 for evacuation
[2021-04-07T22:38:57.707+0300][1149.098s] GC(40) ParNew: 109248K->21824K(109248K)
[2021-04-07T22:38:57.707+0300][1149.098s] GC(40) CMS: 125880K->129779K(393216K)
[2021-04-07T22:38:57.707+0300][1149.098s] GC(40) Metaspace: 60266K->60266K(1103872K)
[2021-04-07T22:38:57.707+0300][1149.098s] GC(40) Pause Young (Allocation Failure) 229M->148M(490M) 9.724ms
[2021-04-07T22:38:57.707+0300][1149.098s] GC(40) User=0.00s Sys=0.00s Real=0.01s
[2021-04-07T22:39:45.559+0300][1196.947s] GC(41) Pause Young (Allocation Failure)
[2021-04-07T22:39:45.559+0300][1196.947s] GC(41) Using 4 workers of 4 for evacuation
[2021-04-07T22:39:45.569+0300][1196.956s] GC(41) ParNew: 109248K->21824K(109248K)
[2021-04-07T22:39:45.569+0300][1196.956s] GC(41) CMS: 129779K->134785K(393216K)
[2021-04-07T22:39:45.569+0300][1196.956s] GC(41) Metaspace: 60292K->60292K(1103872K)
[2021-04-07T22:39:45.569+0300][1196.956s] GC(41) Pause Young (Allocation Failure) 233M->152M(490M) 9.501ms
[2021-04-07T22:39:45.569+0300][1196.956s] GC(41) User=0.00s Sys=0.00s Real=0.01s
[2021-04-07T22:39:50.820+0300][1202.208s] GC(42) Pause Young (Allocation Failure)
[2021-04-07T22:39:50.820+0300][1202.209s] GC(42) Using 4 workers of 4 for evacuation
[2021-04-07T22:39:50.830+0300][1202.217s] GC(42) ParNew: 109248K->21824K(109248K)
[2021-04-07T22:39:50.830+0300][1202.217s] GC(42) CMS: 134785K->134831K(393216K)
[2021-04-07T22:39:50.830+0300][1202.217s] GC(42) Metaspace: 60312K->60312K(1103872K)
[2021-04-07T22:39:50.830+0300][1202.217s] GC(42) Pause Young (Allocation Failure) 238M->152M(490M) 8.779ms
[2021-04-07T22:39:50.830+0300][1202.217s] GC(42) User=0.05s Sys=0.02s Real=0.01s
