[2021-04-07T21:36:56.159+0300][0.006s] Using Concurrent Mark Sweep
[2021-04-07T21:36:56.159+0300][0.006s] Heap address: 0x00000000e0000000, size: 512 MB, Compressed Oops mode: 32-bit
[2021-04-07T21:36:57.594+0300][1.441s] GC(0) Pause Young (Allocation Failure)
[2021-04-07T21:36:57.594+0300][1.441s] GC(0) Using 4 workers of 4 for evacuation
[2021-04-07T21:36:57.599+0300][1.448s] GC(0) ParNew: 87424K->9607K(109248K)
[2021-04-07T21:36:57.599+0300][1.448s] GC(0) CMS: 0K->0K(393216K)
[2021-04-07T21:36:57.599+0300][1.448s] GC(0) Metaspace: 22484K->22484K(1071104K)
[2021-04-07T21:36:57.599+0300][1.448s] GC(0) Pause Young (Allocation Failure) 85M->9M(490M) 6.546ms
[2021-04-07T21:36:57.599+0300][1.448s] GC(0) User=0.00s Sys=0.00s Real=0.00s
[2021-04-07T21:36:57.599+0300][1.448s] GC(1) Pause Initial Mark
[2021-04-07T21:36:57.599+0300][1.449s] GC(1) Pause Initial Mark 11M->11M(490M) 1.219ms
[2021-04-07T21:36:57.599+0300][1.449s] GC(1) User=0.00s Sys=0.00s Real=0.00s
[2021-04-07T21:36:57.599+0300][1.449s] GC(1) Concurrent Mark
[2021-04-07T21:36:57.599+0300][1.449s] GC(1) Using 4 workers of 4 for marking
[2021-04-07T21:36:57.609+0300][1.456s] GC(1) Concurrent Mark 6.444ms
[2021-04-07T21:36:57.609+0300][1.456s] GC(1) User=0.02s Sys=0.00s Real=0.01s
[2021-04-07T21:36:57.609+0300][1.456s] GC(1) Concurrent Preclean
[2021-04-07T21:36:57.609+0300][1.456s] GC(1) Concurrent Preclean 0.403ms
[2021-04-07T21:36:57.609+0300][1.456s] GC(1) User=0.00s Sys=0.00s Real=0.00s
[2021-04-07T21:36:57.609+0300][1.456s] GC(1) Concurrent Abortable Preclean
[2021-04-07T21:36:58.525+0300][2.373s] GC(2) Pause Young (Allocation Failure)
[2021-04-07T21:36:58.525+0300][2.373s] GC(2) Using 4 workers of 4 for evacuation
[2021-04-07T21:36:58.530+0300][2.380s] GC(2) ParNew: 97031K->14083K(109248K)
[2021-04-07T21:36:58.530+0300][2.380s] GC(2) CMS: 0K->0K(393216K)
[2021-04-07T21:36:58.530+0300][2.380s] GC(2) Metaspace: 28624K->28624K(1075200K)
[2021-04-07T21:36:58.530+0300][2.380s] GC(2) Pause Young (Allocation Failure) 94M->13M(490M) 7.667ms
[2021-04-07T21:36:58.530+0300][2.380s] GC(2) User=0.00s Sys=0.00s Real=0.00s
[2021-04-07T21:37:03.653+0300][7.503s] GC(1) Concurrent Abortable Preclean 6046.443ms
[2021-04-07T21:37:03.653+0300][7.503s] GC(1) User=4.89s Sys=0.14s Real=6.04s
[2021-04-07T21:37:03.653+0300][7.503s] GC(1) Pause Remark
[2021-04-07T21:37:03.653+0300][7.503s] GC(3) Pause Young (CMS Final Remark)
[2021-04-07T21:37:03.653+0300][7.503s] GC(3) Using 4 workers of 4 for evacuation
[2021-04-07T21:37:03.663+0300][7.509s] GC(3) ParNew: 40400K->16819K(109248K)
[2021-04-07T21:37:03.663+0300][7.509s] GC(3) CMS: 0K->0K(393216K)
[2021-04-07T21:37:03.663+0300][7.509s] GC(3) Metaspace: 31742K->31742K(1079296K)
[2021-04-07T21:37:03.663+0300][7.509s] GC(3) Pause Young (CMS Final Remark) 39M->16M(490M) 6.527ms
[2021-04-07T21:37:03.663+0300][7.509s] GC(3) User=0.00s Sys=0.00s Real=0.01s
[2021-04-07T21:37:03.668+0300][7.516s] GC(1) Pause Remark 39M->16M(490M) 12.965ms
[2021-04-07T21:37:03.668+0300][7.516s] GC(1) User=0.02s Sys=0.00s Real=0.01s
[2021-04-07T21:37:03.668+0300][7.516s] GC(1) Concurrent Sweep
[2021-04-07T21:37:03.668+0300][7.516s] GC(1) Concurrent Sweep 0.043ms
[2021-04-07T21:37:03.668+0300][7.516s] GC(1) User=0.00s Sys=0.00s Real=0.00s
[2021-04-07T21:37:03.668+0300][7.516s] GC(1) Concurrent Reset
[2021-04-07T21:37:03.668+0300][7.518s] GC(1) Concurrent Reset 1.980ms
[2021-04-07T21:37:03.668+0300][7.518s] GC(1) User=0.00s Sys=0.00s Real=0.00s
[2021-04-07T21:37:03.668+0300][7.518s] GC(1) Old: 0K->0K(393216K)
[2021-04-07T21:37:08.214+0300][12.060s] GC(4) Pause Young (Allocation Failure)
[2021-04-07T21:37:08.214+0300][12.060s] GC(4) Using 4 workers of 4 for evacuation
[2021-04-07T21:37:08.219+0300][12.069s] GC(4) ParNew: 104243K->18201K(109248K)
[2021-04-07T21:37:08.219+0300][12.069s] GC(4) CMS: 0K->0K(393216K)
[2021-04-07T21:37:08.219+0300][12.069s] GC(4) Metaspace: 37075K->37075K(1083392K)
[2021-04-07T21:37:08.219+0300][12.069s] GC(4) Pause Young (Allocation Failure) 101M->17M(490M) 8.903ms
[2021-04-07T21:37:08.219+0300][12.069s] GC(4) User=0.00s Sys=0.00s Real=0.01s
[2021-04-07T21:37:08.384+0300][12.232s] GC(5) Pause Young (Allocation Failure)
[2021-04-07T21:37:08.384+0300][12.232s] GC(5) Using 4 workers of 4 for evacuation
[2021-04-07T21:37:08.394+0300][12.242s] GC(5) ParNew: 105625K->21824K(109248K)
[2021-04-07T21:37:08.394+0300][12.242s] GC(5) CMS: 0K->0K(393216K)
[2021-04-07T21:37:08.394+0300][12.242s] GC(5) Metaspace: 38235K->38235K(1083392K)
[2021-04-07T21:37:08.394+0300][12.242s] GC(5) Pause Young (Allocation Failure) 103M->21M(490M) 10.092ms
[2021-04-07T21:37:08.394+0300][12.242s] GC(5) User=0.00s Sys=0.00s Real=0.01s
[2021-04-07T21:37:08.499+0300][12.347s] GC(6) Pause Young (Allocation Failure)
[2021-04-07T21:37:08.499+0300][12.347s] GC(6) Using 4 workers of 4 for evacuation
[2021-04-07T21:37:08.509+0300][12.357s] GC(6) ParNew: 109248K->21824K(109248K)
[2021-04-07T21:37:08.509+0300][12.357s] GC(6) CMS: 0K->0K(393216K)
[2021-04-07T21:37:08.509+0300][12.357s] GC(6) Metaspace: 38595K->38595K(1085440K)
[2021-04-07T21:37:08.509+0300][12.357s] GC(6) Pause Young (Allocation Failure) 106M->21M(490M) 10.182ms
[2021-04-07T21:37:08.509+0300][12.357s] GC(6) User=0.06s Sys=0.00s Real=0.01s
[2021-04-07T21:37:08.594+0300][12.442s] GC(7) Pause Young (Allocation Failure)
[2021-04-07T21:37:08.594+0300][12.442s] GC(7) Using 4 workers of 4 for evacuation
[2021-04-07T21:37:08.604+0300][12.453s] GC(7) ParNew: 109248K->21824K(109248K)
[2021-04-07T21:37:08.604+0300][12.453s] GC(7) CMS: 0K->123K(393216K)
[2021-04-07T21:37:08.604+0300][12.453s] GC(7) Metaspace: 39176K->39176K(1085440K)
[2021-04-07T21:37:08.604+0300][12.453s] GC(7) Pause Young (Allocation Failure) 106M->21M(490M) 10.727ms
[2021-04-07T21:37:08.604+0300][12.453s] GC(7) User=0.06s Sys=0.00s Real=0.01s
[2021-04-07T21:37:09.171+0300][13.017s] GC(8) Pause Young (Allocation Failure)
[2021-04-07T21:37:09.171+0300][13.017s] GC(8) Using 4 workers of 4 for evacuation
[2021-04-07T21:37:09.186+0300][13.033s] GC(8) ParNew: 109248K->21824K(109248K)
[2021-04-07T21:37:09.186+0300][13.033s] GC(8) CMS: 123K->2751K(393216K)
[2021-04-07T21:37:09.186+0300][13.033s] GC(8) Metaspace: 43555K->43555K(1089536K)
[2021-04-07T21:37:09.186+0300][13.033s] GC(8) Pause Young (Allocation Failure) 106M->23M(490M) 15.794ms
[2021-04-07T21:37:09.186+0300][13.033s] GC(8) User=0.06s Sys=0.00s Real=0.02s
[2021-04-07T21:37:09.736+0300][13.582s] GC(9) Pause Young (Allocation Failure)
[2021-04-07T21:37:09.736+0300][13.582s] GC(9) Using 4 workers of 4 for evacuation
[2021-04-07T21:37:09.750+0300][13.597s] GC(9) ParNew: 109248K->21824K(109248K)
[2021-04-07T21:37:09.750+0300][13.597s] GC(9) CMS: 2751K->11121K(393216K)
[2021-04-07T21:37:09.750+0300][13.597s] GC(9) Metaspace: 46714K->46714K(1091584K)
[2021-04-07T21:37:09.750+0300][13.597s] GC(9) Pause Young (Allocation Failure) 109M->32M(490M) 14.486ms
[2021-04-07T21:37:09.750+0300][13.597s] GC(9) User=0.06s Sys=0.00s Real=0.01s
