[2021-04-08T13:42:16.367+0300][0.006s] Using Concurrent Mark Sweep
[2021-04-08T13:42:16.367+0300][0.006s] Heap address: 0x00000000e0000000, size: 512 MB, Compressed Oops mode: 32-bit
[2021-04-08T13:42:18.569+0300][2.209s] GC(0) Pause Young (Allocation Failure)
[2021-04-08T13:42:18.570+0300][2.209s] GC(0) Using 4 workers of 4 for evacuation
[2021-04-08T13:42:18.577+0300][2.217s] GC(0) ParNew: 87424K->9599K(109248K)
[2021-04-08T13:42:18.577+0300][2.217s] GC(0) CMS: 0K->0K(393216K)
[2021-04-08T13:42:18.577+0300][2.217s] GC(0) Metaspace: 22533K->22533K(1071104K)
[2021-04-08T13:42:18.577+0300][2.217s] GC(0) Pause Young (Allocation Failure) 85M->9M(490M) 7.961ms
[2021-04-08T13:42:18.577+0300][2.217s] GC(0) User=0.00s Sys=0.00s Real=0.01s
[2021-04-08T13:42:18.578+0300][2.217s] GC(1) Pause Initial Mark
[2021-04-08T13:42:18.579+0300][2.218s] GC(1) Pause Initial Mark 13M->13M(490M) 1.215ms
[2021-04-08T13:42:18.579+0300][2.218s] GC(1) User=0.00s Sys=0.00s Real=0.00s
[2021-04-08T13:42:18.579+0300][2.218s] GC(1) Concurrent Mark
[2021-04-08T13:42:18.579+0300][2.218s] GC(1) Using 4 workers of 4 for marking
[2021-04-08T13:42:18.585+0300][2.224s] GC(1) Concurrent Mark 5.602ms
[2021-04-08T13:42:18.585+0300][2.224s] GC(1) User=0.02s Sys=0.00s Real=0.01s
[2021-04-08T13:42:18.585+0300][2.224s] GC(1) Concurrent Preclean
[2021-04-08T13:42:18.585+0300][2.224s] GC(1) Concurrent Preclean 0.390ms
[2021-04-08T13:42:18.585+0300][2.224s] GC(1) User=0.00s Sys=0.00s Real=0.00s
[2021-04-08T13:42:18.585+0300][2.224s] GC(1) Concurrent Abortable Preclean
[2021-04-08T13:42:19.570+0300][3.210s] GC(2) Pause Young (Allocation Failure)
[2021-04-08T13:42:19.570+0300][3.210s] GC(2) Using 4 workers of 4 for evacuation
[2021-04-08T13:42:19.580+0300][3.219s] GC(2) ParNew: 97023K->13290K(109248K)
[2021-04-08T13:42:19.580+0300][3.219s] GC(2) CMS: 0K->0K(393216K)
[2021-04-08T13:42:19.580+0300][3.219s] GC(2) Metaspace: 29441K->29441K(1077248K)
[2021-04-08T13:42:19.580+0300][3.219s] GC(2) Pause Young (Allocation Failure) 94M->12M(490M) 9.423ms
[2021-04-08T13:42:19.580+0300][3.219s] GC(2) User=0.00s Sys=0.00s Real=0.01s
[2021-04-08T13:42:24.714+0300][8.353s] GC(1) Concurrent Abortable Preclean 6129.002ms
[2021-04-08T13:42:24.714+0300][8.353s] GC(1) User=4.45s Sys=0.22s Real=6.13s
[2021-04-08T13:42:24.715+0300][8.354s] GC(1) Pause Remark
[2021-04-08T13:42:24.715+0300][8.354s] GC(3) Pause Young (CMS Final Remark)
[2021-04-08T13:42:24.715+0300][8.354s] GC(3) Using 4 workers of 4 for evacuation
[2021-04-08T13:42:24.723+0300][8.362s] GC(3) ParNew: 37959K->16869K(109248K)
[2021-04-08T13:42:24.723+0300][8.362s] GC(3) CMS: 0K->0K(393216K)
[2021-04-08T13:42:24.723+0300][8.362s] GC(3) Metaspace: 31731K->31731K(1079296K)
[2021-04-08T13:42:24.723+0300][8.362s] GC(3) Pause Young (CMS Final Remark) 37M->16M(490M) 8.204ms
[2021-04-08T13:42:24.723+0300][8.362s] GC(3) User=0.00s Sys=0.00s Real=0.01s
[2021-04-08T13:42:24.733+0300][8.372s] GC(1) Pause Remark 37M->16M(490M) 18.314ms
[2021-04-08T13:42:24.733+0300][8.372s] GC(1) User=0.06s Sys=0.00s Real=0.02s
[2021-04-08T13:42:24.733+0300][8.372s] GC(1) Concurrent Sweep
[2021-04-08T13:42:24.733+0300][8.372s] GC(1) Concurrent Sweep 0.054ms
[2021-04-08T13:42:24.733+0300][8.372s] GC(1) User=0.00s Sys=0.00s Real=0.00s
[2021-04-08T13:42:24.733+0300][8.372s] GC(1) Concurrent Reset
[2021-04-08T13:42:24.736+0300][8.375s] GC(1) Concurrent Reset 3.233ms
[2021-04-08T13:42:24.736+0300][8.375s] GC(1) User=0.00s Sys=0.00s Real=0.00s
[2021-04-08T13:42:24.736+0300][8.375s] GC(1) Old: 0K->0K(393216K)
[2021-04-08T13:42:29.359+0300][12.999s] GC(4) Pause Young (Allocation Failure)
[2021-04-08T13:42:29.359+0300][12.999s] GC(4) Using 4 workers of 4 for evacuation
[2021-04-08T13:42:29.368+0300][13.008s] GC(4) ParNew: 104293K->19812K(109248K)
[2021-04-08T13:42:29.368+0300][13.008s] GC(4) CMS: 0K->0K(393216K)
[2021-04-08T13:42:29.368+0300][13.008s] GC(4) Metaspace: 37281K->37281K(1083392K)
[2021-04-08T13:42:29.368+0300][13.008s] GC(4) Pause Young (Allocation Failure) 101M->19M(490M) 9.223ms
[2021-04-08T13:42:29.368+0300][13.008s] GC(4) User=0.05s Sys=0.00s Real=0.01s
[2021-04-08T13:42:29.648+0300][13.287s] GC(5) Pause Young (Allocation Failure)
[2021-04-08T13:42:29.648+0300][13.287s] GC(5) Using 4 workers of 4 for evacuation
[2021-04-08T13:42:29.659+0300][13.298s] GC(5) ParNew: 107236K->21824K(109248K)
[2021-04-08T13:42:29.659+0300][13.298s] GC(5) CMS: 0K->0K(393216K)
[2021-04-08T13:42:29.659+0300][13.298s] GC(5) Metaspace: 39587K->39587K(1085440K)
[2021-04-08T13:42:29.659+0300][13.298s] GC(5) Pause Young (Allocation Failure) 104M->21M(490M) 10.832ms
[2021-04-08T13:42:29.659+0300][13.298s] GC(5) User=0.00s Sys=0.00s Real=0.01s
[2021-04-08T13:42:29.795+0300][13.434s] GC(6) Pause Young (Allocation Failure)
[2021-04-08T13:42:29.795+0300][13.434s] GC(6) Using 4 workers of 4 for evacuation
[2021-04-08T13:42:29.804+0300][13.443s] GC(6) ParNew: 109239K->21824K(109248K)
[2021-04-08T13:42:29.804+0300][13.443s] GC(6) CMS: 0K->0K(393216K)
[2021-04-08T13:42:29.804+0300][13.443s] GC(6) Metaspace: 40415K->40415K(1085440K)
[2021-04-08T13:42:29.804+0300][13.443s] GC(6) Pause Young (Allocation Failure) 106M->21M(490M) 9.547ms
[2021-04-08T13:42:29.804+0300][13.443s] GC(6) User=0.06s Sys=0.00s Real=0.01s
[2021-04-08T13:42:29.926+0300][13.564s] GC(7) Pause Young (Allocation Failure)
[2021-04-08T13:42:29.926+0300][13.564s] GC(7) Using 4 workers of 4 for evacuation
[2021-04-08T13:42:29.936+0300][13.575s] GC(7) ParNew: 109248K->21824K(109248K)
[2021-04-08T13:42:29.936+0300][13.575s] GC(7) CMS: 0K->409K(393216K)
[2021-04-08T13:42:29.936+0300][13.575s] GC(7) Metaspace: 41382K->41382K(1087488K)
[2021-04-08T13:42:29.937+0300][13.575s] GC(7) Pause Young (Allocation Failure) 106M->21M(490M) 10.874ms
[2021-04-08T13:42:29.937+0300][13.575s] GC(7) User=0.06s Sys=0.00s Real=0.01s
[2021-04-08T13:42:31.072+0300][14.711s] GC(8) Pause Young (Allocation Failure)
[2021-04-08T13:42:31.072+0300][14.711s] GC(8) Using 4 workers of 4 for evacuation
[2021-04-08T13:42:31.094+0300][14.733s] GC(8) ParNew: 109248K->21824K(109248K)
[2021-04-08T13:42:31.094+0300][14.733s] GC(8) CMS: 409K->3783K(393216K)
[2021-04-08T13:42:31.094+0300][14.733s] GC(8) Metaspace: 43602K->43602K(1089536K)
[2021-04-08T13:42:31.094+0300][14.733s] GC(8) Pause Young (Allocation Failure) 107M->25M(490M) 21.522ms
[2021-04-08T13:42:31.094+0300][14.733s] GC(8) User=0.06s Sys=0.00s Real=0.02s
[2021-04-08T13:42:31.773+0300][15.412s] GC(9) Pause Young (Allocation Failure)
[2021-04-08T13:42:31.773+0300][15.412s] GC(9) Using 4 workers of 4 for evacuation
[2021-04-08T13:42:31.789+0300][15.428s] GC(9) ParNew: 109248K->21824K(109248K)
[2021-04-08T13:42:31.789+0300][15.428s] GC(9) CMS: 3783K->12822K(393216K)
[2021-04-08T13:42:31.789+0300][15.428s] GC(9) Metaspace: 46755K->46755K(1091584K)
[2021-04-08T13:42:31.789+0300][15.428s] GC(9) Pause Young (Allocation Failure) 110M->33M(490M) 15.317ms
[2021-04-08T13:42:31.789+0300][15.428s] GC(9) User=0.06s Sys=0.00s Real=0.02s
[2021-04-08T13:42:38.236+0300][21.875s] GC(10) Pause Young (Allocation Failure)
[2021-04-08T13:42:38.236+0300][21.875s] GC(10) Using 4 workers of 4 for evacuation
[2021-04-08T13:42:38.265+0300][21.903s] GC(10) ParNew: 109248K->21824K(109248K)
[2021-04-08T13:42:38.265+0300][21.904s] GC(10) CMS: 12822K->20629K(393216K)
[2021-04-08T13:42:38.265+0300][21.904s] GC(10) Metaspace: 51039K->51039K(1095680K)
[2021-04-08T13:42:38.265+0300][21.904s] GC(10) Pause Young (Allocation Failure) 119M->41M(490M) 28.889ms
[2021-04-08T13:42:38.265+0300][21.904s] GC(10) User=0.09s Sys=0.00s Real=0.03s
[2021-04-08T13:47:15.127+0300][298.766s] GC(11) Pause Young (Allocation Failure)
[2021-04-08T13:47:15.127+0300][298.766s] GC(11) Using 4 workers of 4 for evacuation
[2021-04-08T13:47:15.148+0300][298.787s] GC(11) ParNew: 109248K->21824K(109248K)
[2021-04-08T13:47:15.148+0300][298.787s] GC(11) CMS: 20629K->26718K(393216K)
[2021-04-08T13:47:15.148+0300][298.787s] GC(11) Metaspace: 53694K->53694K(1097728K)
[2021-04-08T13:47:15.148+0300][298.787s] GC(11) Pause Young (Allocation Failure) 126M->47M(490M) 21.122ms
[2021-04-08T13:47:15.148+0300][298.787s] GC(11) User=0.13s Sys=0.00s Real=0.02s
[2021-04-08T13:47:15.148+0300][298.788s] GC(12) Pause Initial Mark
[2021-04-08T13:47:15.153+0300][298.792s] GC(12) Pause Initial Mark 47M->47M(490M) 4.573ms
[2021-04-08T13:47:15.153+0300][298.792s] GC(12) User=0.00s Sys=0.00s Real=0.01s
[2021-04-08T13:47:15.153+0300][298.792s] GC(12) Concurrent Mark
[2021-04-08T13:47:15.153+0300][298.792s] GC(12) Using 4 workers of 4 for marking
[2021-04-08T13:47:15.166+0300][298.805s] GC(12) Concurrent Mark 12.642ms
[2021-04-08T13:47:15.166+0300][298.805s] GC(12) User=0.06s Sys=0.00s Real=0.01s
[2021-04-08T13:47:15.166+0300][298.805s] GC(12) Concurrent Preclean
[2021-04-08T13:47:15.166+0300][298.806s] GC(12) Concurrent Preclean 0.840ms
[2021-04-08T13:47:15.166+0300][298.806s] GC(12) User=0.00s Sys=0.00s Real=0.00s
[2021-04-08T13:47:15.166+0300][298.806s] GC(12) Concurrent Abortable Preclean
[2021-04-08T13:47:15.233+0300][298.872s] GC(13) Pause Young (Allocation Failure)
[2021-04-08T13:47:15.233+0300][298.872s] GC(13) Using 4 workers of 4 for evacuation
[2021-04-08T13:47:15.248+0300][298.887s] GC(13) ParNew: 109248K->21824K(109248K)
[2021-04-08T13:47:15.248+0300][298.887s] GC(13) CMS: 26718K->31683K(393216K)
[2021-04-08T13:47:15.248+0300][298.887s] GC(13) Metaspace: 53701K->53701K(1097728K)
[2021-04-08T13:47:15.248+0300][298.887s] GC(13) Pause Young (Allocation Failure) 132M->52M(490M) 15.085ms
[2021-04-08T13:47:15.248+0300][298.887s] GC(13) User=0.06s Sys=0.00s Real=0.01s
[2021-04-08T13:47:15.258+0300][298.897s] GC(12) Concurrent Abortable Preclean 91.116ms
[2021-04-08T13:47:15.258+0300][298.897s] GC(12) User=0.27s Sys=0.02s Real=0.09s
[2021-04-08T13:47:15.258+0300][298.898s] GC(12) Pause Remark
[2021-04-08T13:47:15.258+0300][298.898s] GC(14) Pause Young (CMS Final Remark)
[2021-04-08T13:47:15.258+0300][298.898s] GC(14) Using 4 workers of 4 for evacuation
[2021-04-08T13:47:15.269+0300][298.908s] GC(14) ParNew: 26061K->21824K(109248K)
[2021-04-08T13:47:15.269+0300][298.908s] GC(14) CMS: 31683K->31683K(393216K)
[2021-04-08T13:47:15.269+0300][298.908s] GC(14) Metaspace: 53701K->53701K(1097728K)
[2021-04-08T13:47:15.269+0300][298.908s] GC(14) Pause Young (CMS Final Remark) 56M->52M(490M) 10.238ms
[2021-04-08T13:47:15.269+0300][298.908s] GC(14) User=0.00s Sys=0.00s Real=0.01s
[2021-04-08T13:47:15.286+0300][298.926s] GC(12) Pause Remark 56M->52M(490M) 27.945ms
[2021-04-08T13:47:15.286+0300][298.926s] GC(12) User=0.08s Sys=0.00s Real=0.03s
[2021-04-08T13:47:15.286+0300][298.926s] GC(12) Concurrent Sweep
[2021-04-08T13:47:15.295+0300][298.935s] GC(12) Concurrent Sweep 9.039ms
[2021-04-08T13:47:15.295+0300][298.935s] GC(12) User=0.00s Sys=0.00s Real=0.01s
[2021-04-08T13:47:15.295+0300][298.935s] GC(12) Concurrent Reset
[2021-04-08T13:47:15.299+0300][298.939s] GC(12) Concurrent Reset 4.086ms
[2021-04-08T13:47:15.299+0300][298.939s] GC(12) User=0.00s Sys=0.00s Real=0.00s
[2021-04-08T13:47:15.299+0300][298.939s] GC(12) Old: 26718K->30549K(393216K)
[2021-04-08T13:52:13.233+0300][596.872s] GC(15) Pause Young (Allocation Failure)
[2021-04-08T13:52:13.233+0300][596.872s] GC(15) Using 4 workers of 4 for evacuation
[2021-04-08T13:52:13.249+0300][596.888s] GC(15) ParNew: 109248K->21824K(109248K)
[2021-04-08T13:52:13.249+0300][596.888s] GC(15) CMS: 30549K->31266K(393216K)
[2021-04-08T13:52:13.249+0300][596.888s] GC(15) Metaspace: 55136K->55136K(1099776K)
[2021-04-08T13:52:13.249+0300][596.888s] GC(15) Pause Young (Allocation Failure) 136M->51M(490M) 16.331ms
[2021-04-08T13:52:13.249+0300][596.888s] GC(15) User=0.05s Sys=0.00s Real=0.02s
[2021-04-08T13:52:13.418+0300][597.057s] GC(16) Pause Young (Allocation Failure)
[2021-04-08T13:52:13.418+0300][597.058s] GC(16) Using 4 workers of 4 for evacuation
[2021-04-08T13:52:13.433+0300][597.073s] GC(16) ParNew: 109246K->21824K(109248K)
[2021-04-08T13:52:13.433+0300][597.073s] GC(16) CMS: 31266K->31636K(393216K)
[2021-04-08T13:52:13.433+0300][597.073s] GC(16) Metaspace: 55293K->55293K(1099776K)
[2021-04-08T13:52:13.433+0300][597.073s] GC(16) Pause Young (Allocation Failure) 137M->52M(490M) 15.191ms
[2021-04-08T13:52:13.433+0300][597.073s] GC(16) User=0.06s Sys=0.00s Real=0.02s
[2021-04-08T13:52:13.574+0300][597.214s] GC(17) Pause Young (Allocation Failure)
[2021-04-08T13:52:13.574+0300][597.214s] GC(17) Using 4 workers of 4 for evacuation
[2021-04-08T13:52:13.586+0300][597.225s] GC(17) ParNew: 109248K->21824K(109248K)
[2021-04-08T13:52:13.586+0300][597.225s] GC(17) CMS: 31636K->31792K(393216K)
[2021-04-08T13:52:13.586+0300][597.225s] GC(17) Metaspace: 55340K->55340K(1099776K)
[2021-04-08T13:52:13.586+0300][597.225s] GC(17) Pause Young (Allocation Failure) 137M->52M(490M) 11.370ms
[2021-04-08T13:52:13.586+0300][597.225s] GC(17) User=0.06s Sys=0.00s Real=0.01s
[2021-04-08T13:52:28.059+0300][611.698s] GC(18) Pause Young (Allocation Failure)
[2021-04-08T13:52:28.059+0300][611.698s] GC(18) Using 4 workers of 4 for evacuation
[2021-04-08T13:52:28.104+0300][611.743s] GC(18) ParNew: 109248K->21824K(109248K)
[2021-04-08T13:52:28.104+0300][611.743s] GC(18) CMS: 31792K->61154K(393216K)
[2021-04-08T13:52:28.104+0300][611.743s] GC(18) Metaspace: 56672K->56672K(1101824K)
[2021-04-08T13:52:28.104+0300][611.743s] GC(18) Pause Young (Allocation Failure) 137M->81M(490M) 45.758ms
[2021-04-08T13:52:28.105+0300][611.743s] GC(18) User=0.11s Sys=0.03s Real=0.05s
[2021-04-08T13:52:29.577+0300][613.216s] GC(19) Pause Young (Allocation Failure)
[2021-04-08T13:52:29.577+0300][613.216s] GC(19) Using 4 workers of 4 for evacuation
[2021-04-08T13:52:29.610+0300][613.249s] GC(19) ParNew: 109248K->21824K(109248K)
[2021-04-08T13:52:29.610+0300][613.249s] GC(19) CMS: 61154K->75541K(393216K)
[2021-04-08T13:52:29.610+0300][613.249s] GC(19) Metaspace: 57513K->57513K(1101824K)
[2021-04-08T13:52:29.610+0300][613.249s] GC(19) Pause Young (Allocation Failure) 166M->95M(490M) 32.936ms
[2021-04-08T13:52:29.610+0300][613.249s] GC(19) User=0.06s Sys=0.00s Real=0.03s
[2021-04-08T13:52:33.595+0300][617.234s] GC(20) Pause Young (Allocation Failure)
[2021-04-08T13:52:33.595+0300][617.234s] GC(20) Using 4 workers of 4 for evacuation
[2021-04-08T13:52:33.608+0300][617.247s] GC(20) ParNew: 109248K->21824K(109248K)
[2021-04-08T13:52:33.608+0300][617.247s] GC(20) CMS: 75541K->79230K(393216K)
[2021-04-08T13:52:33.608+0300][617.247s] GC(20) Metaspace: 58221K->58221K(1101824K)
[2021-04-08T13:52:33.608+0300][617.247s] GC(20) Pause Young (Allocation Failure) 180M->98M(490M) 12.612ms
[2021-04-08T13:52:33.608+0300][617.247s] GC(20) User=0.06s Sys=0.00s Real=0.01s
[2021-04-08T13:52:33.732+0300][617.371s] GC(21) Pause Young (Allocation Failure)
[2021-04-08T13:52:33.732+0300][617.372s] GC(21) Using 4 workers of 4 for evacuation
[2021-04-08T13:52:33.739+0300][617.379s] GC(21) ParNew: 109048K->21824K(109248K)
[2021-04-08T13:52:33.739+0300][617.379s] GC(21) CMS: 79230K->79233K(393216K)
[2021-04-08T13:52:33.739+0300][617.379s] GC(21) Metaspace: 58328K->58328K(1101824K)
[2021-04-08T13:52:33.739+0300][617.379s] GC(21) Pause Young (Allocation Failure) 183M->98M(490M) 7.185ms
[2021-04-08T13:52:33.739+0300][617.379s] GC(21) User=0.06s Sys=0.00s Real=0.01s
[2021-04-08T13:55:48.460+0300][812.100s] Heap
[2021-04-08T13:55:48.460+0300][812.100s]  par new generation   total 109248K, used 82351K [0x00000000e0000000, 0x00000000e8000000, 0x00000000e8000000)
[2021-04-08T13:55:48.460+0300][812.100s]   eden space 87424K,  69% used [0x00000000e0000000, 0x00000000e3b1bd90, 0x00000000e5560000)
[2021-04-08T13:55:48.460+0300][812.100s]   from space 21824K, 100% used [0x00000000e5560000, 0x00000000e6ab0000, 0x00000000e6ab0000)
[2021-04-08T13:55:48.460+0300][812.100s]   to   space 21824K,   0% used [0x00000000e6ab0000, 0x00000000e6ab0000, 0x00000000e8000000)
[2021-04-08T13:55:48.460+0300][812.100s]  concurrent mark-sweep generation total 393216K, used 79233K [0x00000000e8000000, 0x0000000100000000, 0x0000000100000000)
[2021-04-08T13:55:48.460+0300][812.100s]  Metaspace       used 58667K, capacity 60092K, committed 60264K, reserved 1101824K
[2021-04-08T13:55:48.460+0300][812.100s]   class space    used 6502K, capacity 7037K, committed 7164K, reserved 1048576K
