[2021-04-08T16:14:15.426+0300][0.007s] Using Concurrent Mark Sweep
[2021-04-08T16:14:15.426+0300][0.007s] Heap address: 0x00000000e0000000, size: 512 MB, Compressed Oops mode: 32-bit
[2021-04-08T16:14:16.832+0300][1.417s] GC(0) Pause Young (Allocation Failure)
[2021-04-08T16:14:16.832+0300][1.417s] GC(0) Using 4 workers of 4 for evacuation
[2021-04-08T16:14:16.832+0300][1.424s] GC(0) ParNew: 87424K->9607K(109248K)
[2021-04-08T16:14:16.832+0300][1.424s] GC(0) CMS: 0K->0K(393216K)
[2021-04-08T16:14:16.832+0300][1.424s] GC(0) Metaspace: 22522K->22522K(1071104K)
[2021-04-08T16:14:16.832+0300][1.424s] GC(0) Pause Young (Allocation Failure) 85M->9M(490M) 7.377ms
[2021-04-08T16:14:16.832+0300][1.424s] GC(0) User=0.00s Sys=0.00s Real=0.00s
[2021-04-08T16:14:16.832+0300][1.424s] GC(1) Pause Initial Mark
[2021-04-08T16:14:16.832+0300][1.425s] GC(1) Pause Initial Mark 11M->11M(490M) 1.240ms
[2021-04-08T16:14:16.832+0300][1.425s] GC(1) User=0.00s Sys=0.00s Real=0.00s
[2021-04-08T16:14:16.832+0300][1.425s] GC(1) Concurrent Mark
[2021-04-08T16:14:16.832+0300][1.426s] GC(1) Using 4 workers of 4 for marking
[2021-04-08T16:14:16.848+0300][1.428s] GC(1) Concurrent Mark 2.520ms
[2021-04-08T16:14:16.848+0300][1.428s] GC(1) User=0.02s Sys=0.00s Real=0.02s
[2021-04-08T16:14:16.848+0300][1.428s] GC(1) Concurrent Preclean
[2021-04-08T16:14:16.848+0300][1.429s] GC(1) Concurrent Preclean 0.563ms
[2021-04-08T16:14:16.848+0300][1.429s] GC(1) User=0.00s Sys=0.00s Real=0.00s
[2021-04-08T16:14:16.848+0300][1.429s] GC(1) Concurrent Abortable Preclean
[2021-04-08T16:14:17.911+0300][2.495s] GC(2) Pause Young (Allocation Failure)
[2021-04-08T16:14:17.911+0300][2.495s] GC(2) Using 4 workers of 4 for evacuation
[2021-04-08T16:14:17.911+0300][2.502s] GC(2) ParNew: 97031K->12892K(109248K)
[2021-04-08T16:14:17.911+0300][2.502s] GC(2) CMS: 0K->0K(393216K)
[2021-04-08T16:14:17.911+0300][2.502s] GC(2) Metaspace: 28239K->28239K(1075200K)
[2021-04-08T16:14:17.911+0300][2.502s] GC(2) Pause Young (Allocation Failure) 94M->12M(490M) 6.867ms
[2021-04-08T16:14:17.911+0300][2.502s] GC(2) User=0.00s Sys=0.00s Real=0.00s
[2021-04-08T16:14:22.864+0300][7.446s] GC(1) Concurrent Abortable Preclean 6017.217ms
[2021-04-08T16:14:22.864+0300][7.446s] GC(1) User=5.16s Sys=0.13s Real=6.02s
[2021-04-08T16:14:22.864+0300][7.446s] GC(1) Pause Remark
[2021-04-08T16:14:22.864+0300][7.446s] GC(3) Pause Young (CMS Final Remark)
[2021-04-08T16:14:22.864+0300][7.446s] GC(3) Using 4 workers of 4 for evacuation
[2021-04-08T16:14:22.864+0300][7.453s] GC(3) ParNew: 45213K->19170K(109248K)
[2021-04-08T16:14:22.864+0300][7.453s] GC(3) CMS: 0K->0K(393216K)
[2021-04-08T16:14:22.864+0300][7.453s] GC(3) Metaspace: 31727K->31727K(1079296K)
[2021-04-08T16:14:22.864+0300][7.453s] GC(3) Pause Young (CMS Final Remark) 44M->18M(490M) 7.094ms
[2021-04-08T16:14:22.864+0300][7.453s] GC(3) User=0.00s Sys=0.00s Real=0.00s
[2021-04-08T16:14:22.880+0300][7.462s] GC(1) Pause Remark 44M->18M(490M) 15.700ms
[2021-04-08T16:14:22.880+0300][7.462s] GC(1) User=0.02s Sys=0.00s Real=0.02s
[2021-04-08T16:14:22.880+0300][7.462s] GC(1) Concurrent Sweep
[2021-04-08T16:14:22.880+0300][7.462s] GC(1) Concurrent Sweep 0.043ms
[2021-04-08T16:14:22.880+0300][7.462s] GC(1) User=0.00s Sys=0.00s Real=0.00s
[2021-04-08T16:14:22.880+0300][7.462s] GC(1) Concurrent Reset
[2021-04-08T16:14:22.880+0300][7.464s] GC(1) Concurrent Reset 2.189ms
[2021-04-08T16:14:22.880+0300][7.464s] GC(1) User=0.00s Sys=0.00s Real=0.00s
[2021-04-08T16:14:22.880+0300][7.464s] GC(1) Old: 0K->0K(393216K)
[2021-04-08T16:14:27.802+0300][12.387s] GC(4) Pause Young (Allocation Failure)
[2021-04-08T16:14:27.802+0300][12.387s] GC(4) Using 4 workers of 4 for evacuation
[2021-04-08T16:14:27.802+0300][12.394s] GC(4) ParNew: 106594K->17222K(109248K)
[2021-04-08T16:14:27.802+0300][12.394s] GC(4) CMS: 0K->0K(393216K)
[2021-04-08T16:14:27.802+0300][12.394s] GC(4) Metaspace: 35739K->35739K(1081344K)
[2021-04-08T16:14:27.802+0300][12.395s] GC(4) Pause Young (Allocation Failure) 104M->16M(490M) 7.874ms
[2021-04-08T16:14:27.802+0300][12.395s] GC(4) User=0.00s Sys=0.00s Real=0.00s
[2021-04-08T16:14:28.068+0300][12.658s] GC(5) Pause Young (Allocation Failure)
[2021-04-08T16:14:28.068+0300][12.658s] GC(5) Using 4 workers of 4 for evacuation
[2021-04-08T16:14:28.083+0300][12.666s] GC(5) ParNew: 104646K->21824K(109248K)
[2021-04-08T16:14:28.083+0300][12.666s] GC(5) CMS: 0K->16K(393216K)
[2021-04-08T16:14:28.083+0300][12.666s] GC(5) Metaspace: 36613K->36613K(1083392K)
[2021-04-08T16:14:28.083+0300][12.666s] GC(5) Pause Young (Allocation Failure) 102M->21M(490M) 8.612ms
[2021-04-08T16:14:28.083+0300][12.667s] GC(5) User=0.06s Sys=0.00s Real=0.01s
[2021-04-08T16:14:28.146+0300][12.734s] GC(6) Pause Young (Allocation Failure)
[2021-04-08T16:14:28.146+0300][12.734s] GC(6) Using 4 workers of 4 for evacuation
[2021-04-08T16:14:28.161+0300][12.743s] GC(6) ParNew: 109248K->21824K(109248K)
[2021-04-08T16:14:28.161+0300][12.743s] GC(6) CMS: 16K->16K(393216K)
[2021-04-08T16:14:28.161+0300][12.743s] GC(6) Metaspace: 36773K->36773K(1083392K)
[2021-04-08T16:14:28.161+0300][12.743s] GC(6) Pause Young (Allocation Failure) 106M->21M(490M) 8.558ms
[2021-04-08T16:14:28.161+0300][12.743s] GC(6) User=0.06s Sys=0.00s Real=0.02s
[2021-04-08T16:14:28.208+0300][12.803s] GC(7) Pause Young (Allocation Failure)
[2021-04-08T16:14:28.208+0300][12.803s] GC(7) Using 4 workers of 4 for evacuation
[2021-04-08T16:14:28.224+0300][12.813s] GC(7) ParNew: 109248K->21824K(109248K)
[2021-04-08T16:14:28.224+0300][12.813s] GC(7) CMS: 16K->185K(393216K)
[2021-04-08T16:14:28.224+0300][12.813s] GC(7) Metaspace: 36974K->36974K(1083392K)
[2021-04-08T16:14:28.224+0300][12.813s] GC(7) Pause Young (Allocation Failure) 106M->21M(490M) 9.751ms
[2021-04-08T16:14:28.224+0300][12.813s] GC(7) User=0.06s Sys=0.00s Real=0.02s
[2021-04-08T16:14:28.771+0300][13.358s] GC(8) Pause Young (Allocation Failure)
[2021-04-08T16:14:28.771+0300][13.358s] GC(8) Using 4 workers of 4 for evacuation
[2021-04-08T16:14:28.786+0300][13.373s] GC(8) ParNew: 109248K->21824K(109248K)
[2021-04-08T16:14:28.786+0300][13.373s] GC(8) CMS: 185K->2072K(393216K)
[2021-04-08T16:14:28.786+0300][13.373s] GC(8) Metaspace: 40438K->40438K(1085440K)
[2021-04-08T16:14:28.786+0300][13.373s] GC(8) Pause Young (Allocation Failure) 106M->23M(490M) 14.882ms
[2021-04-08T16:14:28.786+0300][13.373s] GC(8) User=0.06s Sys=0.00s Real=0.02s
[2021-04-08T16:14:29.271+0300][13.863s] GC(9) Pause Young (Allocation Failure)
[2021-04-08T16:14:29.271+0300][13.863s] GC(9) Using 4 workers of 4 for evacuation
[2021-04-08T16:14:29.302+0300][13.882s] GC(9) ParNew: 109248K->19982K(109248K)
[2021-04-08T16:14:29.302+0300][13.883s] GC(9) CMS: 2072K->10360K(393216K)
[2021-04-08T16:14:29.302+0300][13.883s] GC(9) Metaspace: 46203K->46203K(1091584K)
[2021-04-08T16:14:29.302+0300][13.883s] GC(9) Pause Young (Allocation Failure) 108M->29M(490M) 19.475ms
[2021-04-08T16:14:29.302+0300][13.883s] GC(9) User=0.11s Sys=0.02s Real=0.03s
[2021-04-08T16:14:38.334+0300][22.923s] GC(10) Pause Young (Allocation Failure)
[2021-04-08T16:14:38.334+0300][22.923s] GC(10) Using 4 workers of 4 for evacuation
[2021-04-08T16:14:38.350+0300][22.939s] GC(10) ParNew: 107406K->21824K(109248K)
[2021-04-08T16:14:38.350+0300][22.939s] GC(10) CMS: 10360K->12946K(393216K)
[2021-04-08T16:14:38.350+0300][22.939s] GC(10) Metaspace: 51019K->51019K(1095680K)
[2021-04-08T16:14:38.350+0300][22.939s] GC(10) Pause Young (Allocation Failure) 115M->33M(490M) 15.450ms
[2021-04-08T16:14:38.350+0300][22.939s] GC(10) User=0.06s Sys=0.00s Real=0.02s
[2021-04-08T16:34:04.447+0300][1189.028s] Heap
[2021-04-08T16:34:04.447+0300][1189.028s]  par new generation   total 109248K, used 79620K [0x00000000e0000000, 0x00000000e8000000, 0x00000000e8000000)
[2021-04-08T16:34:04.447+0300][1189.028s]   eden space 87424K,  66% used [0x00000000e0000000, 0x00000000e3871298, 0x00000000e5560000)
[2021-04-08T16:34:04.447+0300][1189.028s]   from space 21824K, 100% used [0x00000000e5560000, 0x00000000e6ab0000, 0x00000000e6ab0000)
[2021-04-08T16:34:04.447+0300][1189.028s]   to   space 21824K,   0% used [0x00000000e6ab0000, 0x00000000e6ab0000, 0x00000000e8000000)
[2021-04-08T16:34:04.447+0300][1189.028s]  concurrent mark-sweep generation total 393216K, used 12946K [0x00000000e8000000, 0x0000000100000000, 0x0000000100000000)
[2021-04-08T16:34:04.447+0300][1189.028s]  Metaspace       used 53486K, capacity 54681K, committed 54888K, reserved 1097728K
[2021-04-08T16:34:04.447+0300][1189.028s]   class space    used 6120K, capacity 6589K, committed 6652K, reserved 1048576K
