[2021-04-07T22:50:28.988+0300][0.006s] Using Concurrent Mark Sweep
[2021-04-07T22:50:28.988+0300][0.006s] Heap address: 0x00000000e0000000, size: 512 MB, Compressed Oops mode: 32-bit
[2021-04-07T22:50:30.364+0300][1.381s] GC(0) Pause Young (Allocation Failure)
[2021-04-07T22:50:30.364+0300][1.382s] GC(0) Using 4 workers of 4 for evacuation
[2021-04-07T22:50:30.374+0300][1.388s] GC(0) ParNew: 87424K->9603K(109248K)
[2021-04-07T22:50:30.374+0300][1.388s] GC(0) CMS: 0K->0K(393216K)
[2021-04-07T22:50:30.374+0300][1.388s] GC(0) Metaspace: 22507K->22507K(1071104K)
[2021-04-07T22:50:30.374+0300][1.388s] GC(0) Pause Young (Allocation Failure) 85M->9M(490M) 6.879ms
[2021-04-07T22:50:30.374+0300][1.388s] GC(0) User=0.03s Sys=0.03s Real=0.01s
[2021-04-07T22:50:30.374+0300][1.389s] GC(1) Pause Initial Mark
[2021-04-07T22:50:30.374+0300][1.390s] GC(1) Pause Initial Mark 12M->12M(490M) 1.261ms
[2021-04-07T22:50:30.374+0300][1.390s] GC(1) User=0.00s Sys=0.00s Real=0.00s
[2021-04-07T22:50:30.374+0300][1.390s] GC(1) Concurrent Mark
[2021-04-07T22:50:30.374+0300][1.390s] GC(1) Using 4 workers of 4 for marking
[2021-04-07T22:50:30.379+0300][1.392s] GC(1) Concurrent Mark 2.077ms
[2021-04-07T22:50:30.379+0300][1.392s] GC(1) User=0.00s Sys=0.00s Real=0.00s
[2021-04-07T22:50:30.379+0300][1.392s] GC(1) Concurrent Preclean
[2021-04-07T22:50:30.379+0300][1.393s] GC(1) Concurrent Preclean 0.379ms
[2021-04-07T22:50:30.379+0300][1.393s] GC(1) User=0.00s Sys=0.00s Real=0.00s
[2021-04-07T22:50:30.379+0300][1.393s] GC(1) Concurrent Abortable Preclean
[2021-04-07T22:50:31.214+0300][2.229s] GC(2) Pause Young (Allocation Failure)
[2021-04-07T22:50:31.214+0300][2.229s] GC(2) Using 4 workers of 4 for evacuation
[2021-04-07T22:50:31.224+0300][2.238s] GC(2) ParNew: 97027K->15376K(109248K)
[2021-04-07T22:50:31.224+0300][2.238s] GC(2) CMS: 0K->0K(393216K)
[2021-04-07T22:50:31.224+0300][2.238s] GC(2) Metaspace: 30167K->30167K(1077248K)
[2021-04-07T22:50:31.224+0300][2.238s] GC(2) Pause Young (Allocation Failure) 94M->15M(490M) 8.887ms
[2021-04-07T22:50:31.224+0300][2.238s] GC(2) User=0.00s Sys=0.00s Real=0.01s
[2021-04-07T22:50:36.431+0300][7.445s] GC(1) Concurrent Abortable Preclean 6052.687ms
[2021-04-07T22:50:36.431+0300][7.445s] GC(1) User=4.94s Sys=0.19s Real=6.05s
[2021-04-07T22:50:36.431+0300][7.446s] GC(1) Pause Remark
[2021-04-07T22:50:36.431+0300][7.446s] GC(3) Pause Young (CMS Final Remark)
[2021-04-07T22:50:36.431+0300][7.446s] GC(3) Using 4 workers of 4 for evacuation
[2021-04-07T22:50:36.436+0300][7.452s] GC(3) ParNew: 38648K->18292K(109248K)
[2021-04-07T22:50:36.436+0300][7.452s] GC(3) CMS: 0K->0K(393216K)
[2021-04-07T22:50:36.436+0300][7.452s] GC(3) Metaspace: 31808K->31808K(1079296K)
[2021-04-07T22:50:36.436+0300][7.452s] GC(3) Pause Young (CMS Final Remark) 37M->17M(490M) 6.615ms
[2021-04-07T22:50:36.436+0300][7.452s] GC(3) User=0.00s Sys=0.00s Real=0.01s
[2021-04-07T22:50:36.441+0300][7.459s] GC(1) Pause Remark 37M->17M(490M) 13.031ms
[2021-04-07T22:50:36.441+0300][7.459s] GC(1) User=0.00s Sys=0.00s Real=0.01s
[2021-04-07T22:50:36.441+0300][7.459s] GC(1) Concurrent Sweep
[2021-04-07T22:50:36.441+0300][7.459s] GC(1) Concurrent Sweep 0.053ms
[2021-04-07T22:50:36.441+0300][7.459s] GC(1) User=0.00s Sys=0.00s Real=0.00s
[2021-04-07T22:50:36.441+0300][7.459s] GC(1) Concurrent Reset
[2021-04-07T22:50:36.446+0300][7.461s] GC(1) Concurrent Reset 2.531ms
[2021-04-07T22:50:36.446+0300][7.461s] GC(1) User=0.03s Sys=0.00s Real=0.01s
[2021-04-07T22:50:36.446+0300][7.461s] GC(1) Old: 0K->0K(393216K)
[2021-04-07T22:50:40.820+0300][11.836s] GC(4) Pause Young (Allocation Failure)
[2021-04-07T22:50:40.820+0300][11.836s] GC(4) Using 4 workers of 4 for evacuation
[2021-04-07T22:50:40.830+0300][11.844s] GC(4) ParNew: 105716K->19567K(109248K)
[2021-04-07T22:50:40.830+0300][11.844s] GC(4) CMS: 0K->0K(393216K)
[2021-04-07T22:50:40.830+0300][11.844s] GC(4) Metaspace: 37314K->37314K(1083392K)
[2021-04-07T22:50:40.830+0300][11.844s] GC(4) Pause Young (Allocation Failure) 103M->19M(490M) 8.616ms
[2021-04-07T22:50:40.830+0300][11.844s] GC(4) User=0.06s Sys=0.00s Real=0.01s
[2021-04-07T22:50:40.975+0300][11.993s] GC(5) Pause Young (Allocation Failure)
[2021-04-07T22:50:40.975+0300][11.993s] GC(5) Using 4 workers of 4 for evacuation
[2021-04-07T22:50:40.985+0300][12.002s] GC(5) ParNew: 106991K->19134K(109248K)
[2021-04-07T22:50:40.985+0300][12.002s] GC(5) CMS: 0K->0K(393216K)
[2021-04-07T22:50:40.985+0300][12.002s] GC(5) Metaspace: 38294K->38294K(1083392K)
[2021-04-07T22:50:40.985+0300][12.002s] GC(5) Pause Young (Allocation Failure) 104M->18M(490M) 8.799ms
[2021-04-07T22:50:40.985+0300][12.002s] GC(5) User=0.06s Sys=0.00s Real=0.01s
[2021-04-07T22:50:41.055+0300][12.070s] GC(6) Pause Young (Allocation Failure)
[2021-04-07T22:50:41.055+0300][12.070s] GC(6) Using 4 workers of 4 for evacuation
[2021-04-07T22:50:41.065+0300][12.080s] GC(6) ParNew: 106558K->21824K(109248K)
[2021-04-07T22:50:41.065+0300][12.080s] GC(6) CMS: 0K->58K(393216K)
[2021-04-07T22:50:41.065+0300][12.080s] GC(6) Metaspace: 38444K->38444K(1085440K)
[2021-04-07T22:50:41.065+0300][12.080s] GC(6) Pause Young (Allocation Failure) 104M->21M(490M) 9.931ms
[2021-04-07T22:50:41.065+0300][12.080s] GC(6) User=0.00s Sys=0.00s Real=0.01s
[2021-04-07T22:50:41.130+0300][12.146s] GC(7) Pause Young (Allocation Failure)
[2021-04-07T22:50:41.130+0300][12.146s] GC(7) Using 4 workers of 4 for evacuation
[2021-04-07T22:50:41.140+0300][12.156s] GC(7) ParNew: 109248K->21824K(109248K)
[2021-04-07T22:50:41.140+0300][12.156s] GC(7) CMS: 58K->58K(393216K)
[2021-04-07T22:50:41.140+0300][12.156s] GC(7) Metaspace: 38652K->38652K(1085440K)
[2021-04-07T22:50:41.140+0300][12.156s] GC(7) Pause Young (Allocation Failure) 106M->21M(490M) 9.264ms
[2021-04-07T22:50:41.140+0300][12.156s] GC(7) User=0.06s Sys=0.00s Real=0.01s
[2021-04-07T22:50:41.540+0300][12.559s] GC(8) Pause Young (Allocation Failure)
[2021-04-07T22:50:41.540+0300][12.559s] GC(8) Using 4 workers of 4 for evacuation
[2021-04-07T22:50:41.555+0300][12.573s] GC(8) ParNew: 109233K->21824K(109248K)
[2021-04-07T22:50:41.555+0300][12.573s] GC(8) CMS: 58K->1613K(393216K)
[2021-04-07T22:50:41.555+0300][12.573s] GC(8) Metaspace: 42690K->42690K(1087488K)
[2021-04-07T22:50:41.555+0300][12.573s] GC(8) Pause Young (Allocation Failure) 106M->22M(490M) 14.640ms
[2021-04-07T22:50:41.555+0300][12.573s] GC(8) User=0.06s Sys=0.00s Real=0.02s
[2021-04-07T22:50:41.993+0300][13.007s] GC(9) Pause Young (Allocation Failure)
[2021-04-07T22:50:41.993+0300][13.007s] GC(9) Using 4 workers of 4 for evacuation
[2021-04-07T22:50:42.008+0300][13.022s] GC(9) ParNew: 109248K->21824K(109248K)
[2021-04-07T22:50:42.008+0300][13.022s] GC(9) CMS: 1613K->10445K(393216K)
[2021-04-07T22:50:42.008+0300][13.022s] GC(9) Metaspace: 46714K->46714K(1091584K)
[2021-04-07T22:50:42.008+0300][13.022s] GC(9) Pause Young (Allocation Failure) 108M->31M(490M) 15.297ms
[2021-04-07T22:50:42.008+0300][13.022s] GC(9) User=0.03s Sys=0.00s Real=0.01s
[2021-04-07T22:50:48.243+0300][19.257s] GC(10) Pause Young (Allocation Failure)
[2021-04-07T22:50:48.243+0300][19.257s] GC(10) Using 4 workers of 4 for evacuation
[2021-04-07T22:50:48.269+0300][19.283s] GC(10) ParNew: 109248K->21824K(109248K)
[2021-04-07T22:50:48.269+0300][19.283s] GC(10) CMS: 10445K->21768K(393216K)
[2021-04-07T22:50:48.269+0300][19.283s] GC(10) Metaspace: 50886K->50886K(1095680K)
[2021-04-07T22:50:48.269+0300][19.283s] GC(10) Pause Young (Allocation Failure) 116M->42M(490M) 25.688ms
[2021-04-07T22:50:48.269+0300][19.283s] GC(10) User=0.05s Sys=0.00s Real=0.03s
[2021-04-08T01:14:43.248+0300][8654.263s] GC(11) Pause Young (Allocation Failure)
[2021-04-08T01:14:43.248+0300][8654.263s] GC(11) Using 4 workers of 4 for evacuation
[2021-04-08T01:14:43.283+0300][8654.298s] GC(11) ParNew: 109248K->21824K(109248K)
[2021-04-08T01:14:43.283+0300][8654.298s] GC(11) CMS: 21768K->25384K(393216K)
[2021-04-08T01:14:43.283+0300][8654.298s] GC(11) Metaspace: 51770K->51770K(1095680K)
[2021-04-08T01:14:43.283+0300][8654.298s] GC(11) Pause Young (Allocation Failure) 127M->46M(490M) 35.860ms
[2021-04-08T01:14:43.283+0300][8654.298s] GC(11) User=0.11s Sys=0.02s Real=0.04s
[2021-04-08T03:05:04.995+0300][15276.009s] GC(12) Pause Young (Allocation Failure)
[2021-04-08T03:05:04.995+0300][15276.010s] GC(12) Using 4 workers of 4 for evacuation
[2021-04-08T03:05:05.005+0300][15276.023s] GC(12) ParNew: 109248K->21824K(109248K)
[2021-04-08T03:05:05.005+0300][15276.023s] GC(12) CMS: 25384K->30767K(393216K)
[2021-04-08T03:05:05.005+0300][15276.023s] GC(12) Metaspace: 53969K->53969K(1097728K)
[2021-04-08T03:05:05.005+0300][15276.023s] GC(12) Pause Young (Allocation Failure) 131M->51M(490M) 13.769ms
[2021-04-08T03:05:05.005+0300][15276.023s] GC(12) User=0.00s Sys=0.00s Real=0.01s
[2021-04-08T03:05:05.005+0300][15276.023s] GC(13) Pause Initial Mark
[2021-04-08T03:05:05.010+0300][15276.027s] GC(13) Pause Initial Mark 51M->51M(490M) 3.762ms
[2021-04-08T03:05:05.010+0300][15276.027s] GC(13) User=0.05s Sys=0.02s Real=0.00s
[2021-04-08T03:05:05.010+0300][15276.027s] GC(13) Concurrent Mark
[2021-04-08T03:05:05.010+0300][15276.027s] GC(13) Using 4 workers of 4 for marking
[2021-04-08T03:05:05.025+0300][15276.041s] GC(13) Concurrent Mark 13.772ms
[2021-04-08T03:05:05.025+0300][15276.041s] GC(13) User=0.06s Sys=0.00s Real=0.02s
[2021-04-08T03:05:05.025+0300][15276.041s] GC(13) Concurrent Preclean
[2021-04-08T03:05:05.025+0300][15276.043s] GC(13) Concurrent Preclean 1.715ms
[2021-04-08T03:05:05.025+0300][15276.043s] GC(13) User=0.00s Sys=0.00s Real=0.00s
[2021-04-08T03:05:05.025+0300][15276.043s] GC(13) Pause Remark
[2021-04-08T03:05:05.025+0300][15276.043s] GC(14) Pause Young (CMS Final Remark)
[2021-04-08T03:05:05.025+0300][15276.043s] GC(14) Using 4 workers of 4 for evacuation
[2021-04-08T03:05:05.040+0300][15276.058s] GC(14) ParNew: 22289K->21824K(109248K)
[2021-04-08T03:05:05.040+0300][15276.058s] GC(14) CMS: 30767K->30767K(393216K)
[2021-04-08T03:05:05.040+0300][15276.058s] GC(14) Metaspace: 53970K->53970K(1097728K)
[2021-04-08T03:05:05.040+0300][15276.058s] GC(14) Pause Young (CMS Final Remark) 51M->51M(490M) 15.020ms
[2021-04-08T03:05:05.040+0300][15276.058s] GC(14) User=0.06s Sys=0.00s Real=0.01s
[2021-04-08T03:05:05.070+0300][15276.085s] GC(13) Pause Remark 51M->51M(490M) 42.268ms
[2021-04-08T03:05:05.070+0300][15276.085s] GC(13) User=0.09s Sys=0.00s Real=0.04s
[2021-04-08T03:05:05.070+0300][15276.085s] GC(13) Concurrent Sweep
[2021-04-08T03:05:05.080+0300][15276.094s] GC(13) Concurrent Sweep 8.752ms
[2021-04-08T03:05:05.080+0300][15276.094s] GC(13) User=0.06s Sys=0.00s Real=0.01s
[2021-04-08T03:05:05.080+0300][15276.094s] GC(13) Concurrent Reset
[2021-04-08T03:05:05.080+0300][15276.098s] GC(13) Concurrent Reset 3.687ms
[2021-04-08T03:05:05.080+0300][15276.098s] GC(13) User=0.00s Sys=0.00s Real=0.00s
[2021-04-08T03:05:05.080+0300][15276.098s] GC(13) Old: 30767K->28349K(393216K)
[2021-04-08T03:05:05.130+0300][15276.146s] GC(15) Pause Young (Allocation Failure)
[2021-04-08T03:05:05.130+0300][15276.146s] GC(15) Using 4 workers of 4 for evacuation
[2021-04-08T03:05:05.140+0300][15276.155s] GC(15) ParNew: 109246K->21824K(109248K)
[2021-04-08T03:05:05.140+0300][15276.155s] GC(15) CMS: 28349K->28349K(393216K)
[2021-04-08T03:05:05.140+0300][15276.155s] GC(15) Metaspace: 53747K->53747K(1097728K)
[2021-04-08T03:05:05.140+0300][15276.155s] GC(15) Pause Young (Allocation Failure) 134M->48M(490M) 9.304ms
[2021-04-08T03:05:05.140+0300][15276.155s] GC(15) User=0.06s Sys=0.00s Real=0.01s
[2021-04-08T03:05:14.363+0300][15285.381s] GC(16) Pause Young (Allocation Failure)
[2021-04-08T03:05:14.363+0300][15285.381s] GC(16) Using 4 workers of 4 for evacuation
[2021-04-08T03:05:14.373+0300][15285.392s] GC(16) ParNew: 109248K->21824K(109248K)
[2021-04-08T03:05:14.373+0300][15285.392s] GC(16) CMS: 28349K->29087K(393216K)
[2021-04-08T03:05:14.373+0300][15285.392s] GC(16) Metaspace: 53918K->53918K(1097728K)
[2021-04-08T03:05:14.373+0300][15285.392s] GC(16) Pause Young (Allocation Failure) 134M->49M(490M) 10.361ms
[2021-04-08T03:05:14.373+0300][15285.392s] GC(16) User=0.06s Sys=0.00s Real=0.01s
[2021-04-08T03:05:18.907+0300][15289.921s] GC(17) Pause Young (Allocation Failure)
[2021-04-08T03:05:18.907+0300][15289.921s] GC(17) Using 4 workers of 4 for evacuation
[2021-04-08T03:05:18.937+0300][15289.951s] GC(17) ParNew: 109248K->21824K(109248K)
[2021-04-08T03:05:18.937+0300][15289.951s] GC(17) CMS: 29087K->62270K(393216K)
[2021-04-08T03:05:18.937+0300][15289.951s] GC(17) Metaspace: 55516K->55516K(1099776K)
[2021-04-08T03:05:18.937+0300][15289.951s] GC(17) Pause Young (Allocation Failure) 135M->82M(490M) 29.764ms
[2021-04-08T03:05:18.937+0300][15289.951s] GC(17) User=0.11s Sys=0.02s Real=0.03s
[2021-04-08T03:05:25.912+0300][15296.926s] GC(18) Pause Young (Allocation Failure)
[2021-04-08T03:05:25.912+0300][15296.926s] GC(18) Using 4 workers of 4 for evacuation
[2021-04-08T03:05:25.924+0300][15296.938s] GC(18) ParNew: 109248K->21824K(109248K)
[2021-04-08T03:05:25.924+0300][15296.938s] GC(18) CMS: 62270K->72564K(393216K)
[2021-04-08T03:05:25.924+0300][15296.938s] GC(18) Metaspace: 56481K->56481K(1101824K)
[2021-04-08T03:05:25.924+0300][15296.938s] GC(18) Pause Young (Allocation Failure) 167M->92M(490M) 12.277ms
[2021-04-08T03:05:25.924+0300][15296.938s] GC(18) User=0.06s Sys=0.00s Real=0.01s
[2021-04-08T03:05:26.829+0300][15297.844s] GC(19) Pause Young (Allocation Failure)
[2021-04-08T03:05:26.829+0300][15297.844s] GC(19) Using 4 workers of 4 for evacuation
[2021-04-08T03:05:26.834+0300][15297.853s] GC(19) ParNew: 109248K->21824K(109248K)
[2021-04-08T03:05:26.839+0300][15297.853s] GC(19) CMS: 72564K->74684K(393216K)
[2021-04-08T03:05:26.839+0300][15297.853s] GC(19) Metaspace: 57538K->57538K(1101824K)
[2021-04-08T03:05:26.839+0300][15297.853s] GC(19) Pause Young (Allocation Failure) 177M->94M(490M) 8.737ms
[2021-04-08T03:05:26.839+0300][15297.853s] GC(19) User=0.02s Sys=0.02s Real=0.01s
[2021-04-08T03:05:27.089+0300][15298.103s] GC(20) Pause Young (Allocation Failure)
[2021-04-08T03:05:27.089+0300][15298.103s] GC(20) Using 4 workers of 4 for evacuation
[2021-04-08T03:05:27.094+0300][15298.109s] GC(20) ParNew: 109248K->21824K(109248K)
[2021-04-08T03:05:27.094+0300][15298.109s] GC(20) CMS: 74684K->75078K(393216K)
[2021-04-08T03:05:27.094+0300][15298.109s] GC(20) Metaspace: 58029K->58029K(1101824K)
[2021-04-08T03:05:27.094+0300][15298.109s] GC(20) Pause Young (Allocation Failure) 179M->94M(490M) 6.215ms
[2021-04-08T03:05:27.094+0300][15298.109s] GC(20) User=0.00s Sys=0.00s Real=0.01s
[2021-04-08T07:01:49.765+0300][29480.780s] GC(21) Pause Young (Allocation Failure)
[2021-04-08T07:01:49.765+0300][29480.780s] GC(21) Using 4 workers of 4 for evacuation
[2021-04-08T07:01:49.775+0300][29480.789s] GC(21) ParNew: 109248K->21824K(109248K)
[2021-04-08T07:01:49.775+0300][29480.789s] GC(21) CMS: 75078K->78253K(393216K)
[2021-04-08T07:01:49.775+0300][29480.789s] GC(21) Metaspace: 58111K->58111K(1101824K)
[2021-04-08T07:01:49.775+0300][29480.789s] GC(21) Pause Young (Allocation Failure) 180M->97M(490M) 9.412ms
[2021-04-08T07:01:49.775+0300][29480.789s] GC(21) User=0.03s Sys=0.00s Real=0.01s
[2021-04-08T07:07:11.415+0300][29802.431s] Heap
[2021-04-08T07:07:11.415+0300][29802.431s]  par new generation   total 109248K, used 39926K [0x00000000e0000000, 0x00000000e8000000, 0x00000000e8000000)
[2021-04-08T07:07:11.415+0300][29802.431s]   eden space 87424K,  20% used [0x00000000e0000000, 0x00000000e11ad870, 0x00000000e5560000)
[2021-04-08T07:07:11.415+0300][29802.431s]   from space 21824K, 100% used [0x00000000e5560000, 0x00000000e6ab0000, 0x00000000e6ab0000)
[2021-04-08T07:07:11.415+0300][29802.431s]   to   space 21824K,   0% used [0x00000000e6ab0000, 0x00000000e6ab0000, 0x00000000e8000000)
[2021-04-08T07:07:11.415+0300][29802.431s]  concurrent mark-sweep generation total 393216K, used 78253K [0x00000000e8000000, 0x0000000100000000, 0x0000000100000000)
[2021-04-08T07:07:11.415+0300][29802.431s]  Metaspace       used 59152K, capacity 60389K, committed 60664K, reserved 1103872K
[2021-04-08T07:07:11.415+0300][29802.431s]   class space    used 6502K, capacity 6993K, committed 7088K, reserved 1048576K
