[2021-04-07T21:37:58.082+0300][0.006s] Using Concurrent Mark Sweep
[2021-04-07T21:37:58.082+0300][0.006s] Heap address: 0x00000000e0000000, size: 512 MB, Compressed Oops mode: 32-bit
[2021-04-07T21:37:59.444+0300][1.367s] GC(0) Pause Young (Allocation Failure)
[2021-04-07T21:37:59.444+0300][1.367s] GC(0) Using 4 workers of 4 for evacuation
[2021-04-07T21:37:59.449+0300][1.374s] GC(0) ParNew: 87424K->9607K(109248K)
[2021-04-07T21:37:59.449+0300][1.374s] GC(0) CMS: 0K->0K(393216K)
[2021-04-07T21:37:59.449+0300][1.374s] GC(0) Metaspace: 22513K->22513K(1071104K)
[2021-04-07T21:37:59.449+0300][1.374s] GC(0) Pause Young (Allocation Failure) 85M->9M(490M) 7.029ms
[2021-04-07T21:37:59.449+0300][1.374s] GC(0) User=0.06s Sys=0.00s Real=0.00s
[2021-04-07T21:37:59.449+0300][1.375s] GC(1) Pause Initial Mark
[2021-04-07T21:37:59.454+0300][1.376s] GC(1) Pause Initial Mark 16M->16M(490M) 1.280ms
[2021-04-07T21:37:59.454+0300][1.376s] GC(1) User=0.00s Sys=0.00s Real=0.01s
[2021-04-07T21:37:59.454+0300][1.376s] GC(1) Concurrent Mark
[2021-04-07T21:37:59.454+0300][1.376s] GC(1) Using 4 workers of 4 for marking
[2021-04-07T21:37:59.464+0300][1.386s] GC(1) Concurrent Mark 9.951ms
[2021-04-07T21:37:59.464+0300][1.386s] GC(1) User=0.03s Sys=0.00s Real=0.01s
[2021-04-07T21:37:59.464+0300][1.386s] GC(1) Concurrent Preclean
[2021-04-07T21:37:59.464+0300][1.386s] GC(1) Concurrent Preclean 0.420ms
[2021-04-07T21:37:59.464+0300][1.386s] GC(1) User=0.00s Sys=0.00s Real=0.00s
[2021-04-07T21:37:59.464+0300][1.386s] GC(1) Concurrent Abortable Preclean
[2021-04-07T21:38:00.434+0300][2.360s] GC(2) Pause Young (Allocation Failure)
[2021-04-07T21:38:00.434+0300][2.360s] GC(2) Using 4 workers of 4 for evacuation
[2021-04-07T21:38:00.444+0300][2.368s] GC(2) ParNew: 97031K->13396K(109248K)
[2021-04-07T21:38:00.444+0300][2.368s] GC(2) CMS: 0K->0K(393216K)
[2021-04-07T21:38:00.444+0300][2.368s] GC(2) Metaspace: 28384K->28384K(1075200K)
[2021-04-07T21:38:00.444+0300][2.368s] GC(2) Pause Young (Allocation Failure) 94M->13M(490M) 8.161ms
[2021-04-07T21:38:00.444+0300][2.368s] GC(2) User=0.00s Sys=0.00s Real=0.01s
[2021-04-07T21:38:05.615+0300][7.542s] GC(1) Concurrent Abortable Preclean 6155.101ms
[2021-04-07T21:38:05.615+0300][7.542s] GC(1) User=5.22s Sys=0.11s Real=6.15s
[2021-04-07T21:38:05.615+0300][7.542s] GC(1) Pause Remark
[2021-04-07T21:38:05.615+0300][7.542s] GC(3) Pause Young (CMS Final Remark)
[2021-04-07T21:38:05.615+0300][7.542s] GC(3) Using 4 workers of 4 for evacuation
[2021-04-07T21:38:05.625+0300][7.549s] GC(3) ParNew: 44386K->16119K(109248K)
[2021-04-07T21:38:05.625+0300][7.549s] GC(3) CMS: 0K->0K(393216K)
[2021-04-07T21:38:05.625+0300][7.549s] GC(3) Metaspace: 31819K->31819K(1079296K)
[2021-04-07T21:38:05.625+0300][7.549s] GC(3) Pause Young (CMS Final Remark) 43M->15M(490M) 6.897ms
[2021-04-07T21:38:05.625+0300][7.549s] GC(3) User=0.06s Sys=0.00s Real=0.01s
[2021-04-07T21:38:05.630+0300][7.555s] GC(1) Pause Remark 43M->15M(490M) 13.327ms
[2021-04-07T21:38:05.630+0300][7.555s] GC(1) User=0.06s Sys=0.00s Real=0.02s
[2021-04-07T21:38:05.630+0300][7.555s] GC(1) Concurrent Sweep
[2021-04-07T21:38:05.630+0300][7.555s] GC(1) Concurrent Sweep 0.043ms
[2021-04-07T21:38:05.630+0300][7.555s] GC(1) User=0.00s Sys=0.00s Real=0.00s
[2021-04-07T21:38:05.630+0300][7.555s] GC(1) Concurrent Reset
[2021-04-07T21:38:05.635+0300][7.558s] GC(1) Concurrent Reset 2.589ms
[2021-04-07T21:38:05.635+0300][7.558s] GC(1) User=0.02s Sys=0.00s Real=0.00s
[2021-04-07T21:38:05.635+0300][7.558s] GC(1) Old: 0K->0K(393216K)
[2021-04-07T21:38:10.206+0300][12.129s] GC(4) Pause Young (Allocation Failure)
[2021-04-07T21:38:10.206+0300][12.129s] GC(4) Using 4 workers of 4 for evacuation
[2021-04-07T21:38:10.211+0300][12.138s] GC(4) ParNew: 103543K->21824K(109248K)
[2021-04-07T21:38:10.211+0300][12.138s] GC(4) CMS: 0K->0K(393216K)
[2021-04-07T21:38:10.211+0300][12.138s] GC(4) Metaspace: 37154K->37154K(1083392K)
[2021-04-07T21:38:10.211+0300][12.138s] GC(4) Pause Young (Allocation Failure) 101M->21M(490M) 9.068ms
[2021-04-07T21:38:10.211+0300][12.138s] GC(4) User=0.00s Sys=0.00s Real=0.00s
[2021-04-07T21:38:10.361+0300][12.286s] GC(5) Pause Young (Allocation Failure)
[2021-04-07T21:38:10.361+0300][12.286s] GC(5) Using 4 workers of 4 for evacuation
[2021-04-07T21:38:10.371+0300][12.296s] GC(5) ParNew: 109248K->21525K(109248K)
[2021-04-07T21:38:10.371+0300][12.296s] GC(5) CMS: 0K->0K(393216K)
[2021-04-07T21:38:10.371+0300][12.296s] GC(5) Metaspace: 38295K->38295K(1083392K)
[2021-04-07T21:38:10.371+0300][12.296s] GC(5) Pause Young (Allocation Failure) 106M->21M(490M) 9.974ms
[2021-04-07T21:38:10.371+0300][12.296s] GC(5) User=0.06s Sys=0.00s Real=0.01s
[2021-04-07T21:38:10.471+0300][12.398s] GC(6) Pause Young (Allocation Failure)
[2021-04-07T21:38:10.471+0300][12.398s] GC(6) Using 4 workers of 4 for evacuation
[2021-04-07T21:38:10.481+0300][12.408s] GC(6) ParNew: 108949K->21824K(109248K)
[2021-04-07T21:38:10.481+0300][12.408s] GC(6) CMS: 0K->0K(393216K)
[2021-04-07T21:38:10.481+0300][12.408s] GC(6) Metaspace: 38610K->38610K(1085440K)
[2021-04-07T21:38:10.481+0300][12.408s] GC(6) Pause Young (Allocation Failure) 106M->21M(490M) 9.957ms
[2021-04-07T21:38:10.481+0300][12.408s] GC(6) User=0.06s Sys=0.00s Real=0.01s
[2021-04-07T21:38:10.594+0300][12.516s] GC(7) Pause Young (Allocation Failure)
[2021-04-07T21:38:10.594+0300][12.516s] GC(7) Using 4 workers of 4 for evacuation
[2021-04-07T21:38:10.604+0300][12.527s] GC(7) ParNew: 109248K->21824K(109248K)
[2021-04-07T21:38:10.604+0300][12.527s] GC(7) CMS: 0K->650K(393216K)
[2021-04-07T21:38:10.604+0300][12.527s] GC(7) Metaspace: 39326K->39326K(1085440K)
[2021-04-07T21:38:10.604+0300][12.527s] GC(7) Pause Young (Allocation Failure) 106M->21M(490M) 10.675ms
[2021-04-07T21:38:10.605+0300][12.527s] GC(7) User=0.05s Sys=0.02s Real=0.01s
[2021-04-07T21:38:11.304+0300][13.227s] GC(8) Pause Young (Allocation Failure)
[2021-04-07T21:38:11.304+0300][13.227s] GC(8) Using 4 workers of 4 for evacuation
[2021-04-07T21:38:11.318+0300][13.241s] GC(8) ParNew: 109248K->21824K(109248K)
[2021-04-07T21:38:11.318+0300][13.241s] GC(8) CMS: 650K->3688K(393216K)
[2021-04-07T21:38:11.318+0300][13.241s] GC(8) Metaspace: 43583K->43583K(1089536K)
[2021-04-07T21:38:11.318+0300][13.241s] GC(8) Pause Young (Allocation Failure) 107M->24M(490M) 13.913ms
[2021-04-07T21:38:11.318+0300][13.241s] GC(8) User=0.06s Sys=0.00s Real=0.01s
[2021-04-07T21:38:11.741+0300][13.663s] GC(9) Pause Young (Allocation Failure)
[2021-04-07T21:38:11.741+0300][13.663s] GC(9) Using 4 workers of 4 for evacuation
[2021-04-07T21:38:11.756+0300][13.678s] GC(9) ParNew: 109248K->21824K(109248K)
[2021-04-07T21:38:11.756+0300][13.678s] GC(9) CMS: 3688K->11409K(393216K)
[2021-04-07T21:38:11.756+0300][13.678s] GC(9) Metaspace: 46691K->46691K(1091584K)
[2021-04-07T21:38:11.756+0300][13.678s] GC(9) Pause Young (Allocation Failure) 110M->32M(490M) 15.111ms
[2021-04-07T21:38:11.756+0300][13.678s] GC(9) User=0.06s Sys=0.00s Real=0.02s
[2021-04-07T21:38:17.897+0300][19.822s] GC(10) Pause Young (Allocation Failure)
[2021-04-07T21:38:17.897+0300][19.822s] GC(10) Using 4 workers of 4 for evacuation
[2021-04-07T21:38:17.917+0300][19.841s] GC(10) ParNew: 109248K->21824K(109248K)
[2021-04-07T21:38:17.917+0300][19.841s] GC(10) CMS: 11409K->17644K(393216K)
[2021-04-07T21:38:17.917+0300][19.841s] GC(10) Metaspace: 51026K->51026K(1095680K)
[2021-04-07T21:38:17.917+0300][19.841s] GC(10) Pause Young (Allocation Failure) 117M->38M(490M) 18.925ms
[2021-04-07T21:38:17.917+0300][19.841s] GC(10) User=0.13s Sys=0.00s Real=0.02s
[2021-04-07T21:55:19.490+0300][1041.414s] GC(11) Pause Young (Allocation Failure)
[2021-04-07T21:55:19.490+0300][1041.414s] GC(11) Using 4 workers of 4 for evacuation
[2021-04-07T21:55:19.515+0300][1041.442s] GC(11) ParNew: 109217K->21824K(109248K)
[2021-04-07T21:55:19.515+0300][1041.442s] GC(11) CMS: 17644K->27521K(393216K)
[2021-04-07T21:55:19.515+0300][1041.442s] GC(11) Metaspace: 55129K->55129K(1099776K)
[2021-04-07T21:55:19.515+0300][1041.442s] GC(11) Pause Young (Allocation Failure) 123M->48M(490M) 28.001ms
[2021-04-07T21:55:19.515+0300][1041.442s] GC(11) User=0.13s Sys=0.00s Real=0.03s
[2021-04-07T21:55:19.520+0300][1041.442s] GC(12) Pause Initial Mark
[2021-04-07T21:55:19.520+0300][1041.447s] GC(12) Pause Initial Mark 48M->48M(490M) 4.697ms
[2021-04-07T21:55:19.520+0300][1041.447s] GC(12) User=0.00s Sys=0.00s Real=0.00s
[2021-04-07T21:55:19.520+0300][1041.447s] GC(12) Concurrent Mark
[2021-04-07T21:55:19.520+0300][1041.447s] GC(12) Using 4 workers of 4 for marking
[2021-04-07T21:55:19.535+0300][1041.460s] GC(12) Concurrent Mark 12.558ms
[2021-04-07T21:55:19.535+0300][1041.460s] GC(12) User=0.06s Sys=0.00s Real=0.02s
[2021-04-07T21:55:19.535+0300][1041.460s] GC(12) Concurrent Preclean
[2021-04-07T21:55:19.535+0300][1041.461s] GC(12) Concurrent Preclean 1.657ms
[2021-04-07T21:55:19.535+0300][1041.461s] GC(12) User=0.00s Sys=0.00s Real=0.00s
[2021-04-07T21:55:19.535+0300][1041.461s] GC(12) Pause Remark
[2021-04-07T21:55:19.535+0300][1041.462s] GC(13) Pause Young (CMS Final Remark)
[2021-04-07T21:55:19.535+0300][1041.462s] GC(13) Using 4 workers of 4 for evacuation
[2021-04-07T21:55:19.555+0300][1041.480s] GC(13) ParNew: 23325K->21824K(109248K)
[2021-04-07T21:55:19.555+0300][1041.480s] GC(13) CMS: 27521K->33931K(393216K)
[2021-04-07T21:55:19.555+0300][1041.480s] GC(13) Metaspace: 55130K->55130K(1099776K)
[2021-04-07T21:55:19.555+0300][1041.480s] GC(13) Pause Young (CMS Final Remark) 49M->54M(490M) 18.456ms
[2021-04-07T21:55:19.555+0300][1041.480s] GC(13) User=0.11s Sys=0.02s Real=0.02s
[2021-04-07T21:55:19.580+0300][1041.507s] GC(12) Pause Remark 49M->54M(490M) 45.045ms
[2021-04-07T21:55:19.580+0300][1041.507s] GC(12) User=0.13s Sys=0.02s Real=0.04s
[2021-04-07T21:55:19.580+0300][1041.507s] GC(12) Concurrent Sweep
[2021-04-07T21:55:19.590+0300][1041.517s] GC(12) Concurrent Sweep 10.567ms
[2021-04-07T21:55:19.590+0300][1041.517s] GC(12) User=0.06s Sys=0.00s Real=0.01s
[2021-04-07T21:55:19.595+0300][1041.517s] GC(12) Concurrent Reset
[2021-04-07T21:55:19.595+0300][1041.518s] GC(12) Concurrent Reset 0.888ms
[2021-04-07T21:55:19.595+0300][1041.518s] GC(12) User=0.00s Sys=0.00s Real=0.00s
[2021-04-07T21:55:19.595+0300][1041.518s] GC(12) Old: 27521K->32522K(393216K)
[2021-04-07T21:55:19.660+0300][1041.584s] GC(14) Pause Young (Allocation Failure)
[2021-04-07T21:55:19.660+0300][1041.584s] GC(14) Using 4 workers of 4 for evacuation
[2021-04-07T21:55:19.670+0300][1041.594s] GC(14) ParNew: 109248K->18412K(109248K)
[2021-04-07T21:55:19.670+0300][1041.594s] GC(14) CMS: 32522K->32522K(393216K)
[2021-04-07T21:55:19.670+0300][1041.594s] GC(14) Metaspace: 54901K->54901K(1099776K)
[2021-04-07T21:55:19.670+0300][1041.594s] GC(14) Pause Young (Allocation Failure) 138M->49M(490M) 9.825ms
[2021-04-07T21:55:19.670+0300][1041.594s] GC(14) User=0.06s Sys=0.00s Real=0.01s
[2021-04-07T21:55:29.900+0300][1051.822s] GC(15) Pause Young (Allocation Failure)
[2021-04-07T21:55:29.900+0300][1051.822s] GC(15) Using 4 workers of 4 for evacuation
[2021-04-07T21:55:29.910+0300][1051.832s] GC(15) ParNew: 105836K->21824K(109248K)
[2021-04-07T21:55:29.910+0300][1051.832s] GC(15) CMS: 32522K->32722K(393216K)
[2021-04-07T21:55:29.910+0300][1051.832s] GC(15) Metaspace: 55032K->55032K(1099776K)
[2021-04-07T21:55:29.910+0300][1051.832s] GC(15) Pause Young (Allocation Failure) 135M->53M(490M) 10.561ms
[2021-04-07T21:55:29.910+0300][1051.832s] GC(15) User=0.03s Sys=0.02s Real=0.02s
[2021-04-07T21:55:34.420+0300][1056.342s] GC(16) Pause Young (Allocation Failure)
[2021-04-07T21:55:34.420+0300][1056.342s] GC(16) Using 4 workers of 4 for evacuation
[2021-04-07T21:55:34.446+0300][1056.368s] GC(16) ParNew: 107316K->21824K(109248K)
[2021-04-07T21:55:34.446+0300][1056.368s] GC(16) CMS: 32722K->59149K(393216K)
[2021-04-07T21:55:34.446+0300][1056.368s] GC(16) Metaspace: 56587K->56587K(1101824K)
[2021-04-07T21:55:34.446+0300][1056.368s] GC(16) Pause Young (Allocation Failure) 136M->79M(490M) 25.948ms
[2021-04-07T21:55:34.446+0300][1056.368s] GC(16) User=0.08s Sys=0.00s Real=0.03s
[2021-04-07T21:55:37.291+0300][1059.213s] GC(17) Pause Young (Allocation Failure)
[2021-04-07T21:55:37.291+0300][1059.213s] GC(17) Using 4 workers of 4 for evacuation
[2021-04-07T21:55:37.310+0300][1059.232s] GC(17) ParNew: 109248K->21824K(109248K)
[2021-04-07T21:55:37.310+0300][1059.232s] GC(17) CMS: 59149K->72619K(393216K)
[2021-04-07T21:55:37.310+0300][1059.232s] GC(17) Metaspace: 57363K->57363K(1101824K)
[2021-04-07T21:55:37.310+0300][1059.232s] GC(17) Pause Young (Allocation Failure) 164M->92M(490M) 19.439ms
[2021-04-07T21:55:37.310+0300][1059.232s] GC(17) User=0.06s Sys=0.00s Real=0.02s
[2021-04-07T21:55:38.284+0300][1060.206s] GC(18) Pause Young (Allocation Failure)
[2021-04-07T21:55:38.284+0300][1060.206s] GC(18) Using 4 workers of 4 for evacuation
[2021-04-07T21:55:38.296+0300][1060.219s] GC(18) ParNew: 109248K->21824K(109248K)
[2021-04-07T21:55:38.296+0300][1060.219s] GC(18) CMS: 72619K->79945K(393216K)
[2021-04-07T21:55:38.296+0300][1060.219s] GC(18) Metaspace: 57832K->57832K(1101824K)
[2021-04-07T21:55:38.296+0300][1060.219s] GC(18) Pause Young (Allocation Failure) 177M->99M(490M) 12.961ms
[2021-04-07T21:55:38.297+0300][1060.219s] GC(18) User=0.06s Sys=0.00s Real=0.01s
[2021-04-07T21:55:38.604+0300][1060.527s] GC(19) Pause Young (Allocation Failure)
[2021-04-07T21:55:38.604+0300][1060.527s] GC(19) Using 4 workers of 4 for evacuation
[2021-04-07T21:55:38.612+0300][1060.535s] GC(19) ParNew: 109248K->21824K(109248K)
[2021-04-07T21:55:38.612+0300][1060.535s] GC(19) CMS: 79945K->79945K(393216K)
[2021-04-07T21:55:38.612+0300][1060.535s] GC(19) Metaspace: 58264K->58264K(1101824K)
[2021-04-07T21:55:38.612+0300][1060.535s] GC(19) Pause Young (Allocation Failure) 184M->99M(490M) 8.114ms
[2021-04-07T21:55:38.612+0300][1060.535s] GC(19) User=0.00s Sys=0.00s Real=0.01s
[2021-04-07T21:55:41.696+0300][1063.619s] GC(20) Pause Young (Allocation Failure)
[2021-04-07T21:55:41.696+0300][1063.619s] GC(20) Using 4 workers of 4 for evacuation
[2021-04-07T21:55:41.701+0300][1063.627s] GC(20) ParNew: 109248K->21824K(109248K)
[2021-04-07T21:55:41.701+0300][1063.627s] GC(20) CMS: 79945K->80395K(393216K)
[2021-04-07T21:55:41.701+0300][1063.627s] GC(20) Metaspace: 58875K->58875K(1103872K)
[2021-04-07T21:55:41.701+0300][1063.627s] GC(20) Pause Young (Allocation Failure) 184M->99M(490M) 8.563ms
[2021-04-07T21:55:41.701+0300][1063.627s] GC(20) User=0.00s Sys=0.00s Real=0.00s
[2021-04-07T21:55:41.756+0300][1063.682s] GC(21) Pause Young (Allocation Failure)
[2021-04-07T21:55:41.756+0300][1063.682s] GC(21) Using 4 workers of 4 for evacuation
[2021-04-07T21:55:41.766+0300][1063.690s] GC(21) ParNew: 109226K->21824K(109248K)
[2021-04-07T21:55:41.766+0300][1063.690s] GC(21) CMS: 80395K->80833K(393216K)
[2021-04-07T21:55:41.766+0300][1063.690s] GC(21) Metaspace: 58882K->58882K(1103872K)
[2021-04-07T21:55:41.766+0300][1063.690s] GC(21) Pause Young (Allocation Failure) 185M->100M(490M) 8.226ms
[2021-04-07T21:55:41.766+0300][1063.690s] GC(21) User=0.06s Sys=0.00s Real=0.01s
[2021-04-07T21:55:41.871+0300][1063.795s] GC(22) Pause Young (Allocation Failure)
[2021-04-07T21:55:41.871+0300][1063.796s] GC(22) Using 4 workers of 4 for evacuation
[2021-04-07T21:55:41.881+0300][1063.806s] GC(22) ParNew: 109248K->21824K(109248K)
[2021-04-07T21:55:41.881+0300][1063.806s] GC(22) CMS: 80833K->81107K(393216K)
[2021-04-07T21:55:41.881+0300][1063.806s] GC(22) Metaspace: 58922K->58922K(1103872K)
[2021-04-07T21:55:41.881+0300][1063.806s] GC(22) Pause Young (Allocation Failure) 185M->100M(490M) 10.459ms
[2021-04-07T21:55:41.881+0300][1063.806s] GC(22) User=0.00s Sys=0.00s Real=0.01s
[2021-04-07T21:55:53.493+0300][1075.416s] GC(23) Pause Young (Allocation Failure)
[2021-04-07T21:55:53.493+0300][1075.416s] GC(23) Using 4 workers of 4 for evacuation
[2021-04-07T21:55:53.509+0300][1075.431s] GC(23) ParNew: 109247K->21824K(109248K)
[2021-04-07T21:55:53.509+0300][1075.431s] GC(23) CMS: 81107K->94599K(393216K)
[2021-04-07T21:55:53.509+0300][1075.431s] GC(23) Metaspace: 59194K->59194K(1103872K)
[2021-04-07T21:55:53.509+0300][1075.431s] GC(23) Pause Young (Allocation Failure) 185M->113M(490M) 14.924ms
[2021-04-07T21:55:53.509+0300][1075.431s] GC(23) User=0.05s Sys=0.02s Real=0.02s
[2021-04-07T21:55:55.177+0300][1077.099s] GC(24) Pause Young (Allocation Failure)
[2021-04-07T21:55:55.177+0300][1077.099s] GC(24) Using 4 workers of 4 for evacuation
[2021-04-07T21:55:55.191+0300][1077.113s] GC(24) ParNew: 109248K->21824K(109248K)
[2021-04-07T21:55:55.191+0300][1077.113s] GC(24) CMS: 94599K->104417K(393216K)
[2021-04-07T21:55:55.191+0300][1077.113s] GC(24) Metaspace: 59224K->59224K(1103872K)
[2021-04-07T21:55:55.191+0300][1077.113s] GC(24) Pause Young (Allocation Failure) 199M->123M(490M) 13.841ms
[2021-04-07T21:55:55.191+0300][1077.113s] GC(24) User=0.06s Sys=0.00s Real=0.01s
[2021-04-07T21:55:55.339+0300][1077.261s] GC(25) Pause Young (Allocation Failure)
[2021-04-07T21:55:55.339+0300][1077.261s] GC(25) Using 4 workers of 4 for evacuation
[2021-04-07T21:55:55.347+0300][1077.269s] GC(25) ParNew: 109006K->21824K(109248K)
[2021-04-07T21:55:55.347+0300][1077.269s] GC(25) CMS: 104417K->106256K(393216K)
[2021-04-07T21:55:55.347+0300][1077.269s] GC(25) Metaspace: 59260K->59260K(1103872K)
[2021-04-07T21:55:55.347+0300][1077.269s] GC(25) Pause Young (Allocation Failure) 208M->125M(490M) 8.033ms
[2021-04-07T21:55:55.347+0300][1077.269s] GC(25) User=0.00s Sys=0.00s Real=0.01s
[2021-04-07T21:56:16.435+0300][1098.357s] GC(26) Pause Young (Allocation Failure)
[2021-04-07T21:56:16.435+0300][1098.357s] GC(26) Using 4 workers of 4 for evacuation
[2021-04-07T21:56:16.443+0300][1098.366s] GC(26) ParNew: 108804K->17191K(109248K)
[2021-04-07T21:56:16.443+0300][1098.366s] GC(26) CMS: 106256K->108127K(393216K)
[2021-04-07T21:56:16.443+0300][1098.366s] GC(26) Metaspace: 59440K->59440K(1103872K)
[2021-04-07T21:56:16.443+0300][1098.366s] GC(26) Pause Young (Allocation Failure) 210M->122M(490M) 8.453ms
[2021-04-07T21:56:16.443+0300][1098.366s] GC(26) User=0.00s Sys=0.00s Real=0.01s
[2021-04-07T21:57:35.366+0300][1177.290s] GC(27) Pause Young (Allocation Failure)
[2021-04-07T21:57:35.366+0300][1177.290s] GC(27) Using 4 workers of 4 for evacuation
[2021-04-07T21:57:35.376+0300][1177.300s] GC(27) ParNew: 104615K->21824K(109248K)
[2021-04-07T21:57:35.376+0300][1177.300s] GC(27) CMS: 108127K->108930K(393216K)
[2021-04-07T21:57:35.376+0300][1177.300s] GC(27) Metaspace: 59619K->59619K(1103872K)
[2021-04-07T21:57:35.376+0300][1177.301s] GC(27) Pause Young (Allocation Failure) 207M->127M(490M) 10.660ms
[2021-04-07T21:57:35.376+0300][1177.301s] GC(27) User=0.06s Sys=0.00s Real=0.01s
[2021-04-07T21:58:43.603+0300][1245.529s] GC(28) Pause Young (Allocation Failure)
[2021-04-07T21:58:43.603+0300][1245.529s] GC(28) Using 4 workers of 4 for evacuation
[2021-04-07T21:58:43.618+0300][1245.541s] GC(28) ParNew: 109248K->21824K(109248K)
[2021-04-07T21:58:43.618+0300][1245.541s] GC(28) CMS: 108930K->112561K(393216K)
[2021-04-07T21:58:43.618+0300][1245.541s] GC(28) Metaspace: 59646K->59646K(1103872K)
[2021-04-07T21:58:43.618+0300][1245.541s] GC(28) Pause Young (Allocation Failure) 213M->131M(490M) 11.632ms
[2021-04-07T21:58:43.618+0300][1245.541s] GC(28) User=0.02s Sys=0.00s Real=0.02s
[2021-04-07T21:59:33.687+0300][1295.613s] GC(29) Pause Young (Allocation Failure)
[2021-04-07T21:59:33.687+0300][1295.613s] GC(29) Using 4 workers of 4 for evacuation
[2021-04-07T21:59:33.697+0300][1295.623s] GC(29) ParNew: 109248K->21824K(109248K)
[2021-04-07T21:59:33.697+0300][1295.623s] GC(29) CMS: 112561K->115356K(393216K)
[2021-04-07T21:59:33.697+0300][1295.623s] GC(29) Metaspace: 59666K->59666K(1103872K)
[2021-04-07T21:59:33.697+0300][1295.623s] GC(29) Pause Young (Allocation Failure) 216M->133M(490M) 10.011ms
[2021-04-07T21:59:33.697+0300][1295.623s] GC(29) User=0.06s Sys=0.00s Real=0.01s
[2021-04-07T21:59:33.867+0300][1295.791s] GC(30) Pause Young (Allocation Failure)
[2021-04-07T21:59:33.867+0300][1295.791s] GC(30) Using 4 workers of 4 for evacuation
[2021-04-07T21:59:33.877+0300][1295.803s] GC(30) ParNew: 109248K->21824K(109248K)
[2021-04-07T21:59:33.877+0300][1295.803s] GC(30) CMS: 115356K->119894K(393216K)
[2021-04-07T21:59:33.877+0300][1295.803s] GC(30) Metaspace: 59689K->59689K(1103872K)
[2021-04-07T21:59:33.877+0300][1295.803s] GC(30) Pause Young (Allocation Failure) 219M->138M(490M) 12.632ms
[2021-04-07T21:59:33.877+0300][1295.803s] GC(30) User=0.06s Sys=0.00s Real=0.01s
[2021-04-07T21:59:34.278+0300][1296.200s] GC(31) Pause Young (Allocation Failure)
[2021-04-07T21:59:34.278+0300][1296.200s] GC(31) Using 4 workers of 4 for evacuation
[2021-04-07T21:59:34.285+0300][1296.207s] GC(31) ParNew: 109248K->21506K(109248K)
[2021-04-07T21:59:34.285+0300][1296.208s] GC(31) CMS: 119894K->119894K(393216K)
[2021-04-07T21:59:34.285+0300][1296.208s] GC(31) Metaspace: 59928K->59928K(1103872K)
[2021-04-07T21:59:34.285+0300][1296.208s] GC(31) Pause Young (Allocation Failure) 223M->138M(490M) 7.318ms
[2021-04-07T21:59:34.285+0300][1296.208s] GC(31) User=0.00s Sys=0.00s Real=0.01s
[2021-04-07T21:59:43.845+0300][1305.769s] GC(32) Pause Young (Allocation Failure)
[2021-04-07T21:59:43.845+0300][1305.769s] GC(32) Using 4 workers of 4 for evacuation
[2021-04-07T21:59:43.855+0300][1305.777s] GC(32) ParNew: 108919K->21824K(109248K)
[2021-04-07T21:59:43.855+0300][1305.777s] GC(32) CMS: 119894K->122710K(393216K)
[2021-04-07T21:59:43.855+0300][1305.777s] GC(32) Metaspace: 60320K->60320K(1103872K)
[2021-04-07T21:59:43.855+0300][1305.777s] GC(32) Pause Young (Allocation Failure) 223M->141M(490M) 8.132ms
[2021-04-07T21:59:43.855+0300][1305.777s] GC(32) User=0.06s Sys=0.00s Real=0.01s
[2021-04-07T21:59:43.905+0300][1305.829s] GC(33) Pause Young (Allocation Failure)
[2021-04-07T21:59:43.905+0300][1305.829s] GC(33) Using 4 workers of 4 for evacuation
[2021-04-07T21:59:43.910+0300][1305.836s] GC(33) ParNew: 109224K->20000K(109248K)
[2021-04-07T21:59:43.910+0300][1305.836s] GC(33) CMS: 122710K->122957K(393216K)
[2021-04-07T21:59:43.910+0300][1305.836s] GC(33) Metaspace: 60324K->60324K(1103872K)
[2021-04-07T21:59:43.910+0300][1305.836s] GC(33) Pause Young (Allocation Failure) 226M->139M(490M) 7.193ms
[2021-04-07T21:59:43.910+0300][1305.836s] GC(33) User=0.00s Sys=0.00s Real=0.01s
[2021-04-07T21:59:53.129+0300][1315.055s] GC(34) Pause Young (Allocation Failure)
[2021-04-07T21:59:53.129+0300][1315.055s] GC(34) Using 4 workers of 4 for evacuation
[2021-04-07T21:59:53.139+0300][1315.063s] GC(34) ParNew: 107424K->21824K(109248K)
[2021-04-07T21:59:53.139+0300][1315.063s] GC(34) CMS: 122957K->125609K(393216K)
[2021-04-07T21:59:53.139+0300][1315.063s] GC(34) Metaspace: 60366K->60366K(1103872K)
[2021-04-07T21:59:53.139+0300][1315.063s] GC(34) Pause Young (Allocation Failure) 224M->143M(490M) 8.469ms
[2021-04-07T21:59:53.139+0300][1315.063s] GC(34) User=0.06s Sys=0.00s Real=0.01s
[2021-04-07T21:59:57.187+0300][1319.109s] GC(35) Pause Young (Allocation Failure)
[2021-04-07T21:59:57.187+0300][1319.109s] GC(35) Using 4 workers of 4 for evacuation
[2021-04-07T21:59:57.200+0300][1319.122s] GC(35) ParNew: 109248K->21824K(109248K)
[2021-04-07T21:59:57.200+0300][1319.122s] GC(35) CMS: 125609K->135308K(393216K)
[2021-04-07T21:59:57.200+0300][1319.122s] GC(35) Metaspace: 60506K->60506K(1103872K)
[2021-04-07T21:59:57.200+0300][1319.122s] GC(35) Pause Young (Allocation Failure) 229M->153M(490M) 13.041ms
[2021-04-07T21:59:57.200+0300][1319.122s] GC(35) User=0.06s Sys=0.00s Real=0.01s
[2021-04-07T21:59:59.625+0300][1321.548s] GC(36) Pause Young (Allocation Failure)
[2021-04-07T21:59:59.625+0300][1321.548s] GC(36) Using 4 workers of 4 for evacuation
[2021-04-07T21:59:59.645+0300][1321.567s] GC(36) ParNew: 108831K->21824K(109248K)
[2021-04-07T21:59:59.645+0300][1321.567s] GC(36) CMS: 135308K->141440K(393216K)
[2021-04-07T21:59:59.645+0300][1321.567s] GC(36) Metaspace: 60520K->60520K(1103872K)
[2021-04-07T21:59:59.645+0300][1321.567s] GC(36) Pause Young (Allocation Failure) 238M->159M(490M) 18.522ms
[2021-04-07T21:59:59.645+0300][1321.567s] GC(36) User=0.05s Sys=0.00s Real=0.02s
[2021-04-07T21:59:59.715+0300][1321.641s] GC(37) Pause Young (Allocation Failure)
[2021-04-07T21:59:59.715+0300][1321.641s] GC(37) Using 4 workers of 4 for evacuation
[2021-04-07T21:59:59.725+0300][1321.650s] GC(37) ParNew: 109079K->21824K(109248K)
[2021-04-07T21:59:59.725+0300][1321.650s] GC(37) CMS: 141440K->141504K(393216K)
[2021-04-07T21:59:59.725+0300][1321.650s] GC(37) Metaspace: 60547K->60547K(1103872K)
[2021-04-07T21:59:59.725+0300][1321.650s] GC(37) Pause Young (Allocation Failure) 244M->159M(490M) 9.567ms
[2021-04-07T21:59:59.725+0300][1321.650s] GC(37) User=0.00s Sys=0.00s Real=0.01s
[2021-04-07T22:00:43.507+0300][1365.429s] GC(38) Pause Young (Allocation Failure)
[2021-04-07T22:00:43.507+0300][1365.429s] GC(38) Using 4 workers of 4 for evacuation
[2021-04-07T22:00:43.519+0300][1365.441s] GC(38) ParNew: 109248K->21824K(109248K)
[2021-04-07T22:00:43.519+0300][1365.441s] GC(38) CMS: 141504K->142658K(393216K)
[2021-04-07T22:00:43.519+0300][1365.441s] GC(38) Metaspace: 60640K->60640K(1103872K)
[2021-04-07T22:00:43.519+0300][1365.441s] GC(38) Pause Young (Allocation Failure) 244M->160M(490M) 12.173ms
[2021-04-07T22:00:43.519+0300][1365.441s] GC(38) User=0.06s Sys=0.00s Real=0.01s
[2021-04-07T22:00:43.643+0300][1365.565s] GC(39) Pause Young (Allocation Failure)
[2021-04-07T22:00:43.643+0300][1365.565s] GC(39) Using 4 workers of 4 for evacuation
[2021-04-07T22:00:43.656+0300][1365.578s] GC(39) ParNew: 109248K->21824K(109248K)
[2021-04-07T22:00:43.656+0300][1365.578s] GC(39) CMS: 142658K->148190K(393216K)
[2021-04-07T22:00:43.656+0300][1365.578s] GC(39) Metaspace: 60682K->60682K(1103872K)
[2021-04-07T22:00:43.656+0300][1365.578s] GC(39) Pause Young (Allocation Failure) 246M->166M(490M) 12.605ms
[2021-04-07T22:00:43.656+0300][1365.578s] GC(39) User=0.05s Sys=0.00s Real=0.01s
[2021-04-07T22:00:43.831+0300][1365.753s] GC(40) Pause Young (Allocation Failure)
[2021-04-07T22:00:43.831+0300][1365.753s] GC(40) Using 4 workers of 4 for evacuation
[2021-04-07T22:00:43.839+0300][1365.761s] GC(40) ParNew: 109248K->18370K(109248K)
[2021-04-07T22:00:43.839+0300][1365.761s] GC(40) CMS: 148190K->150334K(393216K)
[2021-04-07T22:00:43.839+0300][1365.761s] GC(40) Metaspace: 60741K->60741K(1103872K)
[2021-04-07T22:00:43.839+0300][1365.762s] GC(40) Pause Young (Allocation Failure) 251M->164M(490M) 8.219ms
[2021-04-07T22:00:43.839+0300][1365.762s] GC(40) User=0.06s Sys=0.00s Real=0.01s
[2021-04-07T22:00:53.601+0300][1375.524s] GC(41) Pause Young (Allocation Failure)
[2021-04-07T22:00:53.601+0300][1375.524s] GC(41) Using 4 workers of 4 for evacuation
[2021-04-07T22:00:53.609+0300][1375.532s] GC(41) ParNew: 105794K->21824K(109248K)
[2021-04-07T22:00:53.609+0300][1375.532s] GC(41) CMS: 150334K->151120K(393216K)
[2021-04-07T22:00:53.609+0300][1375.532s] GC(41) Metaspace: 60807K->60807K(1105920K)
[2021-04-07T22:00:53.609+0300][1375.532s] GC(41) Pause Young (Allocation Failure) 250M->168M(490M) 8.262ms
[2021-04-07T22:00:53.609+0300][1375.532s] GC(41) User=0.06s Sys=0.00s Real=0.01s
[2021-04-07T22:00:58.017+0300][1379.939s] GC(42) Pause Young (Allocation Failure)
[2021-04-07T22:00:58.017+0300][1379.939s] GC(42) Using 4 workers of 4 for evacuation
[2021-04-07T22:00:58.030+0300][1379.952s] GC(42) ParNew: 109248K->21824K(109248K)
[2021-04-07T22:00:58.030+0300][1379.952s] GC(42) CMS: 151120K->163977K(393216K)
[2021-04-07T22:00:58.030+0300][1379.952s] GC(42) Metaspace: 60907K->60907K(1105920K)
[2021-04-07T22:00:58.030+0300][1379.952s] GC(42) Pause Young (Allocation Failure) 254M->181M(490M) 13.560ms
[2021-04-07T22:00:58.030+0300][1379.952s] GC(42) User=0.05s Sys=0.00s Real=0.01s
[2021-04-07T22:00:59.657+0300][1381.579s] GC(43) Pause Young (Allocation Failure)
[2021-04-07T22:00:59.657+0300][1381.579s] GC(43) Using 4 workers of 4 for evacuation
[2021-04-07T22:00:59.669+0300][1381.591s] GC(43) ParNew: 108906K->21824K(109248K)
[2021-04-07T22:00:59.669+0300][1381.592s] GC(43) CMS: 163977K->168377K(393216K)
[2021-04-07T22:00:59.669+0300][1381.592s] GC(43) Metaspace: 60911K->60911K(1105920K)
[2021-04-07T22:00:59.669+0300][1381.592s] GC(43) Pause Young (Allocation Failure) 266M->185M(490M) 12.394ms
[2021-04-07T22:00:59.669+0300][1381.592s] GC(43) User=0.05s Sys=0.00s Real=0.01s
[2021-04-07T22:00:59.875+0300][1381.797s] GC(44) Pause Young (Allocation Failure)
[2021-04-07T22:00:59.875+0300][1381.797s] GC(44) Using 4 workers of 4 for evacuation
[2021-04-07T22:00:59.883+0300][1381.805s] GC(44) ParNew: 109248K->21824K(109248K)
[2021-04-07T22:00:59.883+0300][1381.805s] GC(44) CMS: 168377K->172523K(393216K)
[2021-04-07T22:00:59.883+0300][1381.805s] GC(44) Metaspace: 60913K->60913K(1105920K)
[2021-04-07T22:00:59.883+0300][1381.805s] GC(44) Pause Young (Allocation Failure) 271M->189M(490M) 8.475ms
[2021-04-07T22:00:59.883+0300][1381.805s] GC(44) User=0.03s Sys=0.02s Real=0.01s
[2021-04-07T22:04:28.537+0300][1590.461s] GC(45) Pause Young (Allocation Failure)
[2021-04-07T22:04:28.537+0300][1590.461s] GC(45) Using 4 workers of 4 for evacuation
[2021-04-07T22:04:28.547+0300][1590.470s] GC(45) ParNew: 109248K->21824K(109248K)
[2021-04-07T22:04:28.547+0300][1590.470s] GC(45) CMS: 172523K->173576K(393216K)
[2021-04-07T22:04:28.547+0300][1590.470s] GC(45) Metaspace: 60950K->60950K(1105920K)
[2021-04-07T22:04:28.547+0300][1590.470s] GC(45) Pause Young (Allocation Failure) 275M->190M(490M) 9.039ms
[2021-04-07T22:04:28.547+0300][1590.470s] GC(45) User=0.06s Sys=0.00s Real=0.01s
[2021-04-07T22:04:28.672+0300][1590.596s] GC(46) Pause Young (Allocation Failure)
[2021-04-07T22:04:28.672+0300][1590.596s] GC(46) Using 4 workers of 4 for evacuation
[2021-04-07T22:04:28.682+0300][1590.604s] GC(46) ParNew: 109248K->21824K(109248K)
[2021-04-07T22:04:28.682+0300][1590.604s] GC(46) CMS: 173576K->175332K(393216K)
[2021-04-07T22:04:28.682+0300][1590.604s] GC(46) Metaspace: 60958K->60958K(1105920K)
[2021-04-07T22:04:28.682+0300][1590.604s] GC(46) Pause Young (Allocation Failure) 276M->192M(490M) 8.004ms
[2021-04-07T22:04:28.682+0300][1590.604s] GC(46) User=0.06s Sys=0.00s Real=0.01s
